beam-commits mailing list archives

Site index · List index
Message view « Date » · « Thread »
Top « Date » · « Thread »
From Apache Jenkins Server <jenk...@builds.apache.org>
Subject Build failed in Jenkins: beam_PostCommit_RunnableOnService_GearpumpLocal #148
Date Tue, 13 Sep 2016 01:30:37 GMT
See <https://builds.apache.org/job/beam_PostCommit_RunnableOnService_GearpumpLocal/148/>

------------------------------------------
[...truncated 18895 lines...]
  PAssertTest.testNotEqualTo:295 » Runtime Failed to construct instance from fac...
  PAssertTest.testSerializablePredicate:139 » Runtime Failed to construct instan...
  PAssertTest.testWindowedContainsInAnyOrder:331 » Runtime Failed to construct i...
  PAssertTest.testWindowedIsEqualTo:275 » Runtime Failed to construct instance f...
  PAssertTest.testWindowedSerializablePredicate:166 » Runtime Failed to construc...
  ApproximateUniqueTest.testApproximateUniqueWithSmallInput:70 » Runtime Failed ...
  CombineFnsTest.testComposedCombine:126 » Runtime Failed to construct instance ...
  CombineFnsTest.testComposedCombineNullValues:243 » Runtime Failed to construct...
  CombineFnsTest.testComposedCombineWithContext:181 » Runtime Failed to construc...
  CombineTest.testAccumulatingCombine:491->runTestAccumulatingCombine:245 » Runtime
  CombineTest.testAccumulatingCombineEmpty:498->runTestAccumulatingCombine:245 » Runtime
  CombineTest.testBasicCombine:230->runTestBasicCombine:208 » Runtime Failed to ...
  CombineTest.testBasicCombineEmpty:239->runTestBasicCombine:208 » Runtime Faile...
  CombineTest.testCombineGloballyAsSingletonView:650 » Runtime Failed to constru...
  CombineTest.testCombinePerKeyPrimitiveDisplayData:727 » Runtime Failed to cons...
  CombineTest.testCombinePerKeyWithHotKeyFanoutPrimitiveDisplayData:744 » Runtime
  CombineTest.testFixedWindowsCombine:265 » Runtime Failed to construct instance...
  CombineTest.testFixedWindowsCombineWithContext:292 » Runtime Failed to constru...
  CombineTest.testGlobalCombineWithDefaultsAndTriggers:380 » Runtime Failed to c...
  CombineTest.testHotKeyCombining:535 » Runtime Failed to construct instance fro...
  CombineTest.testHotKeyCombiningWithAccumulationMode:570 » Runtime Failed to co...
  CombineTest.testSessionsCombine:407 » Runtime Failed to construct instance fro...
  CombineTest.testSessionsCombineWithContext:433 » Runtime Failed to construct i...
  CombineTest.testSimpleCombine:177->runTestSimpleCombine:126 » Runtime Failed t...
  CombineTest.testSimpleCombineEmpty:201->runTestSimpleCombine:126 » Runtime Fai...
  CombineTest.testSimpleCombineWithContext:185->runTestSimpleCombineWithContext:147 »
Runtime
  CombineTest.testSimpleCombineWithContextEmpty:194->runTestSimpleCombineWithContext:147
» Runtime
  CombineTest.testSlidingWindowsCombineWithContext:330 » Runtime Failed to const...
  CombineTest.testWindowedCombineEmpty:476 » Runtime Failed to construct instanc...
  CountTest.testCountGloballyBasic:88 » Runtime Failed to construct instance fro...
  CountTest.testCountGloballyEmpty:103 » Runtime Failed to construct instance fr...
  CountTest.testCountPerElementBasic:52 » Runtime Failed to construct instance f...
  CountTest.testCountPerElementEmpty:74 » Runtime Failed to construct instance f...
  CreateTest.testCreate:83 » Runtime Failed to construct instance from factory m...
  CreateTest.testCreateEmpty:96 » Runtime Failed to construct instance from fact...
  CreateTest.testCreateTimestamped:238 » Runtime Failed to construct instance fr...
  CreateTest.testCreateTimestampedEmpty:257 » Runtime Failed to construct instan...
  CreateTest.testCreateWithKVVoidType:307 » Runtime Failed to construct instance...
  CreateTest.testCreateWithNullsAndValues:140 » Runtime Failed to construct inst...
  CreateTest.testCreateWithUnserializableElements:219 » Runtime Failed to constr...
  CreateTest.testCreateWithVoidType:298 » Runtime Failed to construct instance f...
  FilterTest.testFilterByPredicate:89 » Runtime Failed to construct instance fro...
  FilterTest.testFilterGreaterThan:115 » Runtime Failed to construct instance fr...
  FilterTest.testFilterGreaterThanEq:141 » Runtime Failed to construct instance ...
  FilterTest.testFilterLessThan:102 » Runtime Failed to construct instance from ...
  FilterTest.testFilterLessThanEq:128 » Runtime Failed to construct instance fro...
  FilterTest.testIdentityFilterByPredicate:63 » Runtime Failed to construct inst...
  FilterTest.testNoFilterByPredicate:76 » Runtime Failed to construct instance f...
  FlattenTest.testEmptyFlattenAsSideInput:121 » Runtime Failed to construct inst...
  FlattenTest.testFlattenIterables:178 » Runtime Failed to construct instance fr...
  FlattenTest.testFlattenIterablesCollections:229 » Runtime Failed to construct ...
  FlattenTest.testFlattenIterablesEmpty:247 » Runtime Failed to construct instan...
  FlattenTest.testFlattenIterablesLists:196 » Runtime Failed to construct instan...
  FlattenTest.testFlattenIterablesSets:211 » Runtime Failed to construct instanc...
  FlattenTest.testFlattenPCollectionList:75 » Runtime Failed to construct instan...
  FlattenTest.testFlattenPCollectionListEmpty:108 » Runtime Failed to construct ...
  FlattenTest.testFlattenPCollectionListEmptyThenParDo:147 » Runtime Failed to c...
  FlattenTest.testFlattenPCollectionListThenParDo:91 » Runtime Failed to constru...
  GroupByKeyTest.testGroupByKey:98 » Runtime Failed to construct instance from f...
  GroupByKeyTest.testGroupByKeyAndWindows:140 » Runtime Failed to construct inst...
  GroupByKeyTest.testGroupByKeyEmpty:177 » Runtime Failed to construct instance ...
  GroupByKeyTest.testGroupByKeyWithBadEqualsHashCode:411 » Runtime Failed to con...
  GroupByKeyTest.testOutputTimeFnEarliest:334 » Runtime Failed to construct inst...
  GroupByKeyTest.testOutputTimeFnLatest:356 » Runtime Failed to construct instan...
  KeysTest.testKeys:56 » Runtime Failed to construct instance from factory metho...
  KeysTest.testKeysEmpty:72 » Runtime Failed to construct instance from factory ...
  KvSwapTest.testKvSwap:56 » Runtime Failed to construct instance from factory m...
  KvSwapTest.testKvSwapEmpty:78 » Runtime Failed to construct instance from fact...
  MapElementsTest.testPrimitiveDisplayData:265 » Runtime Failed to construct ins...
  ParDoLifecycleTest.testFnCallSequence:130 » Runtime Failed to construct instan...
  ParDoLifecycleTest.testFnCallSequenceMulti:142 » Runtime Failed to construct i...
  ParDoLifecycleTest.testOldFnCallSequence:49 » Runtime Failed to construct inst...
  ParDoLifecycleTest.testOldFnCallSequenceMulti:61 » Runtime Failed to construct...
  ParDoTest.testMultiOutputParDoWithSideInputs:678 » Runtime Failed to construct...
  ParDoTest.testMultiOutputParDoWithSideInputsIsCumulative:716 » Runtime Failed ...
  ParDoTest.testParDo:348 » Runtime Failed to construct instance from factory me...
  ParDoTest.testParDo2:365 » Runtime Failed to construct instance from factory m...
  ParDoTest.testParDoEmpty:382 » Runtime Failed to construct instance from facto...
  ParDoTest.testParDoEmptyOutputs:400 » Runtime Failed to construct instance fro...
  ParDoTest.testParDoEmptyWithSideOutputs:459 » Runtime Failed to construct inst...
  ParDoTest.testParDoInCustomTransform:885 » Runtime Failed to construct instanc...
  ParDoTest.testParDoWithEmptySideOutputs:500 » Runtime Failed to construct inst...
  ParDoTest.testParDoWithOnlySideOutputs:528 » Runtime Failed to construct insta...
  ParDoTest.testParDoWithSideInputs:612 » Runtime Failed to construct instance f...
  ParDoTest.testParDoWithSideInputsIsCumulative:644 » Runtime Failed to construc...
  ParDoTest.testParDoWithSideOutputs:416 » Runtime Failed to construct instance ...
  ParDoTest.testWindowingInStartAndFinishBundle:1355 » Runtime Failed to constru...
  PartitionTest.testEvenOddPartition:69 » Runtime Failed to construct instance f...
  RemoveDuplicatesTest.testRemoveDuplicates:56 » Runtime Failed to construct ins...
  RemoveDuplicatesTest.testRemoveDuplicatesEmpty:75 » Runtime Failed to construc...
  RemoveDuplicatesTest.testRemoveDuplicatesWithRepresentativeValue:118 » Runtime
  SampleTest.testPickAny:238->runPickAnyTest:220 » Runtime Failed to construct i...
  SampleTest.testPickAnyWhenEmpty:255->runPickAnyTest:220 » Runtime Failed to co...
  SampleTest.testSample:108 » Runtime Failed to construct instance from factory ...
  SampleTest.testSampleEmpty:123 » Runtime Failed to construct instance from fac...
  SampleTest.testSampleInsufficientElements:153 » Runtime Failed to construct in...
  SampleTest.testSampleMultiplicity:177 » Runtime Failed to construct instance f...
  SampleTest.testSampleZero:138 » Runtime Failed to construct instance from fact...
  ValuesTest.testValues:58 » Runtime Failed to construct instance from factory m...
  ValuesTest.testValuesEmpty:75 » Runtime Failed to construct instance from fact...
  ViewTest.testCombinedMapSideInput:1148 » Runtime Failed to construct instance ...
  ViewTest.testEmptyIterableSideInput:404 » Runtime Failed to construct instance...
  ViewTest.testEmptyListSideInput:265 » Runtime Failed to construct instance fro...
  ViewTest.testEmptyMapSideInput:1007 » Runtime Failed to construct instance fro...
  ViewTest.testEmptyMapSideInputWithNonDeterministicKeyCoder:1036 » Runtime Fail...
  ViewTest.testEmptyMultimapSideInput:694 » Runtime Failed to construct instance...
  ViewTest.testEmptyMultimapSideInputWithNonDeterministicKeyCoder:723 » Runtime ...
  ViewTest.testIterableSideInput:338 » Runtime Failed to construct instance from...
  ViewTest.testIterableSideInputIsImmutable:430 » Runtime Failed to construct in...
  ViewTest.testListSideInput:197 » Runtime Failed to construct instance from fac...
  ViewTest.testListSideInputIsImmutable:292 » Runtime Failed to construct instan...
  ViewTest.testMapAsEntrySetSideInput:828 » Runtime Failed to construct instance...
  ViewTest.testMapSideInput:801 » Runtime Failed to construct instance from fact...
  ViewTest.testMapSideInputIsImmutable:1101 » Runtime Failed to construct instan...
  ViewTest.testMapSideInputWithNonDeterministicKeyCoder:858 » Runtime Failed to ...
  ViewTest.testMultimapAsEntrySetSideInput:490 » Runtime Failed to construct ins...
  ViewTest.testMultimapSideInput:462 » Runtime Failed to construct instance from...
  ViewTest.testMultimapSideInputIsImmutable:753 » Runtime Failed to construct in...
  ViewTest.testMultimapSideInputWithNonDeterministicKeyCoder:542 » Runtime Faile...
  ViewTest.testSideInputWithNestedIterables:1302 » Runtime Failed to construct i...
  ViewTest.testSideInputWithNullDefault:1272 » Runtime Failed to construct insta...
  ViewTest.testSingletonSideInput:92 » Runtime Failed to construct instance from...
  ViewTest.testWindowedIterableSideInput:364 » Runtime Failed to construct insta...
  ViewTest.testWindowedListSideInput:224 » Runtime Failed to construct instance ...
  ViewTest.testWindowedMapAsEntrySetSideInput:925 » Runtime Failed to construct ...
  ViewTest.testWindowedMapSideInput:887 » Runtime Failed to construct instance f...
  ViewTest.testWindowedMapSideInputWithNonDeterministicKeyCoder:967 » Runtime Fa...
  ViewTest.testWindowedMultimapAsEntrySetSideInput:611 » Runtime Failed to const...
  ViewTest.testWindowedMultimapSideInput:572 » Runtime Failed to construct insta...
  ViewTest.testWindowedMultimapSideInputWithNonDeterministicKeyCoder:654 » Runtime
  ViewTest.testWindowedSideInputFixedToFixed:1175 » Runtime Failed to construct ...
  ViewTest.testWindowedSideInputFixedToFixedWithDefault:1241 » Runtime Failed to...
  ViewTest.testWindowedSideInputFixedToGlobal:1208 » Runtime Failed to construct...
  ViewTest.testWindowedSingletonSideInput:115 » Runtime Failed to construct inst...
  WithTimestampsTest.withTimestampsBackwardsInTimeAndWithAllowedTimestampSkewShouldSucceed:123
» Runtime
  WithTimestampsTest.withTimestampsShouldApplyTimestamps:50 » Runtime Failed to ...
  WithTimestampsTest.withTimestampsWithNullFnShouldThrowOnConstruction:200 » Runtime
  CoGroupByKeyTest.testCoGroupByKey:267 » Runtime Failed to construct instance f...
  CoGroupByKeyTest.testCoGroupByKeyGetOnly:127 » Runtime Failed to construct ins...
  CoGroupByKeyTest.testCoGroupByKeyHandleResults:459 » Runtime Failed to constru...
  CoGroupByKeyTest.testCoGroupByKeyWithWindowing:489 » Runtime Failed to constru...
  WindowTest.testOutputTimeFnDefault:188 » Runtime Failed to construct instance ...
  WindowTest.testOutputTimeFnEndOfWindow:222 » Runtime Failed to construct insta...
  WindowingTest.testMergingWindowing:143 » Runtime Failed to construct instance ...
  WindowingTest.testNonPartitioningWindowing:117 » Runtime Failed to construct i...
  WindowingTest.testPartitioningWindowing:91 » Runtime Failed to construct insta...
  WindowingTest.testWindowPreservation:165 » Runtime Failed to construct instanc...
  ReshuffleTest.testJustReshuffle:71 » Runtime Failed to construct instance from...
  ReshuffleTest.testReshuffleAfterFixedWindows:164 » Runtime Failed to construct...
  ReshuffleTest.testReshuffleAfterFixedWindowsAndGroupByKey:116 » Runtime Failed...
  ReshuffleTest.testReshuffleAfterSessionsAndGroupByKey:92 » Runtime Failed to c...
  ReshuffleTest.testReshuffleAfterSlidingWindows:188 » Runtime Failed to constru...
  ReshuffleTest.testReshuffleAfterSlidingWindowsAndGroupByKey:140 » Runtime Fail...
  PCollectionTupleTest.testComposePCollectionTuple:64 » Runtime Failed to constr...

Tests run: 181, Failures: 0, Errors: 178, Skipped: 3

[INFO] ------------------------------------------------------------------------
[INFO] Reactor Summary:
[INFO] 
[INFO] Apache Beam :: Parent .............................. SUCCESS [  4.216 s]
[INFO] Apache Beam :: SDKs ................................ SUCCESS [  0.443 s]
[INFO] Apache Beam :: SDKs :: Java ........................ SUCCESS [  0.400 s]
[INFO] Apache Beam :: SDKs :: Java :: Build Tools ......... SUCCESS [  1.956 s]
[INFO] Apache Beam :: SDKs :: Java :: Core ................ SUCCESS [02:14 min]
[INFO] Apache Beam :: Runners ............................. SUCCESS [  0.498 s]
[INFO] Apache Beam :: Runners :: Core Java ................ SUCCESS [ 31.323 s]
[INFO] Apache Beam :: Runners :: Gearpump ................. FAILURE [ 21.023 s]
[INFO] ------------------------------------------------------------------------
[INFO] BUILD FAILURE
[INFO] ------------------------------------------------------------------------
[INFO] Total time: 03:32 min
[INFO] Finished at: 2016-09-13T01:30:32+00:00
[INFO] Final Memory: 331M/1101M
[INFO] ------------------------------------------------------------------------
Waiting for Jenkins to finish collecting data
[ERROR] Failed to execute goal org.apache.maven.plugins:maven-surefire-plugin:2.18.1:test
(runnable-on-service-tests) on project beam-runners-gearpump: There are test failures.
[ERROR] 
[ERROR] Please refer to <https://builds.apache.org/job/beam_PostCommit_RunnableOnService_GearpumpLocal/ws/runners/gearpump/target/surefire-reports>
for the individual test results.
[ERROR] -> [Help 1]
org.apache.maven.lifecycle.LifecycleExecutionException: Failed to execute goal org.apache.maven.plugins:maven-surefire-plugin:2.18.1:test
(runnable-on-service-tests) on project beam-runners-gearpump: There are test failures.

Please refer to <https://builds.apache.org/job/beam_PostCommit_RunnableOnService_GearpumpLocal/ws/runners/gearpump/target/surefire-reports>
for the individual test results.
	at org.apache.maven.lifecycle.internal.MojoExecutor.execute(MojoExecutor.java:212)
	at org.apache.maven.lifecycle.internal.MojoExecutor.execute(MojoExecutor.java:153)
	at org.apache.maven.lifecycle.internal.MojoExecutor.execute(MojoExecutor.java:145)
	at org.apache.maven.lifecycle.internal.LifecycleModuleBuilder.buildProject(LifecycleModuleBuilder.java:116)
	at org.apache.maven.lifecycle.internal.LifecycleModuleBuilder.buildProject(LifecycleModuleBuilder.java:80)
	at org.apache.maven.lifecycle.internal.builder.singlethreaded.SingleThreadedBuilder.build(SingleThreadedBuilder.java:51)
	at org.apache.maven.lifecycle.internal.LifecycleStarter.execute(LifecycleStarter.java:128)
	at org.apache.maven.DefaultMaven.doExecute(DefaultMaven.java:307)
	at org.apache.maven.DefaultMaven.doExecute(DefaultMaven.java:193)
	at org.apache.maven.DefaultMaven.execute(DefaultMaven.java:106)
	at org.jvnet.hudson.maven3.launcher.Maven32Launcher.main(Maven32Launcher.java:132)
	at sun.reflect.NativeMethodAccessorImpl.invoke0(Native Method)
	at sun.reflect.NativeMethodAccessorImpl.invoke(NativeMethodAccessorImpl.java:62)
	at sun.reflect.DelegatingMethodAccessorImpl.invoke(DelegatingMethodAccessorImpl.java:43)
	at java.lang.reflect.Method.invoke(Method.java:498)
	at org.codehaus.plexus.classworlds.launcher.Launcher.launchStandard(Launcher.java:330)
	at org.codehaus.plexus.classworlds.launcher.Launcher.launch(Launcher.java:238)
	at jenkins.maven3.agent.Maven32Main.launch(Maven32Main.java:186)
	at sun.reflect.NativeMethodAccessorImpl.invoke0(Native Method)
	at sun.reflect.NativeMethodAccessorImpl.invoke(NativeMethodAccessorImpl.java:62)
	at sun.reflect.DelegatingMethodAccessorImpl.invoke(DelegatingMethodAccessorImpl.java:43)
	at java.lang.reflect.Method.invoke(Method.java:498)
	at hudson.maven.Maven3Builder.call(Maven3Builder.java:136)
	at hudson.maven.Maven3Builder.call(Maven3Builder.java:71)
	at hudson.remoting.UserRequest.perform(UserRequest.java:153)
	at hudson.remoting.UserRequest.perform(UserRequest.java:50)
	at hudson.remoting.Request$2.run(Request.java:332)
	at hudson.remoting.InterceptingExecutorService$1.call(InterceptingExecutorService.java:68)
	at java.util.concurrent.FutureTask.run(FutureTask.java:266)
	at java.util.concurrent.ThreadPoolExecutor.runWorker(ThreadPoolExecutor.java:1142)
	at java.util.concurrent.ThreadPoolExecutor$Worker.run(ThreadPoolExecutor.java:617)
	at java.lang.Thread.run(Thread.java:745)
Caused by: org.apache.maven.plugin.MojoFailureException: There are test failures.

Please refer to <https://builds.apache.org/job/beam_PostCommit_RunnableOnService_GearpumpLocal/ws/runners/gearpump/target/surefire-reports>
for the individual test results.
	at org.apache.maven.plugin.surefire.SurefireHelper.reportExecution(SurefireHelper.java:82)
	at org.apache.maven.plugin.surefire.SurefirePlugin.handleSummary(SurefirePlugin.java:254)
	at org.apache.maven.plugin.surefire.AbstractSurefireMojo.executeAfterPreconditionsChecked(AbstractSurefireMojo.java:854)
	at org.apache.maven.plugin.surefire.AbstractSurefireMojo.execute(AbstractSurefireMojo.java:722)
	at org.apache.maven.plugin.DefaultBuildPluginManager.executeMojo(DefaultBuildPluginManager.java:134)
	at org.apache.maven.lifecycle.internal.MojoExecutor.execute(MojoExecutor.java:208)
	... 31 more
[ERROR] 
[ERROR] Re-run Maven using the -X switch to enable full debug logging.
[ERROR] 
[ERROR] For more information about the errors and possible solutions, please read the following
articles:
[ERROR] [Help 1] http://cwiki.apache.org/confluence/display/MAVEN/MojoFailureException
[ERROR] 
[ERROR] After correcting the problems, you can resume the build with the command
[ERROR]   mvn <goals> -rf :beam-runners-gearpump
[JENKINS] Archiving <https://builds.apache.org/job/beam_PostCommit_RunnableOnService_GearpumpLocal/ws/sdks/java/build-tools/pom.xml>
to org.apache.beam/beam-sdks-java-build-tools/0.3.0-incubating-SNAPSHOT/beam-sdks-java-build-tools-0.3.0-incubating-SNAPSHOT.pom
[JENKINS] Archiving <https://builds.apache.org/job/beam_PostCommit_RunnableOnService_GearpumpLocal/ws/sdks/java/build-tools/target/beam-sdks-java-build-tools-0.3.0-incubating-SNAPSHOT.jar>
to org.apache.beam/beam-sdks-java-build-tools/0.3.0-incubating-SNAPSHOT/beam-sdks-java-build-tools-0.3.0-incubating-SNAPSHOT.jar
[JENKINS] Archiving <https://builds.apache.org/job/beam_PostCommit_RunnableOnService_GearpumpLocal/ws/sdks/java/build-tools/target/beam-sdks-java-build-tools-0.3.0-incubating-SNAPSHOT-tests.jar>
to org.apache.beam/beam-sdks-java-build-tools/0.3.0-incubating-SNAPSHOT/beam-sdks-java-build-tools-0.3.0-incubating-SNAPSHOT-tests.jar
[JENKINS] Archiving <https://builds.apache.org/job/beam_PostCommit_RunnableOnService_GearpumpLocal/ws/sdks/java/core/dependency-reduced-pom.xml>
to org.apache.beam/beam-sdks-java-core/0.3.0-incubating-SNAPSHOT/beam-sdks-java-core-0.3.0-incubating-SNAPSHOT.pom
[JENKINS] Archiving <https://builds.apache.org/job/beam_PostCommit_RunnableOnService_GearpumpLocal/ws/sdks/java/core/target/beam-sdks-java-core-0.3.0-incubating-SNAPSHOT.jar>
to org.apache.beam/beam-sdks-java-core/0.3.0-incubating-SNAPSHOT/beam-sdks-java-core-0.3.0-incubating-SNAPSHOT.jar
[JENKINS] Archiving <https://builds.apache.org/job/beam_PostCommit_RunnableOnService_GearpumpLocal/ws/sdks/java/core/target/beam-sdks-java-core-0.3.0-incubating-SNAPSHOT-tests.jar>
to org.apache.beam/beam-sdks-java-core/0.3.0-incubating-SNAPSHOT/beam-sdks-java-core-0.3.0-incubating-SNAPSHOT-tests.jar
[JENKINS] Archiving <https://builds.apache.org/job/beam_PostCommit_RunnableOnService_GearpumpLocal/ws/runners/core-java/dependency-reduced-pom.xml>
to org.apache.beam/beam-runners-core-java/0.3.0-incubating-SNAPSHOT/beam-runners-core-java-0.3.0-incubating-SNAPSHOT.pom
[JENKINS] Archiving <https://builds.apache.org/job/beam_PostCommit_RunnableOnService_GearpumpLocal/ws/runners/core-java/target/beam-runners-core-java-0.3.0-incubating-SNAPSHOT.jar>
to org.apache.beam/beam-runners-core-java/0.3.0-incubating-SNAPSHOT/beam-runners-core-java-0.3.0-incubating-SNAPSHOT.jar
[JENKINS] Archiving <https://builds.apache.org/job/beam_PostCommit_RunnableOnService_GearpumpLocal/ws/runners/core-java/target/beam-runners-core-java-0.3.0-incubating-SNAPSHOT-tests.jar>
to org.apache.beam/beam-runners-core-java/0.3.0-incubating-SNAPSHOT/beam-runners-core-java-0.3.0-incubating-SNAPSHOT-tests.jar
[JENKINS] Archiving <https://builds.apache.org/job/beam_PostCommit_RunnableOnService_GearpumpLocal/ws/runners/core-java/target/beam-runners-core-java-0.3.0-incubating-SNAPSHOT-javadoc.jar>
to org.apache.beam/beam-runners-core-java/0.3.0-incubating-SNAPSHOT/beam-runners-core-java-0.3.0-incubating-SNAPSHOT-javadoc.jar
[JENKINS] Archiving <https://builds.apache.org/job/beam_PostCommit_RunnableOnService_GearpumpLocal/ws/sdks/java/pom.xml>
to org.apache.beam/beam-sdks-java-parent/0.3.0-incubating-SNAPSHOT/beam-sdks-java-parent-0.3.0-incubating-SNAPSHOT.pom
[JENKINS] Archiving <https://builds.apache.org/job/beam_PostCommit_RunnableOnService_GearpumpLocal/ws/pom.xml>
to org.apache.beam/beam-parent/0.3.0-incubating-SNAPSHOT/beam-parent-0.3.0-incubating-SNAPSHOT.pom
Compressed 36.73 KB of artifacts by 87.1% relative to #147
[JENKINS] Archiving <https://builds.apache.org/job/beam_PostCommit_RunnableOnService_GearpumpLocal/ws/sdks/pom.xml>
to org.apache.beam/beam-sdks-parent/0.3.0-incubating-SNAPSHOT/beam-sdks-parent-0.3.0-incubating-SNAPSHOT.pom
[JENKINS] Archiving <https://builds.apache.org/job/beam_PostCommit_RunnableOnService_GearpumpLocal/ws/runners/pom.xml>
to org.apache.beam/beam-runners-parent/0.3.0-incubating-SNAPSHOT/beam-runners-parent-0.3.0-incubating-SNAPSHOT.pom
channel stopped

Mime
View raw message