beam-commits mailing list archives

Site index · List index
Message view « Date » · « Thread »
Top « Date » · « Thread »
From Apache Jenkins Server <jenk...@builds.apache.org>
Subject Build failed in Jenkins: beam_PostCommit_MavenVerify #1400
Date Tue, 27 Sep 2016 00:14:45 GMT
See <https://builds.apache.org/job/beam_PostCommit_MavenVerify/1400/>

------------------------------------------
[...truncated 6510 lines...]
[INFO] Downloading: https://repo.maven.apache.org/maven2/org/apache/httpcomponents/httpcomponents-client/4.3.6/httpcomponents-client-4.3.6.pom
[INFO] Downloaded: https://repo.maven.apache.org/maven2/org/apache/httpcomponents/httpcomponents-client/4.3.6/httpcomponents-client-4.3.6.pom
(16 KB at 622.9 KB/sec)
[INFO] Downloading: https://repo.maven.apache.org/maven2/org/apache/httpcomponents/httpcore/4.3.3/httpcore-4.3.3.pom
[INFO] Downloaded: https://repo.maven.apache.org/maven2/org/apache/httpcomponents/httpcore/4.3.3/httpcore-4.3.3.pom
(5 KB at 144.8 KB/sec)
[INFO] Downloading: https://repo.maven.apache.org/maven2/org/apache/httpcomponents/httpcomponents-core/4.3.3/httpcomponents-core-4.3.3.pom
[INFO] Downloaded: https://repo.maven.apache.org/maven2/org/apache/httpcomponents/httpcomponents-core/4.3.3/httpcomponents-core-4.3.3.pom
(13 KB at 515.2 KB/sec)
[INFO] Downloading: https://repo.maven.apache.org/maven2/com/amazonaws/aws-java-sdk-dynamodb/1.10.20/aws-java-sdk-dynamodb-1.10.20.pom
[INFO] Downloaded: https://repo.maven.apache.org/maven2/com/amazonaws/aws-java-sdk-dynamodb/1.10.20/aws-java-sdk-dynamodb-1.10.20.pom
(4 KB at 135.9 KB/sec)
[INFO] Downloading: https://repo.maven.apache.org/maven2/com/amazonaws/aws-java-sdk-s3/1.10.20/aws-java-sdk-s3-1.10.20.pom
[INFO] Downloaded: https://repo.maven.apache.org/maven2/com/amazonaws/aws-java-sdk-s3/1.10.20/aws-java-sdk-s3-1.10.20.pom
(4 KB at 126.1 KB/sec)
[INFO] Downloading: https://repo.maven.apache.org/maven2/com/amazonaws/aws-java-sdk-kms/1.10.20/aws-java-sdk-kms-1.10.20.pom
[INFO] Downloaded: https://repo.maven.apache.org/maven2/com/amazonaws/aws-java-sdk-kms/1.10.20/aws-java-sdk-kms-1.10.20.pom
(4 KB at 123.3 KB/sec)
[INFO] Downloading: https://repo.maven.apache.org/maven2/com/amazonaws/aws-java-sdk-kinesis/1.10.20/aws-java-sdk-kinesis-1.10.20.pom
[INFO] Downloaded: https://repo.maven.apache.org/maven2/com/amazonaws/aws-java-sdk-kinesis/1.10.20/aws-java-sdk-kinesis-1.10.20.pom
(4 KB at 124.0 KB/sec)
[INFO] Downloading: https://repo.maven.apache.org/maven2/com/amazonaws/aws-java-sdk-cloudwatch/1.10.20/aws-java-sdk-cloudwatch-1.10.20.pom
[INFO] Downloaded: https://repo.maven.apache.org/maven2/com/amazonaws/aws-java-sdk-cloudwatch/1.10.20/aws-java-sdk-cloudwatch-1.10.20.pom
(4 KB at 115.4 KB/sec)
[INFO] Downloading: https://repo.maven.apache.org/maven2/org/assertj/assertj-core/2.5.0/assertj-core-2.5.0.pom
[INFO] Downloaded: https://repo.maven.apache.org/maven2/org/assertj/assertj-core/2.5.0/assertj-core-2.5.0.pom
(7 KB at 265.4 KB/sec)
[INFO] Downloading: https://repo.maven.apache.org/maven2/org/assertj/assertj-parent-pom/2.1.4/assertj-parent-pom-2.1.4.pom
[INFO] Downloaded: https://repo.maven.apache.org/maven2/org/assertj/assertj-parent-pom/2.1.4/assertj-parent-pom-2.1.4.pom
(15 KB at 590.1 KB/sec)
[INFO] Downloading: https://repo.maven.apache.org/maven2/com/amazonaws/aws-java-sdk-kinesis/1.11.18/aws-java-sdk-kinesis-1.11.18.jar
[INFO] Downloading: https://repo.maven.apache.org/maven2/com/amazonaws/amazon-kinesis-client/1.6.1/amazon-kinesis-client-1.6.1.jar
[INFO] Downloading: https://repo.maven.apache.org/maven2/com/amazonaws/aws-java-sdk-dynamodb/1.10.20/aws-java-sdk-dynamodb-1.10.20.jar
[INFO] Downloading: https://repo.maven.apache.org/maven2/com/amazonaws/aws-java-sdk-kms/1.10.20/aws-java-sdk-kms-1.10.20.jar
[INFO] Downloading: https://repo.maven.apache.org/maven2/com/amazonaws/aws-java-sdk-s3/1.10.20/aws-java-sdk-s3-1.10.20.jar
[INFO] Downloaded: https://repo.maven.apache.org/maven2/com/amazonaws/amazon-kinesis-client/1.6.1/amazon-kinesis-client-1.6.1.jar
(256 KB at 5543.9 KB/sec)
[INFO] Downloading: https://repo.maven.apache.org/maven2/com/amazonaws/aws-java-sdk-cloudwatch/1.10.20/aws-java-sdk-cloudwatch-1.10.20.jar
[INFO] Downloaded: https://repo.maven.apache.org/maven2/com/amazonaws/aws-java-sdk-kinesis/1.11.18/aws-java-sdk-kinesis-1.11.18.jar
(522 KB at 9657.0 KB/sec)
[INFO] Downloading: https://repo.maven.apache.org/maven2/com/amazonaws/aws-java-sdk-core/1.11.18/aws-java-sdk-core-1.11.18.jar
[INFO] Downloaded: https://repo.maven.apache.org/maven2/com/amazonaws/aws-java-sdk-kms/1.10.20/aws-java-sdk-kms-1.10.20.jar
(253 KB at 4764.5 KB/sec)
[INFO] Downloading: https://repo.maven.apache.org/maven2/org/apache/httpcomponents/httpclient/4.5.2/httpclient-4.5.2.jar
[INFO] Downloaded: https://repo.maven.apache.org/maven2/com/amazonaws/aws-java-sdk-s3/1.10.20/aws-java-sdk-s3-1.10.20.jar
(582 KB at 10032.7 KB/sec)
[INFO] Downloading: https://repo.maven.apache.org/maven2/org/apache/httpcomponents/httpcore/4.4.4/httpcore-4.4.4.jar
[INFO] Downloaded: https://repo.maven.apache.org/maven2/com/amazonaws/aws-java-sdk-cloudwatch/1.10.20/aws-java-sdk-cloudwatch-1.10.20.jar
(144 KB at 1918.0 KB/sec)
[INFO] Downloading: https://repo.maven.apache.org/maven2/com/fasterxml/jackson/dataformat/jackson-dataformat-cbor/2.6.6/jackson-dataformat-cbor-2.6.6.jar
[INFO] Downloaded: https://repo.maven.apache.org/maven2/com/amazonaws/aws-java-sdk-dynamodb/1.10.20/aws-java-sdk-dynamodb-1.10.20.jar
(1121 KB at 14363.0 KB/sec)
[INFO] Downloading: https://repo.maven.apache.org/maven2/org/assertj/assertj-core/2.5.0/assertj-core-2.5.0.jar
[INFO] Downloaded: https://repo.maven.apache.org/maven2/org/apache/httpcomponents/httpcore/4.4.4/httpcore-4.4.4.jar
(320 KB at 3159.1 KB/sec)
[INFO] Downloaded: https://repo.maven.apache.org/maven2/com/amazonaws/aws-java-sdk-core/1.11.18/aws-java-sdk-core-1.11.18.jar
(633 KB at 6139.3 KB/sec)
[INFO] Downloaded: https://repo.maven.apache.org/maven2/com/fasterxml/jackson/dataformat/jackson-dataformat-cbor/2.6.6/jackson-dataformat-cbor-2.6.6.jar
(48 KB at 455.1 KB/sec)
[INFO] Downloaded: https://repo.maven.apache.org/maven2/org/apache/httpcomponents/httpclient/4.5.2/httpclient-4.5.2.jar
(720 KB at 6851.4 KB/sec)
[INFO] Downloaded: https://repo.maven.apache.org/maven2/org/assertj/assertj-core/2.5.0/assertj-core-2.5.0.jar
(913 KB at 6759.6 KB/sec)
[INFO] 
[INFO] --- maven-clean-plugin:2.5:clean (default-clean) @ beam-sdks-java-io-kinesis ---
[INFO] Deleting <https://builds.apache.org/job/beam_PostCommit_MavenVerify/ws/sdks/java/io/kinesis/target>
[INFO] 
[INFO] --- maven-enforcer-plugin:1.3.1:enforce (enforce) @ beam-sdks-java-io-kinesis ---
[INFO] 
[INFO] --- maven-remote-resources-plugin:1.5:process (default) @ beam-sdks-java-io-kinesis
---
[INFO] 
[INFO] --- maven-resources-plugin:2.7:resources (default-resources) @ beam-sdks-java-io-kinesis
---
[INFO] Using 'UTF-8' encoding to copy filtered resources.
[INFO] skip non existing resourceDirectory <https://builds.apache.org/job/beam_PostCommit_MavenVerify/ws/sdks/java/io/kinesis/src/main/resources>
[INFO] Copying 3 resources
[INFO] 
[INFO] --- maven-compiler-plugin:3.3:compile (default-compile) @ beam-sdks-java-io-kinesis
---
[INFO] Changes detected - recompiling the module!
[INFO] Compiling 20 source files to <https://builds.apache.org/job/beam_PostCommit_MavenVerify/ws/sdks/java/io/kinesis/target/classes>
[INFO] <https://builds.apache.org/job/beam_PostCommit_MavenVerify/ws/sdks/java/io/kinesis/src/main/java/org/apache/beam/sdk/io/kinesis/CustomOptional.java>:
<https://builds.apache.org/job/beam_PostCommit_MavenVerify/ws/sdks/java/io/kinesis/src/main/java/org/apache/beam/sdk/io/kinesis/CustomOptional.java>
uses unchecked or unsafe operations.
[INFO] <https://builds.apache.org/job/beam_PostCommit_MavenVerify/ws/sdks/java/io/kinesis/src/main/java/org/apache/beam/sdk/io/kinesis/CustomOptional.java>:
Recompile with -Xlint:unchecked for details.
[INFO] -------------------------------------------------------------
[ERROR] COMPILATION ERROR : 
[INFO] -------------------------------------------------------------
[ERROR] <https://builds.apache.org/job/beam_PostCommit_MavenVerify/ws/sdks/java/io/kinesis/src/main/java/org/apache/beam/sdk/io/kinesis/KinesisRecord.java>:[20,46]
package org.apache.commons.lang.builder does not exist
[ERROR] <https://builds.apache.org/job/beam_PostCommit_MavenVerify/ws/sdks/java/io/kinesis/src/main/java/org/apache/beam/sdk/io/kinesis/KinesisRecord.java>:[20,1]
static import only from classes and interfaces
[ERROR] <https://builds.apache.org/job/beam_PostCommit_MavenVerify/ws/sdks/java/io/kinesis/src/main/java/org/apache/beam/sdk/io/kinesis/KinesisRecord.java>:[27,39]
package org.apache.commons.lang.builder does not exist
[ERROR] <https://builds.apache.org/job/beam_PostCommit_MavenVerify/ws/sdks/java/io/kinesis/src/main/java/org/apache/beam/sdk/io/kinesis/KinesisRecord.java>:[94,16]
cannot find symbol
  symbol:   variable EqualsBuilder
  location: class org.apache.beam.sdk.io.kinesis.KinesisRecord
[ERROR] <https://builds.apache.org/job/beam_PostCommit_MavenVerify/ws/sdks/java/io/kinesis/src/main/java/org/apache/beam/sdk/io/kinesis/KinesisRecord.java>:[99,16]
cannot find symbol
  symbol:   method reflectionHashCode(org.apache.beam.sdk.io.kinesis.KinesisRecord)
  location: class org.apache.beam.sdk.io.kinesis.KinesisRecord
[INFO] 5 errors 
[INFO] -------------------------------------------------------------
[INFO]                                                                         
[INFO] ------------------------------------------------------------------------
[INFO] Skipping Apache Beam :: Parent
[INFO] This project has been banned from the build due to previous failures.
[INFO] ------------------------------------------------------------------------
[INFO] ------------------------------------------------------------------------
[INFO] Reactor Summary:
[INFO] 
[INFO] Apache Beam :: Parent .............................. SUCCESS [ 22.312 s]
[INFO] Apache Beam :: SDKs ................................ SUCCESS [  0.780 s]
[INFO] Apache Beam :: SDKs :: Java ........................ SUCCESS [  1.047 s]
[INFO] Apache Beam :: SDKs :: Java :: Build Tools ......... SUCCESS [  3.903 s]
[INFO] Apache Beam :: SDKs :: Java :: Core ................ SUCCESS [02:47 min]
[INFO] Apache Beam :: Runners ............................. SUCCESS [  3.883 s]
[INFO] Apache Beam :: Runners :: Core Java ................ SUCCESS [ 21.580 s]
[INFO] Apache Beam :: Runners :: Direct Java .............. SUCCESS [01:57 min]
[INFO] Apache Beam :: Runners :: Google Cloud Dataflow .... SUCCESS [ 27.332 s]
[INFO] Apache Beam :: SDKs :: Java :: IO .................. SUCCESS [  1.419 s]
[INFO] Apache Beam :: SDKs :: Java :: IO :: Google Cloud Platform SUCCESS [03:51 min]
[INFO] Apache Beam :: SDKs :: Java :: IO :: HDFS .......... SUCCESS [ 14.592 s]
[INFO] Apache Beam :: SDKs :: Java :: IO :: JMS ........... SUCCESS [  7.680 s]
[INFO] Apache Beam :: SDKs :: Java :: IO :: Kafka ......... SUCCESS [ 11.992 s]
[INFO] Apache Beam :: SDKs :: Java :: IO :: Kinesis ....... FAILURE [  2.067 s]
[INFO] Apache Beam :: SDKs :: Java :: IO :: MongoDB ....... SKIPPED
[INFO] Apache Beam :: SDKs :: Java :: Extensions .......... SKIPPED
[INFO] Apache Beam :: SDKs :: Java :: Extensions :: Join library SKIPPED
[INFO] Apache Beam :: SDKs :: Java :: Microbenchmarks ..... SKIPPED
[INFO] Apache Beam :: SDKs :: Java :: Java 8 Tests ........ SKIPPED
[INFO] Apache Beam :: Runners :: Flink .................... SKIPPED
[INFO] Apache Beam :: Runners :: Flink :: Core ............ SKIPPED
[INFO] Apache Beam :: Runners :: Flink :: Examples ........ SKIPPED
[INFO] Apache Beam :: Runners :: Spark .................... SKIPPED
[INFO] Apache Beam :: SDKs :: Java :: Maven Archetypes .... SKIPPED
[INFO] Apache Beam :: SDKs :: Java :: Maven Archetypes :: Starter SKIPPED
[INFO] Apache Beam :: SDKs :: Java :: Maven Archetypes :: Examples SKIPPED
[INFO] Apache Beam :: Examples ............................ SKIPPED
[INFO] Apache Beam :: Examples :: Java .................... SKIPPED
[INFO] Apache Beam :: Examples :: Java 8 .................. SKIPPED
[INFO] ------------------------------------------------------------------------
[INFO] BUILD FAILURE
[INFO] ------------------------------------------------------------------------
[INFO] Total time: 11:15 min
[INFO] Finished at: 2016-09-27T00:13:39+00:00
[INFO] Final Memory: 127M/855M
[INFO] ------------------------------------------------------------------------
Waiting for Jenkins to finish collecting data
[ERROR] Failed to execute goal org.apache.maven.plugins:maven-compiler-plugin:3.3:compile
(default-compile) on project beam-sdks-java-io-kinesis: Compilation failure: Compilation failure:
[ERROR] <https://builds.apache.org/job/beam_PostCommit_MavenVerify/ws/sdks/java/io/kinesis/src/main/java/org/apache/beam/sdk/io/kinesis/KinesisRecord.java>:[20,46]
package org.apache.commons.lang.builder does not exist
[ERROR] <https://builds.apache.org/job/beam_PostCommit_MavenVerify/ws/sdks/java/io/kinesis/src/main/java/org/apache/beam/sdk/io/kinesis/KinesisRecord.java>:[20,1]
static import only from classes and interfaces
[ERROR] <https://builds.apache.org/job/beam_PostCommit_MavenVerify/ws/sdks/java/io/kinesis/src/main/java/org/apache/beam/sdk/io/kinesis/KinesisRecord.java>:[27,39]
package org.apache.commons.lang.builder does not exist
[ERROR] <https://builds.apache.org/job/beam_PostCommit_MavenVerify/ws/sdks/java/io/kinesis/src/main/java/org/apache/beam/sdk/io/kinesis/KinesisRecord.java>:[94,16]
cannot find symbol
[ERROR] symbol:   variable EqualsBuilder
[ERROR] location: class org.apache.beam.sdk.io.kinesis.KinesisRecord
[ERROR] <https://builds.apache.org/job/beam_PostCommit_MavenVerify/ws/sdks/java/io/kinesis/src/main/java/org/apache/beam/sdk/io/kinesis/KinesisRecord.java>:[99,16]
cannot find symbol
[ERROR] symbol:   method reflectionHashCode(org.apache.beam.sdk.io.kinesis.KinesisRecord)
[ERROR] location: class org.apache.beam.sdk.io.kinesis.KinesisRecord
[ERROR] -> [Help 1]
org.apache.maven.lifecycle.LifecycleExecutionException: Failed to execute goal org.apache.maven.plugins:maven-compiler-plugin:3.3:compile
(default-compile) on project beam-sdks-java-io-kinesis: Compilation failure
	at org.apache.maven.lifecycle.internal.MojoExecutor.execute(MojoExecutor.java:212)
	at org.apache.maven.lifecycle.internal.MojoExecutor.execute(MojoExecutor.java:153)
	at org.apache.maven.lifecycle.internal.MojoExecutor.execute(MojoExecutor.java:145)
	at org.apache.maven.lifecycle.internal.LifecycleModuleBuilder.buildProject(LifecycleModuleBuilder.java:116)
	at org.apache.maven.lifecycle.internal.LifecycleModuleBuilder.buildProject(LifecycleModuleBuilder.java:80)
	at org.apache.maven.lifecycle.internal.builder.singlethreaded.SingleThreadedBuilder.build(SingleThreadedBuilder.java:51)
	at org.apache.maven.lifecycle.internal.LifecycleStarter.execute(LifecycleStarter.java:128)
	at org.apache.maven.DefaultMaven.doExecute(DefaultMaven.java:307)
	at org.apache.maven.DefaultMaven.doExecute(DefaultMaven.java:193)
	at org.apache.maven.DefaultMaven.execute(DefaultMaven.java:106)
	at org.jvnet.hudson.maven3.launcher.Maven32Launcher.main(Maven32Launcher.java:132)
	at sun.reflect.NativeMethodAccessorImpl.invoke0(Native Method)
	at sun.reflect.NativeMethodAccessorImpl.invoke(NativeMethodAccessorImpl.java:62)
	at sun.reflect.DelegatingMethodAccessorImpl.invoke(DelegatingMethodAccessorImpl.java:43)
	at java.lang.reflect.Method.invoke(Method.java:498)
	at org.codehaus.plexus.classworlds.launcher.Launcher.launchStandard(Launcher.java:330)
	at org.codehaus.plexus.classworlds.launcher.Launcher.launch(Launcher.java:238)
	at jenkins.maven3.agent.Maven32Main.launch(Maven32Main.java:186)
	at sun.reflect.NativeMethodAccessorImpl.invoke0(Native Method)
	at sun.reflect.NativeMethodAccessorImpl.invoke(NativeMethodAccessorImpl.java:62)
	at sun.reflect.DelegatingMethodAccessorImpl.invoke(DelegatingMethodAccessorImpl.java:43)
	at java.lang.reflect.Method.invoke(Method.java:498)
	at hudson.maven.Maven3Builder.call(Maven3Builder.java:136)
	at hudson.maven.Maven3Builder.call(Maven3Builder.java:71)
	at hudson.remoting.UserRequest.perform(UserRequest.java:153)
	at hudson.remoting.UserRequest.perform(UserRequest.java:50)
	at hudson.remoting.Request$2.run(Request.java:332)
	at hudson.remoting.InterceptingExecutorService$1.call(InterceptingExecutorService.java:68)
	at java.util.concurrent.FutureTask.run(FutureTask.java:266)
	at java.util.concurrent.ThreadPoolExecutor.runWorker(ThreadPoolExecutor.java:1142)
	at java.util.concurrent.ThreadPoolExecutor$Worker.run(ThreadPoolExecutor.java:617)
	at java.lang.Thread.run(Thread.java:745)
Caused by: org.apache.maven.plugin.compiler.CompilationFailureException: Compilation failure
	at org.apache.maven.plugin.compiler.AbstractCompilerMojo.execute(AbstractCompilerMojo.java:911)
	at org.apache.maven.plugin.compiler.CompilerMojo.execute(CompilerMojo.java:129)
	at org.apache.maven.plugin.DefaultBuildPluginManager.executeMojo(DefaultBuildPluginManager.java:134)
	at org.apache.maven.lifecycle.internal.MojoExecutor.execute(MojoExecutor.java:208)
	... 31 more
[ERROR] 
[ERROR] Re-run Maven using the -X switch to enable full debug logging.
[ERROR] 
[ERROR] For more information about the errors and possible solutions, please read the following
articles:
[ERROR] [Help 1] http://cwiki.apache.org/confluence/display/MAVEN/MojoFailureException
[ERROR] 
[ERROR] After correcting the problems, you can resume the build with the command
[ERROR]   mvn <goals> -rf :beam-sdks-java-io-kinesis
[JENKINS] Archiving <https://builds.apache.org/job/beam_PostCommit_MavenVerify/ws/sdks/java/io/pom.xml>
to org.apache.beam/beam-sdks-java-io-parent/0.3.0-incubating-SNAPSHOT/beam-sdks-java-io-parent-0.3.0-incubating-SNAPSHOT.pom
[JENKINS] Archiving <https://builds.apache.org/job/beam_PostCommit_MavenVerify/ws/sdks/java/microbenchmarks/pom.xml>
to org.apache.beam/beam-sdks-java-microbenchmarks/0.3.0-incubating-SNAPSHOT/beam-sdks-java-microbenchmarks-0.3.0-incubating-SNAPSHOT.pom
[JENKINS] Archiving <https://builds.apache.org/job/beam_PostCommit_MavenVerify/ws/runners/direct-java/dependency-reduced-pom.xml>
to org.apache.beam/beam-runners-direct-java/0.3.0-incubating-SNAPSHOT/beam-runners-direct-java-0.3.0-incubating-SNAPSHOT.pom
[JENKINS] Archiving <https://builds.apache.org/job/beam_PostCommit_MavenVerify/ws/runners/direct-java/target/beam-runners-direct-java-0.3.0-incubating-SNAPSHOT.jar>
to org.apache.beam/beam-runners-direct-java/0.3.0-incubating-SNAPSHOT/beam-runners-direct-java-0.3.0-incubating-SNAPSHOT.jar
[JENKINS] Archiving <https://builds.apache.org/job/beam_PostCommit_MavenVerify/ws/runners/direct-java/target/beam-runners-direct-java-0.3.0-incubating-SNAPSHOT-tests.jar>
to org.apache.beam/beam-runners-direct-java/0.3.0-incubating-SNAPSHOT/beam-runners-direct-java-0.3.0-incubating-SNAPSHOT-tests.jar
[JENKINS] Archiving <https://builds.apache.org/job/beam_PostCommit_MavenVerify/ws/runners/direct-java/target/beam-runners-direct-java-0.3.0-incubating-SNAPSHOT-sources.jar>
to org.apache.beam/beam-runners-direct-java/0.3.0-incubating-SNAPSHOT/beam-runners-direct-java-0.3.0-incubating-SNAPSHOT-sources.jar
[JENKINS] Archiving <https://builds.apache.org/job/beam_PostCommit_MavenVerify/ws/runners/direct-java/target/beam-runners-direct-java-0.3.0-incubating-SNAPSHOT-test-sources.jar>
to org.apache.beam/beam-runners-direct-java/0.3.0-incubating-SNAPSHOT/beam-runners-direct-java-0.3.0-incubating-SNAPSHOT-test-sources.jar
[JENKINS] Archiving <https://builds.apache.org/job/beam_PostCommit_MavenVerify/ws/runners/direct-java/target/beam-runners-direct-java-0.3.0-incubating-SNAPSHOT-javadoc.jar>
to org.apache.beam/beam-runners-direct-java/0.3.0-incubating-SNAPSHOT/beam-runners-direct-java-0.3.0-incubating-SNAPSHOT-javadoc.jar
[JENKINS] Archiving <https://builds.apache.org/job/beam_PostCommit_MavenVerify/ws/sdks/java/maven-archetypes/starter/pom.xml>
to org.apache.beam/beam-sdks-java-maven-archetypes-starter/0.3.0-incubating-SNAPSHOT/beam-sdks-java-maven-archetypes-starter-0.3.0-incubating-SNAPSHOT.pom
[JENKINS] Archiving <https://builds.apache.org/job/beam_PostCommit_MavenVerify/ws/examples/java/pom.xml>
to org.apache.beam/beam-examples-java/0.3.0-incubating-SNAPSHOT/beam-examples-java-0.3.0-incubating-SNAPSHOT.pom
[JENKINS] Archiving <https://builds.apache.org/job/beam_PostCommit_MavenVerify/ws/sdks/java/build-tools/pom.xml>
to org.apache.beam/beam-sdks-java-build-tools/0.3.0-incubating-SNAPSHOT/beam-sdks-java-build-tools-0.3.0-incubating-SNAPSHOT.pom
[JENKINS] Archiving <https://builds.apache.org/job/beam_PostCommit_MavenVerify/ws/sdks/java/build-tools/target/beam-sdks-java-build-tools-0.3.0-incubating-SNAPSHOT.jar>
to org.apache.beam/beam-sdks-java-build-tools/0.3.0-incubating-SNAPSHOT/beam-sdks-java-build-tools-0.3.0-incubating-SNAPSHOT.jar
[JENKINS] Archiving <https://builds.apache.org/job/beam_PostCommit_MavenVerify/ws/sdks/java/build-tools/target/beam-sdks-java-build-tools-0.3.0-incubating-SNAPSHOT-tests.jar>
to org.apache.beam/beam-sdks-java-build-tools/0.3.0-incubating-SNAPSHOT/beam-sdks-java-build-tools-0.3.0-incubating-SNAPSHOT-tests.jar
[JENKINS] Archiving <https://builds.apache.org/job/beam_PostCommit_MavenVerify/ws/sdks/java/core/dependency-reduced-pom.xml>
to org.apache.beam/beam-sdks-java-core/0.3.0-incubating-SNAPSHOT/beam-sdks-java-core-0.3.0-incubating-SNAPSHOT.pom
[JENKINS] Archiving <https://builds.apache.org/job/beam_PostCommit_MavenVerify/ws/sdks/java/core/target/beam-sdks-java-core-0.3.0-incubating-SNAPSHOT.jar>
to org.apache.beam/beam-sdks-java-core/0.3.0-incubating-SNAPSHOT/beam-sdks-java-core-0.3.0-incubating-SNAPSHOT.jar
[JENKINS] Archiving <https://builds.apache.org/job/beam_PostCommit_MavenVerify/ws/sdks/java/core/target/beam-sdks-java-core-0.3.0-incubating-SNAPSHOT-tests.jar>
to org.apache.beam/beam-sdks-java-core/0.3.0-incubating-SNAPSHOT/beam-sdks-java-core-0.3.0-incubating-SNAPSHOT-tests.jar
[JENKINS] Archiving <https://builds.apache.org/job/beam_PostCommit_MavenVerify/ws/sdks/java/core/target/beam-sdks-java-core-0.3.0-incubating-SNAPSHOT-sources.jar>
to org.apache.beam/beam-sdks-java-core/0.3.0-incubating-SNAPSHOT/beam-sdks-java-core-0.3.0-incubating-SNAPSHOT-sources.jar
[JENKINS] Archiving <https://builds.apache.org/job/beam_PostCommit_MavenVerify/ws/sdks/java/core/target/beam-sdks-java-core-0.3.0-incubating-SNAPSHOT-test-sources.jar>
to org.apache.beam/beam-sdks-java-core/0.3.0-incubating-SNAPSHOT/beam-sdks-java-core-0.3.0-incubating-SNAPSHOT-test-sources.jar
[JENKINS] Archiving <https://builds.apache.org/job/beam_PostCommit_MavenVerify/ws/sdks/java/core/target/beam-sdks-java-core-0.3.0-incubating-SNAPSHOT-javadoc.jar>
to org.apache.beam/beam-sdks-java-core/0.3.0-incubating-SNAPSHOT/beam-sdks-java-core-0.3.0-incubating-SNAPSHOT-javadoc.jar
[JENKINS] Archiving <https://builds.apache.org/job/beam_PostCommit_MavenVerify/ws/runners/flink/examples/pom.xml>
to org.apache.beam/beam-runners-flink_2.10-examples/0.3.0-incubating-SNAPSHOT/beam-runners-flink_2.10-examples-0.3.0-incubating-SNAPSHOT.pom
[JENKINS] Archiving <https://builds.apache.org/job/beam_PostCommit_MavenVerify/ws/runners/core-java/dependency-reduced-pom.xml>
to org.apache.beam/beam-runners-core-java/0.3.0-incubating-SNAPSHOT/beam-runners-core-java-0.3.0-incubating-SNAPSHOT.pom
[JENKINS] Archiving <https://builds.apache.org/job/beam_PostCommit_MavenVerify/ws/runners/core-java/target/beam-runners-core-java-0.3.0-incubating-SNAPSHOT.jar>
to org.apache.beam/beam-runners-core-java/0.3.0-incubating-SNAPSHOT/beam-runners-core-java-0.3.0-incubating-SNAPSHOT.jar
[JENKINS] Archiving <https://builds.apache.org/job/beam_PostCommit_MavenVerify/ws/runners/core-java/target/beam-runners-core-java-0.3.0-incubating-SNAPSHOT-tests.jar>
to org.apache.beam/beam-runners-core-java/0.3.0-incubating-SNAPSHOT/beam-runners-core-java-0.3.0-incubating-SNAPSHOT-tests.jar
[JENKINS] Archiving <https://builds.apache.org/job/beam_PostCommit_MavenVerify/ws/runners/core-java/target/beam-runners-core-java-0.3.0-incubating-SNAPSHOT-sources.jar>
to org.apache.beam/beam-runners-core-java/0.3.0-incubating-SNAPSHOT/beam-runners-core-java-0.3.0-incubating-SNAPSHOT-sources.jar
[JENKINS] Archiving <https://builds.apache.org/job/beam_PostCommit_MavenVerify/ws/runners/core-java/target/beam-runners-core-java-0.3.0-incubating-SNAPSHOT-test-sources.jar>
to org.apache.beam/beam-runners-core-java/0.3.0-incubating-SNAPSHOT/beam-runners-core-java-0.3.0-incubating-SNAPSHOT-test-sources.jar
[JENKINS] Archiving <https://builds.apache.org/job/beam_PostCommit_MavenVerify/ws/runners/core-java/target/beam-runners-core-java-0.3.0-incubating-SNAPSHOT-javadoc.jar>
to org.apache.beam/beam-runners-core-java/0.3.0-incubating-SNAPSHOT/beam-runners-core-java-0.3.0-incubating-SNAPSHOT-javadoc.jar
[JENKINS] Archiving <https://builds.apache.org/job/beam_PostCommit_MavenVerify/ws/sdks/java/io/kinesis/pom.xml>
to org.apache.beam/beam-sdks-java-io-kinesis/0.3.0-incubating-SNAPSHOT/beam-sdks-java-io-kinesis-0.3.0-incubating-SNAPSHOT.pom
[JENKINS] Archiving <https://builds.apache.org/job/beam_PostCommit_MavenVerify/ws/sdks/java/io/kafka/pom.xml>
to org.apache.beam/beam-sdks-java-io-kafka/0.3.0-incubating-SNAPSHOT/beam-sdks-java-io-kafka-0.3.0-incubating-SNAPSHOT.pom
[JENKINS] Archiving <https://builds.apache.org/job/beam_PostCommit_MavenVerify/ws/sdks/java/io/kafka/target/beam-sdks-java-io-kafka-0.3.0-incubating-SNAPSHOT.jar>
to org.apache.beam/beam-sdks-java-io-kafka/0.3.0-incubating-SNAPSHOT/beam-sdks-java-io-kafka-0.3.0-incubating-SNAPSHOT.jar
[JENKINS] Archiving <https://builds.apache.org/job/beam_PostCommit_MavenVerify/ws/sdks/java/io/kafka/target/beam-sdks-java-io-kafka-0.3.0-incubating-SNAPSHOT-sources.jar>
to org.apache.beam/beam-sdks-java-io-kafka/0.3.0-incubating-SNAPSHOT/beam-sdks-java-io-kafka-0.3.0-incubating-SNAPSHOT-sources.jar
[JENKINS] Archiving <https://builds.apache.org/job/beam_PostCommit_MavenVerify/ws/sdks/java/io/kafka/target/beam-sdks-java-io-kafka-0.3.0-incubating-SNAPSHOT-test-sources.jar>
to org.apache.beam/beam-sdks-java-io-kafka/0.3.0-incubating-SNAPSHOT/beam-sdks-java-io-kafka-0.3.0-incubating-SNAPSHOT-test-sources.jar
[JENKINS] Archiving <https://builds.apache.org/job/beam_PostCommit_MavenVerify/ws/sdks/java/io/kafka/target/beam-sdks-java-io-kafka-0.3.0-incubating-SNAPSHOT-tests.jar>
to org.apache.beam/beam-sdks-java-io-kafka/0.3.0-incubating-SNAPSHOT/beam-sdks-java-io-kafka-0.3.0-incubating-SNAPSHOT-tests.jar
[JENKINS] Archiving <https://builds.apache.org/job/beam_PostCommit_MavenVerify/ws/sdks/java/io/kafka/target/beam-sdks-java-io-kafka-0.3.0-incubating-SNAPSHOT-javadoc.jar>
to org.apache.beam/beam-sdks-java-io-kafka/0.3.0-incubating-SNAPSHOT/beam-sdks-java-io-kafka-0.3.0-incubating-SNAPSHOT-javadoc.jar
[JENKINS] Archiving <https://builds.apache.org/job/beam_PostCommit_MavenVerify/ws/runners/flink/runner/pom.xml>
to org.apache.beam/beam-runners-flink_2.10/0.3.0-incubating-SNAPSHOT/beam-runners-flink_2.10-0.3.0-incubating-SNAPSHOT.pom
[JENKINS] Archiving <https://builds.apache.org/job/beam_PostCommit_MavenVerify/ws/sdks/java/io/google-cloud-platform/pom.xml>
to org.apache.beam/beam-sdks-java-io-google-cloud-platform/0.3.0-incubating-SNAPSHOT/beam-sdks-java-io-google-cloud-platform-0.3.0-incubating-SNAPSHOT.pom
[JENKINS] Archiving <https://builds.apache.org/job/beam_PostCommit_MavenVerify/ws/sdks/java/io/google-cloud-platform/target/beam-sdks-java-io-google-cloud-platform-0.3.0-incubating-SNAPSHOT.jar>
to org.apache.beam/beam-sdks-java-io-google-cloud-platform/0.3.0-incubating-SNAPSHOT/beam-sdks-java-io-google-cloud-platform-0.3.0-incubating-SNAPSHOT.jar
[JENKINS] Archiving <https://builds.apache.org/job/beam_PostCommit_MavenVerify/ws/sdks/java/io/google-cloud-platform/target/beam-sdks-java-io-google-cloud-platform-0.3.0-incubating-SNAPSHOT-sources.jar>
to org.apache.beam/beam-sdks-java-io-google-cloud-platform/0.3.0-incubating-SNAPSHOT/beam-sdks-java-io-google-cloud-platform-0.3.0-incubating-SNAPSHOT-sources.jar
[JENKINS] Archiving <https://builds.apache.org/job/beam_PostCommit_MavenVerify/ws/sdks/java/io/google-cloud-platform/target/beam-sdks-java-io-google-cloud-platform-0.3.0-incubating-SNAPSHOT-test-sources.jar>
to org.apache.beam/beam-sdks-java-io-google-cloud-platform/0.3.0-incubating-SNAPSHOT/beam-sdks-java-io-google-cloud-platform-0.3.0-incubating-SNAPSHOT-test-sources.jar
[JENKINS] Archiving <https://builds.apache.org/job/beam_PostCommit_MavenVerify/ws/sdks/java/io/google-cloud-platform/target/beam-sdks-java-io-google-cloud-platform-0.3.0-incubating-SNAPSHOT-tests.jar>
to org.apache.beam/beam-sdks-java-io-google-cloud-platform/0.3.0-incubating-SNAPSHOT/beam-sdks-java-io-google-cloud-platform-0.3.0-incubating-SNAPSHOT-tests.jar
[JENKINS] Archiving <https://builds.apache.org/job/beam_PostCommit_MavenVerify/ws/sdks/java/pom.xml>
to org.apache.beam/beam-sdks-java-parent/0.3.0-incubating-SNAPSHOT/beam-sdks-java-parent-0.3.0-incubating-SNAPSHOT.pom
[JENKINS] Archiving <https://builds.apache.org/job/beam_PostCommit_MavenVerify/ws/pom.xml>
to org.apache.beam/beam-parent/0.3.0-incubating-SNAPSHOT/beam-parent-0.3.0-incubating-SNAPSHOT.pom
Compressed 39.23 KB of artifacts by 81.6% relative to #1399
[JENKINS] Archiving <https://builds.apache.org/job/beam_PostCommit_MavenVerify/ws/sdks/java/maven-archetypes/examples/pom.xml>
to org.apache.beam/beam-sdks-java-maven-archetypes-examples/0.3.0-incubating-SNAPSHOT/beam-sdks-java-maven-archetypes-examples-0.3.0-incubating-SNAPSHOT.pom
[JENKINS] Archiving <https://builds.apache.org/job/beam_PostCommit_MavenVerify/ws/runners/spark/pom.xml>
to org.apache.beam/beam-runners-spark/0.3.0-incubating-SNAPSHOT/beam-runners-spark-0.3.0-incubating-SNAPSHOT.pom
[JENKINS] Archiving <https://builds.apache.org/job/beam_PostCommit_MavenVerify/ws/sdks/java/io/hdfs/pom.xml>
to org.apache.beam/beam-sdks-java-io-hdfs/0.3.0-incubating-SNAPSHOT/beam-sdks-java-io-hdfs-0.3.0-incubating-SNAPSHOT.pom
[JENKINS] Archiving <https://builds.apache.org/job/beam_PostCommit_MavenVerify/ws/sdks/java/io/hdfs/target/beam-sdks-java-io-hdfs-0.3.0-incubating-SNAPSHOT.jar>
to org.apache.beam/beam-sdks-java-io-hdfs/0.3.0-incubating-SNAPSHOT/beam-sdks-java-io-hdfs-0.3.0-incubating-SNAPSHOT.jar
[JENKINS] Archiving <https://builds.apache.org/job/beam_PostCommit_MavenVerify/ws/sdks/java/io/hdfs/target/beam-sdks-java-io-hdfs-0.3.0-incubating-SNAPSHOT-sources.jar>
to org.apache.beam/beam-sdks-java-io-hdfs/0.3.0-incubating-SNAPSHOT/beam-sdks-java-io-hdfs-0.3.0-incubating-SNAPSHOT-sources.jar
[JENKINS] Archiving <https://builds.apache.org/job/beam_PostCommit_MavenVerify/ws/sdks/java/io/hdfs/target/beam-sdks-java-io-hdfs-0.3.0-incubating-SNAPSHOT-test-sources.jar>
to org.apache.beam/beam-sdks-java-io-hdfs/0.3.0-incubating-SNAPSHOT/beam-sdks-java-io-hdfs-0.3.0-incubating-SNAPSHOT-test-sources.jar
[JENKINS] Archiving <https://builds.apache.org/job/beam_PostCommit_MavenVerify/ws/sdks/java/io/hdfs/target/beam-sdks-java-io-hdfs-0.3.0-incubating-SNAPSHOT-tests.jar>
to org.apache.beam/beam-sdks-java-io-hdfs/0.3.0-incubating-SNAPSHOT/beam-sdks-java-io-hdfs-0.3.0-incubating-SNAPSHOT-tests.jar
[JENKINS] Archiving <https://builds.apache.org/job/beam_PostCommit_MavenVerify/ws/runners/google-cloud-dataflow-java/dependency-reduced-pom.xml>
to org.apache.beam/beam-runners-google-cloud-dataflow-java/0.3.0-incubating-SNAPSHOT/beam-runners-google-cloud-dataflow-java-0.3.0-incubating-SNAPSHOT.pom
[JENKINS] Archiving <https://builds.apache.org/job/beam_PostCommit_MavenVerify/ws/runners/google-cloud-dataflow-java/target/beam-runners-google-cloud-dataflow-java-0.3.0-incubating-SNAPSHOT.jar>
to org.apache.beam/beam-runners-google-cloud-dataflow-java/0.3.0-incubating-SNAPSHOT/beam-runners-google-cloud-dataflow-java-0.3.0-incubating-SNAPSHOT.jar
[JENKINS] Archiving <https://builds.apache.org/job/beam_PostCommit_MavenVerify/ws/runners/google-cloud-dataflow-java/target/beam-runners-google-cloud-dataflow-java-0.3.0-incubating-SNAPSHOT-tests.jar>
to org.apache.beam/beam-runners-google-cloud-dataflow-java/0.3.0-incubating-SNAPSHOT/beam-runners-google-cloud-dataflow-java-0.3.0-incubating-SNAPSHOT-tests.jar
[JENKINS] Archiving <https://builds.apache.org/job/beam_PostCommit_MavenVerify/ws/runners/google-cloud-dataflow-java/target/beam-runners-google-cloud-dataflow-java-0.3.0-incubating-SNAPSHOT-sources.jar>
to org.apache.beam/beam-runners-google-cloud-dataflow-java/0.3.0-incubating-SNAPSHOT/beam-runners-google-cloud-dataflow-java-0.3.0-incubating-SNAPSHOT-sources.jar
[JENKINS] Archiving <https://builds.apache.org/job/beam_PostCommit_MavenVerify/ws/runners/google-cloud-dataflow-java/target/beam-runners-google-cloud-dataflow-java-0.3.0-incubating-SNAPSHOT-test-sources.jar>
to org.apache.beam/beam-runners-google-cloud-dataflow-java/0.3.0-incubating-SNAPSHOT/beam-runners-google-cloud-dataflow-java-0.3.0-incubating-SNAPSHOT-test-sources.jar
[JENKINS] Archiving <https://builds.apache.org/job/beam_PostCommit_MavenVerify/ws/runners/google-cloud-dataflow-java/target/beam-runners-google-cloud-dataflow-java-0.3.0-incubating-SNAPSHOT-javadoc.jar>
to org.apache.beam/beam-runners-google-cloud-dataflow-java/0.3.0-incubating-SNAPSHOT/beam-runners-google-cloud-dataflow-java-0.3.0-incubating-SNAPSHOT-javadoc.jar
[JENKINS] Archiving <https://builds.apache.org/job/beam_PostCommit_MavenVerify/ws/sdks/java/maven-archetypes/pom.xml>
to org.apache.beam/beam-sdks-java-maven-archetypes-parent/0.3.0-incubating-SNAPSHOT/beam-sdks-java-maven-archetypes-parent-0.3.0-incubating-SNAPSHOT.pom
[JENKINS] Archiving <https://builds.apache.org/job/beam_PostCommit_MavenVerify/ws/sdks/java/io/jms/pom.xml>
to org.apache.beam/beam-sdks-java-io-jms/0.3.0-incubating-SNAPSHOT/beam-sdks-java-io-jms-0.3.0-incubating-SNAPSHOT.pom
[JENKINS] Archiving <https://builds.apache.org/job/beam_PostCommit_MavenVerify/ws/sdks/java/io/jms/target/beam-sdks-java-io-jms-0.3.0-incubating-SNAPSHOT.jar>
to org.apache.beam/beam-sdks-java-io-jms/0.3.0-incubating-SNAPSHOT/beam-sdks-java-io-jms-0.3.0-incubating-SNAPSHOT.jar
[JENKINS] Archiving <https://builds.apache.org/job/beam_PostCommit_MavenVerify/ws/sdks/java/io/jms/target/beam-sdks-java-io-jms-0.3.0-incubating-SNAPSHOT-tests.jar>
to org.apache.beam/beam-sdks-java-io-jms/0.3.0-incubating-SNAPSHOT/beam-sdks-java-io-jms-0.3.0-incubating-SNAPSHOT-tests.jar
[JENKINS] Archiving <https://builds.apache.org/job/beam_PostCommit_MavenVerify/ws/sdks/java/io/jms/target/beam-sdks-java-io-jms-0.3.0-incubating-SNAPSHOT-sources.jar>
to org.apache.beam/beam-sdks-java-io-jms/0.3.0-incubating-SNAPSHOT/beam-sdks-java-io-jms-0.3.0-incubating-SNAPSHOT-sources.jar
[JENKINS] Archiving <https://builds.apache.org/job/beam_PostCommit_MavenVerify/ws/sdks/java/io/jms/target/beam-sdks-java-io-jms-0.3.0-incubating-SNAPSHOT-test-sources.jar>
to org.apache.beam/beam-sdks-java-io-jms/0.3.0-incubating-SNAPSHOT/beam-sdks-java-io-jms-0.3.0-incubating-SNAPSHOT-test-sources.jar
[JENKINS] Archiving <https://builds.apache.org/job/beam_PostCommit_MavenVerify/ws/runners/flink/pom.xml>
to org.apache.beam/beam-runners-flink-parent/0.3.0-incubating-SNAPSHOT/beam-runners-flink-parent-0.3.0-incubating-SNAPSHOT.pom
[JENKINS] Archiving <https://builds.apache.org/job/beam_PostCommit_MavenVerify/ws/sdks/java/io/mongodb/pom.xml>
to org.apache.beam/beam-sdks-java-io-mongodb/0.3.0-incubating-SNAPSHOT/beam-sdks-java-io-mongodb-0.3.0-incubating-SNAPSHOT.pom
[JENKINS] Archiving <https://builds.apache.org/job/beam_PostCommit_MavenVerify/ws/sdks/pom.xml>
to org.apache.beam/beam-sdks-parent/0.3.0-incubating-SNAPSHOT/beam-sdks-parent-0.3.0-incubating-SNAPSHOT.pom
[JENKINS] Archiving <https://builds.apache.org/job/beam_PostCommit_MavenVerify/ws/sdks/java/extensions/join-library/pom.xml>
to org.apache.beam/beam-sdks-java-extensions-join-library/0.3.0-incubating-SNAPSHOT/beam-sdks-java-extensions-join-library-0.3.0-incubating-SNAPSHOT.pom
[JENKINS] Archiving <https://builds.apache.org/job/beam_PostCommit_MavenVerify/ws/runners/pom.xml>
to org.apache.beam/beam-runners-parent/0.3.0-incubating-SNAPSHOT/beam-runners-parent-0.3.0-incubating-SNAPSHOT.pom
[JENKINS] Archiving <https://builds.apache.org/job/beam_PostCommit_MavenVerify/ws/sdks/java/extensions/pom.xml>
to org.apache.beam/beam-sdks-java-extensions-parent/0.3.0-incubating-SNAPSHOT/beam-sdks-java-extensions-parent-0.3.0-incubating-SNAPSHOT.pom
[JENKINS] Archiving <https://builds.apache.org/job/beam_PostCommit_MavenVerify/ws/examples/pom.xml>
to org.apache.beam/beam-examples-parent/0.3.0-incubating-SNAPSHOT/beam-examples-parent-0.3.0-incubating-SNAPSHOT.pom
Sending e-mails to: commits@beam.incubator.apache.org
Sending e-mails to: commits@beam.incubator.apache.org
channel stopped

Mime
View raw message