beam-commits mailing list archives

Site index · List index
Message view « Date » · « Thread »
Top « Date » · « Thread »
From Apache Jenkins Server <jenk...@builds.apache.org>
Subject Build failed in Jenkins: beam_PostCommit_RunnableOnService_GearpumpLocal #136
Date Wed, 24 Aug 2016 23:17:53 GMT
See <https://builds.apache.org/job/beam_PostCommit_RunnableOnService_GearpumpLocal/136/>

------------------------------------------
[...truncated 9008 lines...]
[WARNING]   - javax.annotation.RegEx
[WARNING]   - javax.annotation.concurrent.Immutable
[WARNING]   - javax.annotation.meta.TypeQualifierDefault
[WARNING]   - javax.annotation.meta.TypeQualifier
[WARNING]   - javax.annotation.Syntax
[WARNING]   - javax.annotation.Nonnull
[WARNING]   - javax.annotation.CheckReturnValue
[WARNING]   - javax.annotation.CheckForNull
[WARNING]   - javax.annotation.meta.TypeQualifierNickname
[WARNING]   - javax.annotation.MatchesPattern
[WARNING]   - 25 more...
[WARNING] grpc-all-0.13.1.jar, grpc-okhttp-0.13.1.jar define 75 overlapping classes: 
[WARNING]   - io.grpc.okhttp.OkHttpSettingsUtil
[WARNING]   - io.grpc.okhttp.NegotiationType
[WARNING]   - io.grpc.okhttp.AsyncFrameWriter$12
[WARNING]   - io.grpc.okhttp.OkHttpTlsUpgrader
[WARNING]   - io.grpc.okhttp.AsyncFrameWriter$WriteRunnable
[WARNING]   - io.grpc.okhttp.Utils
[WARNING]   - io.grpc.okhttp.OkHttpProtocolNegotiator$AndroidNegotiator
[WARNING]   - io.grpc.okhttp.OkHttpChannelBuilder$2
[WARNING]   - io.grpc.okhttp.internal.framed.Huffman$Node
[WARNING]   - io.grpc.okhttp.AsyncFrameWriter$7
[WARNING]   - 65 more...
[WARNING] grpc-all-0.13.1.jar, grpc-auth-0.13.1.jar define 2 overlapping classes: 
[WARNING]   - io.grpc.auth.ClientAuthInterceptor$1
[WARNING]   - io.grpc.auth.ClientAuthInterceptor
[WARNING] grpc-all-0.13.1.jar, grpc-protobuf-nano-0.13.1.jar define 4 overlapping classes:

[WARNING]   - io.grpc.protobuf.nano.NanoProtoInputStream
[WARNING]   - io.grpc.protobuf.nano.NanoUtils
[WARNING]   - io.grpc.protobuf.nano.NanoUtils$1
[WARNING]   - io.grpc.protobuf.nano.MessageNanoFactory
[WARNING] annotations-3.0.1.jar, jcip-annotations-1.0.jar define 4 overlapping classes: 
[WARNING]   - net.jcip.annotations.GuardedBy
[WARNING]   - net.jcip.annotations.NotThreadSafe
[WARNING]   - net.jcip.annotations.ThreadSafe
[WARNING]   - net.jcip.annotations.Immutable
[WARNING] grpc-all-0.13.1.jar, grpc-netty-0.13.1.jar define 78 overlapping classes: 
[WARNING]   - io.grpc.netty.AbstractNettyHandler
[WARNING]   - io.grpc.netty.NettyClientTransport
[WARNING]   - io.grpc.netty.NettyClientStream$1
[WARNING]   - io.grpc.netty.SendResponseHeadersCommand
[WARNING]   - io.grpc.netty.NettyServer$2
[WARNING]   - io.grpc.netty.NettyClientHandler$4
[WARNING]   - io.grpc.netty.NettyClientTransport$3
[WARNING]   - io.grpc.netty.NettyClientHandler$FrameListener
[WARNING]   - io.grpc.netty.ProtocolNegotiators$1
[WARNING]   - io.grpc.netty.JettyTlsUtil
[WARNING]   - 68 more...
[WARNING] beam-runners-core-java-0.2.0-incubating-SNAPSHOT.jar, beam-sdks-java-core-0.2.0-incubating-SNAPSHOT.jar
define 1717 overlapping classes: 
[WARNING]   - org.apache.beam.sdk.repackaged.com.google.common.collect.TreeRangeSet$ComplementRangesByLowerBound$2
[WARNING]   - org.apache.beam.sdk.repackaged.com.google.common.collect.WellBehavedMap$EntrySet$1$1
[WARNING]   - org.apache.beam.sdk.repackaged.com.google.common.util.concurrent.CycleDetectingLockFactory$Policies$1
[WARNING]   - org.apache.beam.sdk.repackaged.com.google.common.collect.Maps$6
[WARNING]   - org.apache.beam.sdk.repackaged.com.google.common.primitives.UnsignedBytes$LexicographicalComparatorHolder$UnsafeComparator$1
[WARNING]   - org.apache.beam.sdk.repackaged.com.google.common.collect.Collections2$OrderedPermutationCollection
[WARNING]   - org.apache.beam.sdk.repackaged.com.google.common.collect.Range$1
[WARNING]   - org.apache.beam.sdk.repackaged.com.google.common.base.Splitter$2
[WARNING]   - org.apache.beam.sdk.repackaged.com.google.common.base.Equivalence$Identity
[WARNING]   - org.apache.beam.sdk.repackaged.com.google.common.collect.Lists$1
[WARNING]   - 1707 more...
[WARNING] grpc-all-0.13.1.jar, grpc-protobuf-0.13.1.jar define 4 overlapping classes: 
[WARNING]   - io.grpc.protobuf.ProtoUtils$2
[WARNING]   - io.grpc.protobuf.ProtoUtils
[WARNING]   - io.grpc.protobuf.ProtoUtils$1
[WARNING]   - io.grpc.protobuf.ProtoInputStream
[WARNING] grpc-all-0.13.1.jar, grpc-stub-0.13.1.jar define 30 overlapping classes: 
[WARNING]   - io.grpc.stub.ServerCalls$UnaryRequestMethod
[WARNING]   - io.grpc.stub.StreamObserver
[WARNING]   - io.grpc.stub.ClientCalls$CallToStreamObserverAdapter
[WARNING]   - io.grpc.stub.ServerCalls$EmptyServerCallListener
[WARNING]   - io.grpc.stub.MetadataUtils$2$1
[WARNING]   - io.grpc.stub.MetadataUtils$1$1
[WARNING]   - io.grpc.stub.MetadataUtils$2$1$1
[WARNING]   - io.grpc.stub.MetadataUtils
[WARNING]   - io.grpc.stub.ServerCalls$1
[WARNING]   - io.grpc.stub.ServerCalls$ClientStreamingMethod
[WARNING]   - 20 more...
[WARNING] maven-shade-plugin has detected that some class files are
[WARNING] present in two or more JARs. When this happens, only one
[WARNING] single version of the class is copied to the uber jar.
[WARNING] Usually this is not harmful and you can skip these warnings,
[WARNING] otherwise try to manually exclude artifacts based on
[WARNING] mvn dependency:tree -Ddetail=true and the above output.
[WARNING] See http://docs.codehaus.org/display/MAVENUSER/Shade+Plugin
[INFO] Replacing <https://builds.apache.org/job/beam_PostCommit_RunnableOnService_GearpumpLocal/ws/runners/core-java/target/beam-runners-core-java-bundled-0.2.0-incubating-SNAPSHOT.jar>
with <https://builds.apache.org/job/beam_PostCommit_RunnableOnService_GearpumpLocal/ws/runners/core-java/target/beam-runners-core-java-0.2.0-incubating-SNAPSHOT-shaded.jar>
[INFO] 
[INFO] --- maven-surefire-plugin:2.18.1:test (runnable-on-service-tests) @ beam-runners-core-java
---
[WARNING] useSystemClassloader setting has no effect when not forking
[INFO] Surefire report directory: <https://builds.apache.org/job/beam_PostCommit_RunnableOnService_GearpumpLocal/ws/runners/core-java/target/surefire-reports>
[INFO] Using configured provider org.apache.maven.surefire.junitcore.JUnitCoreProvider
[INFO] parallel='all', perCoreThreadCount=true, threadCount=4, useUnlimitedThreads=false,
threadCountSuites=0, threadCountClasses=0, threadCountMethods=0, parallelOptimized=true

Results :

Tests run: 0, Failures: 0, Errors: 0, Skipped: 0

[INFO] 
[INFO] --- maven-dependency-plugin:2.10:analyze-only (default) @ beam-runners-core-java ---
[JENKINS] Recording test results
[INFO] No dependency problems found
[INFO] 
[INFO] --- maven-checkstyle-plugin:2.17:check (default) @ beam-runners-core-java ---
[INFO] Starting audit...
Audit done.
[INFO]                                                                         
[INFO] ------------------------------------------------------------------------
[INFO] Building Apache Beam :: Runners :: Gearpump 0.2.0-incubating-SNAPSHOT
[INFO] ------------------------------------------------------------------------
[INFO] Downloading: https://repo.maven.apache.org/maven2/org/apache/maven/plugins/maven-failsafe-plugin/2.19.1/maven-failsafe-plugin-2.19.1.pom
[INFO] Downloaded: https://repo.maven.apache.org/maven2/org/apache/maven/plugins/maven-failsafe-plugin/2.19.1/maven-failsafe-plugin-2.19.1.pom
(10 KB at 293.0 KB/sec)
[INFO] Downloading: https://repo.maven.apache.org/maven2/org/apache/maven/surefire/surefire/2.19.1/surefire-2.19.1.pom
[INFO] Downloaded: https://repo.maven.apache.org/maven2/org/apache/maven/surefire/surefire/2.19.1/surefire-2.19.1.pom
(19 KB at 643.6 KB/sec)
[INFO] Downloading: https://repo.maven.apache.org/maven2/org/apache/maven/plugins/maven-failsafe-plugin/2.19.1/maven-failsafe-plugin-2.19.1.jar
[INFO] Downloaded: https://repo.maven.apache.org/maven2/org/apache/maven/plugins/maven-failsafe-plugin/2.19.1/maven-failsafe-plugin-2.19.1.jar
(85 KB at 2726.5 KB/sec)
[INFO] Downloading: https://repo.maven.apache.org/maven2/org/apache/maven/plugins/maven-surefire-plugin/2.19.1/maven-surefire-plugin-2.19.1.pom
[INFO] Downloaded: https://repo.maven.apache.org/maven2/org/apache/maven/plugins/maven-surefire-plugin/2.19.1/maven-surefire-plugin-2.19.1.pom
(6 KB at 194.1 KB/sec)
[INFO] Downloading: https://repo.maven.apache.org/maven2/org/apache/maven/plugins/maven-surefire-plugin/2.19.1/maven-surefire-plugin-2.19.1.jar
[INFO] Downloaded: https://repo.maven.apache.org/maven2/org/apache/maven/plugins/maven-surefire-plugin/2.19.1/maven-surefire-plugin-2.19.1.jar
(38 KB at 1103.0 KB/sec)
[INFO] Downloading: http://repository.apache.org/snapshots/org/apache/gearpump/gearpump-streaming_2.11/0.8.1-SNAPSHOT/maven-metadata.xml
[INFO] Downloading: http://dl.bintray.com/fvunicorn/maven/org/apache/gearpump/gearpump-streaming_2.11/0.8.1-SNAPSHOT/maven-metadata.xml
[INFO] Downloading: http://repository.apache.org/snapshots/org/apache/gearpump/gearpump-streaming_2.11/0.8.1-SNAPSHOT/gearpump-streaming_2.11-0.8.1-SNAPSHOT.pom
[INFO] Downloading: http://dl.bintray.com/fvunicorn/maven/org/apache/gearpump/gearpump-streaming_2.11/0.8.1-SNAPSHOT/gearpump-streaming_2.11-0.8.1-SNAPSHOT.pom
[WARNING] The POM for org.apache.gearpump:gearpump-streaming_2.11:jar:0.8.1-SNAPSHOT is missing,
no dependency information available
[INFO] Downloading: http://dl.bintray.com/fvunicorn/maven/org/apache/gearpump/gearpump-core_2.11/0.8.1-SNAPSHOT/maven-metadata.xml
[INFO] Downloading: http://repository.apache.org/snapshots/org/apache/gearpump/gearpump-core_2.11/0.8.1-SNAPSHOT/maven-metadata.xml
[INFO] Downloading: http://repository.apache.org/snapshots/org/apache/gearpump/gearpump-core_2.11/0.8.1-SNAPSHOT/gearpump-core_2.11-0.8.1-SNAPSHOT.pom
[INFO] Downloading: http://dl.bintray.com/fvunicorn/maven/org/apache/gearpump/gearpump-core_2.11/0.8.1-SNAPSHOT/gearpump-core_2.11-0.8.1-SNAPSHOT.pom
[WARNING] The POM for org.apache.gearpump:gearpump-core_2.11:jar:0.8.1-SNAPSHOT is missing,
no dependency information available
[INFO] Downloading: http://repository.apache.org/snapshots/org/apache/gearpump/gearpump-daemon_2.11/0.8.1-SNAPSHOT/maven-metadata.xml
[INFO] Downloading: http://dl.bintray.com/fvunicorn/maven/org/apache/gearpump/gearpump-daemon_2.11/0.8.1-SNAPSHOT/maven-metadata.xml
[INFO] Downloading: http://repository.apache.org/snapshots/org/apache/gearpump/gearpump-daemon_2.11/0.8.1-SNAPSHOT/gearpump-daemon_2.11-0.8.1-SNAPSHOT.pom
[INFO] Downloading: http://dl.bintray.com/fvunicorn/maven/org/apache/gearpump/gearpump-daemon_2.11/0.8.1-SNAPSHOT/gearpump-daemon_2.11-0.8.1-SNAPSHOT.pom
[WARNING] The POM for org.apache.gearpump:gearpump-daemon_2.11:jar:0.8.1-SNAPSHOT is missing,
no dependency information available
[INFO] Downloading: http://dl.bintray.com/fvunicorn/maven/com/typesafe/config/1.3.0/config-1.3.0.pom
[INFO] Downloading: https://repo.maven.apache.org/maven2/com/typesafe/config/1.3.0/config-1.3.0.pom
[INFO] Downloaded: https://repo.maven.apache.org/maven2/com/typesafe/config/1.3.0/config-1.3.0.pom
(2 KB at 67.4 KB/sec)
[INFO] Downloading: http://dl.bintray.com/fvunicorn/maven/org/scala-lang/scala-library/2.11.8/scala-library-2.11.8.pom
[INFO] Downloading: https://repo.maven.apache.org/maven2/org/scala-lang/scala-library/2.11.8/scala-library-2.11.8.pom
[INFO] Downloaded: https://repo.maven.apache.org/maven2/org/scala-lang/scala-library/2.11.8/scala-library-2.11.8.pom
(2 KB at 51.6 KB/sec)
[INFO] Downloading: http://repository.apache.org/snapshots/org/apache/gearpump/gearpump-streaming_2.11/0.8.1-SNAPSHOT/gearpump-streaming_2.11-0.8.1-SNAPSHOT.jar
[INFO] Downloading: http://repository.apache.org/snapshots/org/apache/gearpump/gearpump-core_2.11/0.8.1-SNAPSHOT/gearpump-core_2.11-0.8.1-SNAPSHOT.jar
[INFO] Downloading: http://repository.apache.org/snapshots/org/apache/gearpump/gearpump-daemon_2.11/0.8.1-SNAPSHOT/gearpump-daemon_2.11-0.8.1-SNAPSHOT.jar
[INFO] Downloading: http://dl.bintray.com/fvunicorn/maven/org/apache/gearpump/gearpump-streaming_2.11/0.8.1-SNAPSHOT/gearpump-streaming_2.11-0.8.1-SNAPSHOT.jar
[INFO] Downloading: http://dl.bintray.com/fvunicorn/maven/org/apache/gearpump/gearpump-core_2.11/0.8.1-SNAPSHOT/gearpump-core_2.11-0.8.1-SNAPSHOT.jar
[INFO] Downloading: http://dl.bintray.com/fvunicorn/maven/org/apache/gearpump/gearpump-daemon_2.11/0.8.1-SNAPSHOT/gearpump-daemon_2.11-0.8.1-SNAPSHOT.jar
[INFO] Downloading: http://dl.bintray.com/fvunicorn/maven/com/typesafe/config/1.3.0/config-1.3.0.jar
[INFO] Downloading: http://dl.bintray.com/fvunicorn/maven/org/scala-lang/scala-library/2.11.8/scala-library-2.11.8.jar
[INFO] Downloading: https://repo.maven.apache.org/maven2/com/typesafe/config/1.3.0/config-1.3.0.jar
[INFO] Downloading: https://repo.maven.apache.org/maven2/org/scala-lang/scala-library/2.11.8/scala-library-2.11.8.jar
[INFO] Downloaded: https://repo.maven.apache.org/maven2/com/typesafe/config/1.3.0/config-1.3.0.jar
(272 KB at 4447.1 KB/sec)
[INFO] Downloaded: https://repo.maven.apache.org/maven2/org/scala-lang/scala-library/2.11.8/scala-library-2.11.8.jar
(5611 KB at 15803.7 KB/sec)
[INFO] ------------------------------------------------------------------------
[INFO] Reactor Summary:
[INFO] 
[INFO] Apache Beam :: Parent .............................. SUCCESS [ 19.495 s]
[INFO] Apache Beam :: SDKs ................................ SUCCESS [  0.442 s]
[INFO] Apache Beam :: SDKs :: Java ........................ SUCCESS [  0.476 s]
[INFO] Apache Beam :: SDKs :: Java :: Build Tools ......... SUCCESS [  4.004 s]
[INFO] Apache Beam :: SDKs :: Java :: Core ................ SUCCESS [02:47 min]
[INFO] Apache Beam :: Runners ............................. SUCCESS [  0.493 s]
[INFO] Apache Beam :: Runners :: Core Java ................ SUCCESS [ 45.256 s]
[INFO] Apache Beam :: Runners :: Gearpump ................. FAILURE [  1.888 s]
[INFO] ------------------------------------------------------------------------
[INFO] BUILD FAILURE
[INFO] ------------------------------------------------------------------------
[INFO] Total time: 04:21 min
[INFO] Finished at: 2016-08-24T23:17:49+00:00
[INFO] Final Memory: 113M/924M
[INFO] ------------------------------------------------------------------------
Waiting for Jenkins to finish collecting data
[ERROR] Failed to execute goal on project beam-runners-gearpump: Could not resolve dependencies
for project org.apache.beam:beam-runners-gearpump:jar:0.2.0-incubating-SNAPSHOT: The following
artifacts could not be resolved: org.apache.gearpump:gearpump-streaming_2.11:jar:0.8.1-SNAPSHOT,
org.apache.gearpump:gearpump-core_2.11:jar:0.8.1-SNAPSHOT, org.apache.gearpump:gearpump-daemon_2.11:jar:0.8.1-SNAPSHOT:
Could not find artifact org.apache.gearpump:gearpump-streaming_2.11:jar:0.8.1-SNAPSHOT in
Nexus (http://repository.apache.org/snapshots) -> [Help 1]
org.apache.maven.lifecycle.LifecycleExecutionException: Failed to execute goal on project
beam-runners-gearpump: Could not resolve dependencies for project org.apache.beam:beam-runners-gearpump:jar:0.2.0-incubating-SNAPSHOT:
The following artifacts could not be resolved: org.apache.gearpump:gearpump-streaming_2.11:jar:0.8.1-SNAPSHOT,
org.apache.gearpump:gearpump-core_2.11:jar:0.8.1-SNAPSHOT, org.apache.gearpump:gearpump-daemon_2.11:jar:0.8.1-SNAPSHOT:
Could not find artifact org.apache.gearpump:gearpump-streaming_2.11:jar:0.8.1-SNAPSHOT in
Nexus (http://repository.apache.org/snapshots)
	at org.apache.maven.lifecycle.internal.LifecycleDependencyResolver.getDependencies(LifecycleDependencyResolver.java:221)
	at org.apache.maven.lifecycle.internal.LifecycleDependencyResolver.resolveProjectDependencies(LifecycleDependencyResolver.java:127)
	at org.apache.maven.lifecycle.internal.MojoExecutor.ensureDependenciesAreResolved(MojoExecutor.java:257)
	at org.apache.maven.lifecycle.internal.MojoExecutor.execute(MojoExecutor.java:200)
	at org.apache.maven.lifecycle.internal.MojoExecutor.execute(MojoExecutor.java:153)
	at org.apache.maven.lifecycle.internal.MojoExecutor.execute(MojoExecutor.java:145)
	at org.apache.maven.lifecycle.internal.LifecycleModuleBuilder.buildProject(LifecycleModuleBuilder.java:116)
	at org.apache.maven.lifecycle.internal.LifecycleModuleBuilder.buildProject(LifecycleModuleBuilder.java:80)
	at org.apache.maven.lifecycle.internal.builder.singlethreaded.SingleThreadedBuilder.build(SingleThreadedBuilder.java:51)
	at org.apache.maven.lifecycle.internal.LifecycleStarter.execute(LifecycleStarter.java:128)
	at org.apache.maven.DefaultMaven.doExecute(DefaultMaven.java:307)
	at org.apache.maven.DefaultMaven.doExecute(DefaultMaven.java:193)
	at org.apache.maven.DefaultMaven.execute(DefaultMaven.java:106)
	at org.jvnet.hudson.maven3.launcher.Maven32Launcher.main(Maven32Launcher.java:132)
	at sun.reflect.NativeMethodAccessorImpl.invoke0(Native Method)
	at sun.reflect.NativeMethodAccessorImpl.invoke(NativeMethodAccessorImpl.java:62)
	at sun.reflect.DelegatingMethodAccessorImpl.invoke(DelegatingMethodAccessorImpl.java:43)
	at java.lang.reflect.Method.invoke(Method.java:498)
	at org.codehaus.plexus.classworlds.launcher.Launcher.launchStandard(Launcher.java:330)
	at org.codehaus.plexus.classworlds.launcher.Launcher.launch(Launcher.java:238)
	at jenkins.maven3.agent.Maven32Main.launch(Maven32Main.java:186)
	at sun.reflect.NativeMethodAccessorImpl.invoke0(Native Method)
	at sun.reflect.NativeMethodAccessorImpl.invoke(NativeMethodAccessorImpl.java:62)
	at sun.reflect.DelegatingMethodAccessorImpl.invoke(DelegatingMethodAccessorImpl.java:43)
	at java.lang.reflect.Method.invoke(Method.java:498)
	at hudson.maven.Maven3Builder.call(Maven3Builder.java:136)
	at hudson.maven.Maven3Builder.call(Maven3Builder.java:71)
	at hudson.remoting.UserRequest.perform(UserRequest.java:153)
	at hudson.remoting.UserRequest.perform(UserRequest.java:50)
	at hudson.remoting.Request$2.run(Request.java:332)
	at hudson.remoting.InterceptingExecutorService$1.call(InterceptingExecutorService.java:68)
	at java.util.concurrent.FutureTask.run(FutureTask.java:266)
	at java.util.concurrent.ThreadPoolExecutor.runWorker(ThreadPoolExecutor.java:1142)
	at java.util.concurrent.ThreadPoolExecutor$Worker.run(ThreadPoolExecutor.java:617)
	at java.lang.Thread.run(Thread.java:745)
Caused by: org.apache.maven.project.DependencyResolutionException: Could not resolve dependencies
for project org.apache.beam:beam-runners-gearpump:jar:0.2.0-incubating-SNAPSHOT: The following
artifacts could not be resolved: org.apache.gearpump:gearpump-streaming_2.11:jar:0.8.1-SNAPSHOT,
org.apache.gearpump:gearpump-core_2.11:jar:0.8.1-SNAPSHOT, org.apache.gearpump:gearpump-daemon_2.11:jar:0.8.1-SNAPSHOT:
Could not find artifact org.apache.gearpump:gearpump-streaming_2.11:jar:0.8.1-SNAPSHOT in
Nexus (http://repository.apache.org/snapshots)
	at org.apache.maven.project.DefaultProjectDependenciesResolver.resolve(DefaultProjectDependenciesResolver.java:211)
	at org.apache.maven.lifecycle.internal.LifecycleDependencyResolver.getDependencies(LifecycleDependencyResolver.java:195)
	... 34 more
Caused by: org.eclipse.aether.resolution.DependencyResolutionException: The following artifacts
could not be resolved: org.apache.gearpump:gearpump-streaming_2.11:jar:0.8.1-SNAPSHOT, org.apache.gearpump:gearpump-core_2.11:jar:0.8.1-SNAPSHOT,
org.apache.gearpump:gearpump-daemon_2.11:jar:0.8.1-SNAPSHOT: Could not find artifact org.apache.gearpump:gearpump-streaming_2.11:jar:0.8.1-SNAPSHOT
in Nexus (http://repository.apache.org/snapshots)
	at org.eclipse.aether.internal.impl.DefaultRepositorySystem.resolveDependencies(DefaultRepositorySystem.java:384)
	at org.apache.maven.project.DefaultProjectDependenciesResolver.resolve(DefaultProjectDependenciesResolver.java:205)
	... 35 more
Caused by: org.eclipse.aether.resolution.ArtifactResolutionException: The following artifacts
could not be resolved: org.apache.gearpump:gearpump-streaming_2.11:jar:0.8.1-SNAPSHOT, org.apache.gearpump:gearpump-core_2.11:jar:0.8.1-SNAPSHOT,
org.apache.gearpump:gearpump-daemon_2.11:jar:0.8.1-SNAPSHOT: Could not find artifact org.apache.gearpump:gearpump-streaming_2.11:jar:0.8.1-SNAPSHOT
in Nexus (http://repository.apache.org/snapshots)
	at org.eclipse.aether.internal.impl.DefaultArtifactResolver.resolve(DefaultArtifactResolver.java:444)
	at org.eclipse.aether.internal.impl.DefaultArtifactResolver.resolveArtifacts(DefaultArtifactResolver.java:246)
	at org.eclipse.aether.internal.impl.DefaultRepositorySystem.resolveDependencies(DefaultRepositorySystem.java:367)
	... 36 more
Caused by: org.eclipse.aether.transfer.ArtifactNotFoundException: Could not find artifact
org.apache.gearpump:gearpump-streaming_2.11:jar:0.8.1-SNAPSHOT in Nexus (http://repository.apache.org/snapshots)
	at org.eclipse.aether.connector.basic.ArtifactTransportListener.transferFailed(ArtifactTransportListener.java:39)
	at org.eclipse.aether.connector.basic.BasicRepositoryConnector$TaskRunner.run(BasicRepositoryConnector.java:355)
	at org.eclipse.aether.util.concurrency.RunnableErrorForwarder$1.run(RunnableErrorForwarder.java:67)
	... 3 more
[ERROR] 
[ERROR] Re-run Maven using the -X switch to enable full debug logging.
[ERROR] 
[ERROR] For more information about the errors and possible solutions, please read the following
articles:
[ERROR] [Help 1] http://cwiki.apache.org/confluence/display/MAVEN/DependencyResolutionException
[ERROR] 
[ERROR] After correcting the problems, you can resume the build with the command
[ERROR]   mvn <goals> -rf :beam-runners-gearpump
[JENKINS] Archiving <https://builds.apache.org/job/beam_PostCommit_RunnableOnService_GearpumpLocal/ws/sdks/java/build-tools/pom.xml>
to org.apache.beam/beam-sdks-java-build-tools/0.2.0-incubating-SNAPSHOT/beam-sdks-java-build-tools-0.2.0-incubating-SNAPSHOT.pom
[JENKINS] Archiving <https://builds.apache.org/job/beam_PostCommit_RunnableOnService_GearpumpLocal/ws/sdks/java/build-tools/target/beam-sdks-java-build-tools-0.2.0-incubating-SNAPSHOT.jar>
to org.apache.beam/beam-sdks-java-build-tools/0.2.0-incubating-SNAPSHOT/beam-sdks-java-build-tools-0.2.0-incubating-SNAPSHOT.jar
[JENKINS] Archiving <https://builds.apache.org/job/beam_PostCommit_RunnableOnService_GearpumpLocal/ws/sdks/java/build-tools/target/beam-sdks-java-build-tools-0.2.0-incubating-SNAPSHOT-tests.jar>
to org.apache.beam/beam-sdks-java-build-tools/0.2.0-incubating-SNAPSHOT/beam-sdks-java-build-tools-0.2.0-incubating-SNAPSHOT-tests.jar
[JENKINS] Archiving <https://builds.apache.org/job/beam_PostCommit_RunnableOnService_GearpumpLocal/ws/sdks/java/core/dependency-reduced-pom.xml>
to org.apache.beam/beam-sdks-java-core/0.2.0-incubating-SNAPSHOT/beam-sdks-java-core-0.2.0-incubating-SNAPSHOT.pom
[JENKINS] Archiving <https://builds.apache.org/job/beam_PostCommit_RunnableOnService_GearpumpLocal/ws/sdks/java/core/target/beam-sdks-java-core-0.2.0-incubating-SNAPSHOT.jar>
to org.apache.beam/beam-sdks-java-core/0.2.0-incubating-SNAPSHOT/beam-sdks-java-core-0.2.0-incubating-SNAPSHOT.jar
[JENKINS] Archiving <https://builds.apache.org/job/beam_PostCommit_RunnableOnService_GearpumpLocal/ws/sdks/java/core/target/beam-sdks-java-core-0.2.0-incubating-SNAPSHOT-tests.jar>
to org.apache.beam/beam-sdks-java-core/0.2.0-incubating-SNAPSHOT/beam-sdks-java-core-0.2.0-incubating-SNAPSHOT-tests.jar
[JENKINS] Archiving <https://builds.apache.org/job/beam_PostCommit_RunnableOnService_GearpumpLocal/ws/runners/core-java/dependency-reduced-pom.xml>
to org.apache.beam/beam-runners-core-java/0.2.0-incubating-SNAPSHOT/beam-runners-core-java-0.2.0-incubating-SNAPSHOT.pom
[JENKINS] Archiving <https://builds.apache.org/job/beam_PostCommit_RunnableOnService_GearpumpLocal/ws/runners/core-java/target/beam-runners-core-java-0.2.0-incubating-SNAPSHOT.jar>
to org.apache.beam/beam-runners-core-java/0.2.0-incubating-SNAPSHOT/beam-runners-core-java-0.2.0-incubating-SNAPSHOT.jar
[JENKINS] Archiving <https://builds.apache.org/job/beam_PostCommit_RunnableOnService_GearpumpLocal/ws/runners/core-java/target/beam-runners-core-java-0.2.0-incubating-SNAPSHOT-javadoc.jar>
to org.apache.beam/beam-runners-core-java/0.2.0-incubating-SNAPSHOT/beam-runners-core-java-0.2.0-incubating-SNAPSHOT-javadoc.jar
[JENKINS] Archiving <https://builds.apache.org/job/beam_PostCommit_RunnableOnService_GearpumpLocal/ws/runners/core-java/target/beam-runners-core-java-0.2.0-incubating-SNAPSHOT-tests.jar>
to org.apache.beam/beam-runners-core-java/0.2.0-incubating-SNAPSHOT/beam-runners-core-java-0.2.0-incubating-SNAPSHOT-tests.jar
[JENKINS] Archiving <https://builds.apache.org/job/beam_PostCommit_RunnableOnService_GearpumpLocal/ws/sdks/java/pom.xml>
to org.apache.beam/beam-sdks-java-parent/0.2.0-incubating-SNAPSHOT/beam-sdks-java-parent-0.2.0-incubating-SNAPSHOT.pom
[JENKINS] Archiving <https://builds.apache.org/job/beam_PostCommit_RunnableOnService_GearpumpLocal/ws/pom.xml>
to org.apache.beam/beam-parent/0.2.0-incubating-SNAPSHOT/beam-parent-0.2.0-incubating-SNAPSHOT.pom
Compressed 35.65 KB of artifacts by 89.8% relative to #135
[JENKINS] Archiving <https://builds.apache.org/job/beam_PostCommit_RunnableOnService_GearpumpLocal/ws/sdks/pom.xml>
to org.apache.beam/beam-sdks-parent/0.2.0-incubating-SNAPSHOT/beam-sdks-parent-0.2.0-incubating-SNAPSHOT.pom
[JENKINS] Archiving <https://builds.apache.org/job/beam_PostCommit_RunnableOnService_GearpumpLocal/ws/runners/pom.xml>
to org.apache.beam/beam-runners-parent/0.2.0-incubating-SNAPSHOT/beam-runners-parent-0.2.0-incubating-SNAPSHOT.pom
channel stopped

Mime
View raw message