beam-commits mailing list archives

Site index · List index
Message view « Date » · « Thread »
Top « Date » · « Thread »
From Apache Jenkins Server <jenk...@builds.apache.org>
Subject Build failed in Jenkins: beam_PostCommit_RunnableOnService_GearpumpLocal #143
Date Fri, 26 Aug 2016 11:16:52 GMT
See <https://builds.apache.org/job/beam_PostCommit_RunnableOnService_GearpumpLocal/143/>

------------------------------------------
[...truncated 7289 lines...]
[INFO] Excluding com.google.api-client:google-api-client-jackson2:jar:1.22.0 from the shaded
jar.
[INFO] Excluding com.google.cloud.bigdataoss:util:jar:1.4.5 from the shaded jar.
[INFO] Excluding com.google.protobuf:protobuf-java:jar:3.0.0-beta-1 from the shaded jar.
[INFO] Excluding com.fasterxml.jackson.core:jackson-core:jar:2.7.2 from the shaded jar.
[INFO] Excluding com.fasterxml.jackson.core:jackson-databind:jar:2.7.2 from the shaded jar.
[INFO] Excluding net.bytebuddy:byte-buddy:jar:1.4.3 from the shaded jar.
[INFO] Excluding org.apache.avro:avro:jar:1.8.1 from the shaded jar.
[INFO] Excluding org.codehaus.jackson:jackson-core-asl:jar:1.9.13 from the shaded jar.
[INFO] Excluding org.codehaus.jackson:jackson-mapper-asl:jar:1.9.13 from the shaded jar.
[INFO] Excluding com.thoughtworks.paranamer:paranamer:jar:2.7 from the shaded jar.
[INFO] Excluding org.tukaani:xz:jar:1.5 from the shaded jar.
[INFO] Excluding org.xerial.snappy:snappy-java:jar:1.1.2.1 from the shaded jar.
[INFO] Excluding org.apache.commons:commons-compress:jar:1.9 from the shaded jar.
[INFO] Excluding com.fasterxml.jackson.core:jackson-annotations:jar:2.7.2 from the shaded
jar.
[INFO] Excluding com.google.code.findbugs:annotations:jar:3.0.1 from the shaded jar.
[INFO] Excluding net.jcip:jcip-annotations:jar:1.0 from the shaded jar.
[INFO] Excluding com.google.code.findbugs:jsr305:jar:3.0.1 from the shaded jar.
[INFO] Including com.google.guava:guava:jar:19.0 in the shaded jar.
[INFO] Excluding joda-time:joda-time:jar:2.4 from the shaded jar.
[INFO] Excluding org.slf4j:slf4j-api:jar:1.7.14 from the shaded jar.
[INFO] Replacing original artifact with shaded artifact.
[INFO] Replacing <https://builds.apache.org/job/beam_PostCommit_RunnableOnService_GearpumpLocal/ws/runners/core-java/target/beam-runners-core-java-0.3.0-incubating-SNAPSHOT.jar>
with <https://builds.apache.org/job/beam_PostCommit_RunnableOnService_GearpumpLocal/ws/runners/core-java/target/beam-runners-core-java-0.3.0-incubating-SNAPSHOT-shaded.jar>
[INFO] Replacing original test artifact with shaded test artifact.
[INFO] Replacing <https://builds.apache.org/job/beam_PostCommit_RunnableOnService_GearpumpLocal/ws/runners/core-java/target/beam-runners-core-java-0.3.0-incubating-SNAPSHOT-tests.jar>
with <https://builds.apache.org/job/beam_PostCommit_RunnableOnService_GearpumpLocal/ws/runners/core-java/target/beam-runners-core-java-0.3.0-incubating-SNAPSHOT-shaded-tests.jar>
[INFO] Dependency-reduced POM written at: <https://builds.apache.org/job/beam_PostCommit_RunnableOnService_GearpumpLocal/ws/runners/core-java/dependency-reduced-pom.xml>
[INFO] Dependency-reduced POM written at: <https://builds.apache.org/job/beam_PostCommit_RunnableOnService_GearpumpLocal/ws/runners/core-java/dependency-reduced-pom.xml>
[INFO] 
[INFO] --- maven-shade-plugin:2.4.1:shade (bundle-rest-without-repackaging) @ beam-runners-core-java
---
[INFO] Including org.apache.beam:beam-sdks-java-core:jar:0.3.0-incubating-SNAPSHOT in the
shaded jar.
[INFO] Including io.grpc:grpc-auth:jar:0.14.1 in the shaded jar.
[INFO] Including io.grpc:grpc-core:jar:0.14.1 in the shaded jar.
[INFO] Including io.grpc:grpc-netty:jar:0.14.1 in the shaded jar.
[INFO] Including io.netty:netty-codec-http2:jar:4.1.1.Final in the shaded jar.
[INFO] Including io.netty:netty-codec-http:jar:4.1.1.Final in the shaded jar.
[INFO] Including io.grpc:grpc-all:jar:0.14.1 in the shaded jar.
[INFO] Including io.grpc:grpc-protobuf:jar:0.14.1 in the shaded jar.
[INFO] Including com.google.protobuf:protobuf-java-util:jar:3.0.0-beta-2 in the shaded jar.
[INFO] Including com.google.code.gson:gson:jar:2.3 in the shaded jar.
[INFO] Including io.grpc:grpc-stub:jar:0.14.1 in the shaded jar.
[INFO] Including io.grpc:grpc-okhttp:jar:0.14.1 in the shaded jar.
[INFO] Including com.squareup.okio:okio:jar:1.6.0 in the shaded jar.
[INFO] Including com.squareup.okhttp:okhttp:jar:2.5.0 in the shaded jar.
[INFO] Including io.grpc:grpc-protobuf-lite:jar:0.14.1 in the shaded jar.
[INFO] Including io.grpc:grpc-protobuf-nano:jar:0.14.1 in the shaded jar.
[INFO] Including com.google.protobuf.nano:protobuf-javanano:jar:3.0.0-alpha-5 in the shaded
jar.
[INFO] Including com.google.auth:google-auth-library-oauth2-http:jar:0.4.0 in the shaded jar.
[INFO] Including com.google.auth:google-auth-library-credentials:jar:0.4.0 in the shaded jar.
[INFO] Including io.netty:netty-handler:jar:4.1.1.Final in the shaded jar.
[INFO] Including io.netty:netty-buffer:jar:4.1.1.Final in the shaded jar.
[INFO] Including io.netty:netty-common:jar:4.1.1.Final in the shaded jar.
[INFO] Including io.netty:netty-transport:jar:4.1.1.Final in the shaded jar.
[INFO] Including io.netty:netty-resolver:jar:4.1.1.Final in the shaded jar.
[INFO] Including io.netty:netty-codec:jar:4.1.1.Final in the shaded jar.
[INFO] Including com.google.api.grpc:grpc-pubsub-v1:jar:0.0.2 in the shaded jar.
[INFO] Including com.google.api.grpc:grpc-core-proto:jar:0.0.3 in the shaded jar.
[INFO] Including com.google.api-client:google-api-client:jar:1.22.0 in the shaded jar.
[INFO] Including com.google.apis:google-api-services-bigquery:jar:v2-rev295-1.22.0 in the
shaded jar.
[INFO] Including com.google.apis:google-api-services-pubsub:jar:v1-rev10-1.22.0 in the shaded
jar.
[INFO] Including com.google.apis:google-api-services-storage:jar:v1-rev71-1.22.0 in the shaded
jar.
[INFO] Including com.google.http-client:google-http-client:jar:1.22.0 in the shaded jar.
[INFO] Including org.apache.httpcomponents:httpclient:jar:4.0.1 in the shaded jar.
[INFO] Including org.apache.httpcomponents:httpcore:jar:4.0.1 in the shaded jar.
[INFO] Including commons-logging:commons-logging:jar:1.1.1 in the shaded jar.
[INFO] Including commons-codec:commons-codec:jar:1.3 in the shaded jar.
[INFO] Including com.google.http-client:google-http-client-jackson:jar:1.22.0 in the shaded
jar.
[INFO] Including com.google.http-client:google-http-client-jackson2:jar:1.22.0 in the shaded
jar.
[INFO] Including com.google.http-client:google-http-client-protobuf:jar:1.22.0 in the shaded
jar.
[INFO] Including com.google.oauth-client:google-oauth-client-java6:jar:1.22.0 in the shaded
jar.
[INFO] Including com.google.oauth-client:google-oauth-client:jar:1.22.0 in the shaded jar.
[INFO] Including com.google.cloud.bigdataoss:gcsio:jar:1.4.5 in the shaded jar.
[INFO] Including com.google.api-client:google-api-client-java6:jar:1.22.0 in the shaded jar.
[INFO] Including com.google.api-client:google-api-client-jackson2:jar:1.22.0 in the shaded
jar.
[INFO] Including com.google.cloud.bigdataoss:util:jar:1.4.5 in the shaded jar.
[INFO] Including com.google.protobuf:protobuf-java:jar:3.0.0-beta-1 in the shaded jar.
[INFO] Including com.fasterxml.jackson.core:jackson-core:jar:2.7.2 in the shaded jar.
[INFO] Including com.fasterxml.jackson.core:jackson-databind:jar:2.7.2 in the shaded jar.
[INFO] Including net.bytebuddy:byte-buddy:jar:1.4.3 in the shaded jar.
[INFO] Including org.apache.avro:avro:jar:1.8.1 in the shaded jar.
[INFO] Including org.codehaus.jackson:jackson-core-asl:jar:1.9.13 in the shaded jar.
[INFO] Including org.codehaus.jackson:jackson-mapper-asl:jar:1.9.13 in the shaded jar.
[INFO] Including com.thoughtworks.paranamer:paranamer:jar:2.7 in the shaded jar.
[INFO] Including org.tukaani:xz:jar:1.5 in the shaded jar.
[INFO] Including org.xerial.snappy:snappy-java:jar:1.1.2.1 in the shaded jar.
[INFO] Including org.apache.commons:commons-compress:jar:1.9 in the shaded jar.
[INFO] Including com.fasterxml.jackson.core:jackson-annotations:jar:2.7.2 in the shaded jar.
[INFO] Including com.google.code.findbugs:annotations:jar:3.0.1 in the shaded jar.
[INFO] Including net.jcip:jcip-annotations:jar:1.0 in the shaded jar.
[INFO] Including com.google.code.findbugs:jsr305:jar:3.0.1 in the shaded jar.
[INFO] Excluding com.google.guava:guava:jar:19.0 from the shaded jar.
[INFO] Including joda-time:joda-time:jar:2.4 in the shaded jar.
[INFO] Including org.slf4j:slf4j-api:jar:1.7.14 in the shaded jar.
[WARNING] jsr305-3.0.1.jar, annotations-3.0.1.jar define 35 overlapping classes: 
[WARNING]   - javax.annotation.RegEx
[WARNING]   - javax.annotation.concurrent.Immutable
[WARNING]   - javax.annotation.meta.TypeQualifierDefault
[WARNING]   - javax.annotation.meta.TypeQualifier
[WARNING]   - javax.annotation.Syntax
[WARNING]   - javax.annotation.Nonnull
[WARNING]   - javax.annotation.CheckReturnValue
[WARNING]   - javax.annotation.CheckForNull
[WARNING]   - javax.annotation.meta.TypeQualifierNickname
[WARNING]   - javax.annotation.MatchesPattern
[WARNING]   - 25 more...
[WARNING] beam-runners-core-java-0.3.0-incubating-SNAPSHOT.jar, beam-sdks-java-core-0.3.0-incubating-SNAPSHOT.jar
define 1717 overlapping classes: 
[WARNING]   - org.apache.beam.sdk.repackaged.com.google.common.collect.TreeRangeSet$ComplementRangesByLowerBound$2
[WARNING]   - org.apache.beam.sdk.repackaged.com.google.common.collect.WellBehavedMap$EntrySet$1$1
[WARNING]   - org.apache.beam.sdk.repackaged.com.google.common.util.concurrent.CycleDetectingLockFactory$Policies$1
[WARNING]   - org.apache.beam.sdk.repackaged.com.google.common.collect.Maps$6
[WARNING]   - org.apache.beam.sdk.repackaged.com.google.common.primitives.UnsignedBytes$LexicographicalComparatorHolder$UnsafeComparator$1
[WARNING]   - org.apache.beam.sdk.repackaged.com.google.common.collect.Range$1
[WARNING]   - org.apache.beam.sdk.repackaged.com.google.common.collect.Collections2$OrderedPermutationCollection
[WARNING]   - org.apache.beam.sdk.repackaged.com.google.common.base.Splitter$2
[WARNING]   - org.apache.beam.sdk.repackaged.com.google.common.base.Equivalence$Identity
[WARNING]   - org.apache.beam.sdk.repackaged.com.google.common.collect.Lists$1
[WARNING]   - 1707 more...
[WARNING] annotations-3.0.1.jar, jcip-annotations-1.0.jar define 4 overlapping classes: 
[WARNING]   - net.jcip.annotations.GuardedBy
[WARNING]   - net.jcip.annotations.NotThreadSafe
[WARNING]   - net.jcip.annotations.ThreadSafe
[WARNING]   - net.jcip.annotations.Immutable
[WARNING] maven-shade-plugin has detected that some class files are
[WARNING] present in two or more JARs. When this happens, only one
[WARNING] single version of the class is copied to the uber jar.
[WARNING] Usually this is not harmful and you can skip these warnings,
[WARNING] otherwise try to manually exclude artifacts based on
[WARNING] mvn dependency:tree -Ddetail=true and the above output.
[WARNING] See http://docs.codehaus.org/display/MAVENUSER/Shade+Plugin
[INFO] Replacing <https://builds.apache.org/job/beam_PostCommit_RunnableOnService_GearpumpLocal/ws/runners/core-java/target/beam-runners-core-java-bundled-0.3.0-incubating-SNAPSHOT.jar>
with <https://builds.apache.org/job/beam_PostCommit_RunnableOnService_GearpumpLocal/ws/runners/core-java/target/beam-runners-core-java-0.3.0-incubating-SNAPSHOT-shaded.jar>
[INFO] 
[INFO] --- maven-surefire-plugin:2.18.1:test (runnable-on-service-tests) @ beam-runners-core-java
---
[WARNING] useSystemClassloader setting has no effect when not forking
[INFO] Surefire report directory: <https://builds.apache.org/job/beam_PostCommit_RunnableOnService_GearpumpLocal/ws/runners/core-java/target/surefire-reports>
[INFO] Using configured provider org.apache.maven.surefire.junitcore.JUnitCoreProvider
[INFO] parallel='all', perCoreThreadCount=true, threadCount=4, useUnlimitedThreads=false,
threadCountSuites=0, threadCountClasses=0, threadCountMethods=0, parallelOptimized=true

Results :

Tests run: 0, Failures: 0, Errors: 0, Skipped: 0

[JENKINS] Recording test results
[INFO] 
[INFO] --- maven-dependency-plugin:2.10:analyze-only (default) @ beam-runners-core-java ---
[INFO] No dependency problems found
[INFO]                                                                         
[INFO] ------------------------------------------------------------------------
[INFO] Building Apache Beam :: Runners :: Gearpump 0.3.0-incubating-SNAPSHOT
[INFO] ------------------------------------------------------------------------
[WARNING] The POM for org.apache.gearpump:gearpump-streaming_2.11:jar:0.8.1-SNAPSHOT is missing,
no dependency information available
[WARNING] The POM for org.apache.gearpump:gearpump-core_2.11:jar:0.8.1-SNAPSHOT is missing,
no dependency information available
[WARNING] The POM for org.apache.gearpump:gearpump-daemon_2.11:jar:0.8.1-SNAPSHOT is missing,
no dependency information available
[INFO] ------------------------------------------------------------------------
[INFO] Reactor Summary:
[INFO] 
[INFO] Apache Beam :: Parent .............................. SUCCESS [  4.667 s]
[INFO] Apache Beam :: SDKs ................................ SUCCESS [  0.634 s]
[INFO] Apache Beam :: SDKs :: Java ........................ SUCCESS [  1.217 s]
[INFO] Apache Beam :: SDKs :: Java :: Build Tools ......... SUCCESS [  2.261 s]
[INFO] Apache Beam :: SDKs :: Java :: Core ................ SUCCESS [02:24 min]
[INFO] Apache Beam :: Runners ............................. SUCCESS [  0.641 s]
[INFO] Apache Beam :: Runners :: Core Java ................ SUCCESS [ 35.108 s]
[INFO] Apache Beam :: Runners :: Gearpump ................. FAILURE [  0.038 s]
[INFO] ------------------------------------------------------------------------
[INFO] BUILD FAILURE
[INFO] ------------------------------------------------------------------------
[INFO] Total time: 03:25 min
[INFO] Finished at: 2016-08-26T11:16:51+00:00
[INFO] Final Memory: 132M/914M
[INFO] ------------------------------------------------------------------------
[ERROR] Failed to execute goal on project beam-runners-gearpump: Could not resolve dependencies
for project org.apache.beam:beam-runners-gearpump:jar:0.3.0-incubating-SNAPSHOT: The following
artifacts could not be resolved: org.apache.gearpump:gearpump-streaming_2.11:jar:0.8.1-SNAPSHOT,
org.apache.gearpump:gearpump-core_2.11:jar:0.8.1-SNAPSHOT, org.apache.gearpump:gearpump-daemon_2.11:jar:0.8.1-SNAPSHOT:
Failure to find org.apache.gearpump:gearpump-streaming_2.11:jar:0.8.1-SNAPSHOT in http://repository.apache.org/snapshots
was cached in the local repository, resolution will not be reattempted until the update interval
of Nexus has elapsed or updates are forced -> [Help 1]
org.apache.maven.lifecycle.LifecycleExecutionException: Failed to execute goal on project
beam-runners-gearpump: Could not resolve dependencies for project org.apache.beam:beam-runners-gearpump:jar:0.3.0-incubating-SNAPSHOT:
The following artifacts could not be resolved: org.apache.gearpump:gearpump-streaming_2.11:jar:0.8.1-SNAPSHOT,
org.apache.gearpump:gearpump-core_2.11:jar:0.8.1-SNAPSHOT, org.apache.gearpump:gearpump-daemon_2.11:jar:0.8.1-SNAPSHOT:
Failure to find org.apache.gearpump:gearpump-streaming_2.11:jar:0.8.1-SNAPSHOT in http://repository.apache.org/snapshots
was cached in the local repository, resolution will not be reattempted until the update interval
of Nexus has elapsed or updates are forced
	at org.apache.maven.lifecycle.internal.LifecycleDependencyResolver.getDependencies(LifecycleDependencyResolver.java:221)
	at org.apache.maven.lifecycle.internal.LifecycleDependencyResolver.resolveProjectDependencies(LifecycleDependencyResolver.java:127)
	at org.apache.maven.lifecycle.internal.MojoExecutor.ensureDependenciesAreResolved(MojoExecutor.java:257)
	at org.apache.maven.lifecycle.internal.MojoExecutor.execute(MojoExecutor.java:200)
	at org.apache.maven.lifecycle.internal.MojoExecutor.execute(MojoExecutor.java:153)
	at org.apache.maven.lifecycle.internal.MojoExecutor.execute(MojoExecutor.java:145)
	at org.apache.maven.lifecycle.internal.LifecycleModuleBuilder.buildProject(LifecycleModuleBuilder.java:116)
	at org.apache.maven.lifecycle.internal.LifecycleModuleBuilder.buildProject(LifecycleModuleBuilder.java:80)
	at org.apache.maven.lifecycle.internal.builder.singlethreaded.SingleThreadedBuilder.build(SingleThreadedBuilder.java:51)
	at org.apache.maven.lifecycle.internal.LifecycleStarter.execute(LifecycleStarter.java:128)
	at org.apache.maven.DefaultMaven.doExecute(DefaultMaven.java:307)
	at org.apache.maven.DefaultMaven.doExecute(DefaultMaven.java:193)
	at org.apache.maven.DefaultMaven.execute(DefaultMaven.java:106)
	at org.jvnet.hudson.maven3.launcher.Maven32Launcher.main(Maven32Launcher.java:132)
	at sun.reflect.NativeMethodAccessorImpl.invoke0(Native Method)
	at sun.reflect.NativeMethodAccessorImpl.invoke(NativeMethodAccessorImpl.java:62)
	at sun.reflect.DelegatingMethodAccessorImpl.invoke(DelegatingMethodAccessorImpl.java:43)
	at java.lang.reflect.Method.invoke(Method.java:498)
	at org.codehaus.plexus.classworlds.launcher.Launcher.launchStandard(Launcher.java:330)
	at org.codehaus.plexus.classworlds.launcher.Launcher.launch(Launcher.java:238)
	at jenkins.maven3.agent.Maven32Main.launch(Maven32Main.java:186)
	at sun.reflect.NativeMethodAccessorImpl.invoke0(Native Method)
	at sun.reflect.NativeMethodAccessorImpl.invoke(NativeMethodAccessorImpl.java:62)
	at sun.reflect.DelegatingMethodAccessorImpl.invoke(DelegatingMethodAccessorImpl.java:43)
	at java.lang.reflect.Method.invoke(Method.java:498)
	at hudson.maven.Maven3Builder.call(Maven3Builder.java:136)
	at hudson.maven.Maven3Builder.call(Maven3Builder.java:71)
	at hudson.remoting.UserRequest.perform(UserRequest.java:153)
	at hudson.remoting.UserRequest.perform(UserRequest.java:50)
	at hudson.remoting.Request$2.run(Request.java:332)
	at hudson.remoting.InterceptingExecutorService$1.call(InterceptingExecutorService.java:68)
	at java.util.concurrent.FutureTask.run(FutureTask.java:266)
	at java.util.concurrent.ThreadPoolExecutor.runWorker(ThreadPoolExecutor.java:1142)
	at java.util.concurrent.ThreadPoolExecutor$Worker.run(ThreadPoolExecutor.java:617)
	at java.lang.Thread.run(Thread.java:745)
Caused by: org.apache.maven.project.DependencyResolutionException: Could not resolve dependencies
for project org.apache.beam:beam-runners-gearpump:jar:0.3.0-incubating-SNAPSHOT: The following
artifacts could not be resolved: org.apache.gearpump:gearpump-streaming_2.11:jar:0.8.1-SNAPSHOT,
org.apache.gearpump:gearpump-core_2.11:jar:0.8.1-SNAPSHOT, org.apache.gearpump:gearpump-daemon_2.11:jar:0.8.1-SNAPSHOT:
Failure to find org.apache.gearpump:gearpump-streaming_2.11:jar:0.8.1-SNAPSHOT in http://repository.apache.org/snapshots
was cached in the local repository, resolution will not be reattempted until the update interval
of Nexus has elapsed or updates are forced
	at org.apache.maven.project.DefaultProjectDependenciesResolver.resolve(DefaultProjectDependenciesResolver.java:211)
	at org.apache.maven.lifecycle.internal.LifecycleDependencyResolver.getDependencies(LifecycleDependencyResolver.java:195)
	... 34 more
Caused by: org.eclipse.aether.resolution.DependencyResolutionException: The following artifacts
could not be resolved: org.apache.gearpump:gearpump-streaming_2.11:jar:0.8.1-SNAPSHOT, org.apache.gearpump:gearpump-core_2.11:jar:0.8.1-SNAPSHOT,
org.apache.gearpump:gearpump-daemon_2.11:jar:0.8.1-SNAPSHOT: Failure to find org.apache.gearpump:gearpump-streaming_2.11:jar:0.8.1-SNAPSHOT
in http://repository.apache.org/snapshots was cached in the local repository, resolution will
not be reattempted until the update interval of Nexus has elapsed or updates are forced
	at org.eclipse.aether.internal.impl.DefaultRepositorySystem.resolveDependencies(DefaultRepositorySystem.java:384)
	at org.apache.maven.project.DefaultProjectDependenciesResolver.resolve(DefaultProjectDependenciesResolver.java:205)
	... 35 more
Caused by: org.eclipse.aether.resolution.ArtifactResolutionException: The following artifacts
could not be resolved: org.apache.gearpump:gearpump-streaming_2.11:jar:0.8.1-SNAPSHOT, org.apache.gearpump:gearpump-core_2.11:jar:0.8.1-SNAPSHOT,
org.apache.gearpump:gearpump-daemon_2.11:jar:0.8.1-SNAPSHOT: Failure to find org.apache.gearpump:gearpump-streaming_2.11:jar:0.8.1-SNAPSHOT
in http://repository.apache.org/snapshots was cached in the local repository, resolution will
not be reattempted until the update interval of Nexus has elapsed or updates are forced
	at org.eclipse.aether.internal.impl.DefaultArtifactResolver.resolve(DefaultArtifactResolver.java:444)
	at org.eclipse.aether.internal.impl.DefaultArtifactResolver.resolveArtifacts(DefaultArtifactResolver.java:246)
	at org.eclipse.aether.internal.impl.DefaultRepositorySystem.resolveDependencies(DefaultRepositorySystem.java:367)
	... 36 more
Caused by: org.eclipse.aether.transfer.ArtifactNotFoundException: Failure to find org.apache.gearpump:gearpump-streaming_2.11:jar:0.8.1-SNAPSHOT
in http://repository.apache.org/snapshots was cached in the local repository, resolution will
not be reattempted until the update interval of Nexus has elapsed or updates are forced
	at org.eclipse.aether.internal.impl.DefaultUpdateCheckManager.newException(DefaultUpdateCheckManager.java:231)
	at org.eclipse.aether.internal.impl.DefaultUpdateCheckManager.checkArtifact(DefaultUpdateCheckManager.java:206)
	at org.eclipse.aether.internal.impl.DefaultArtifactResolver.gatherDownloads(DefaultArtifactResolver.java:585)
	at org.eclipse.aether.internal.impl.DefaultArtifactResolver.performDownloads(DefaultArtifactResolver.java:503)
	at org.eclipse.aether.internal.impl.DefaultArtifactResolver.resolve(DefaultArtifactResolver.java:421)
	... 38 more
[ERROR] 
[ERROR] Re-run Maven using the -X switch to enable full debug logging.
[ERROR] 
[ERROR] For more information about the errors and possible solutions, please read the following
articles:
[ERROR] [Help 1] http://cwiki.apache.org/confluence/display/MAVEN/DependencyResolutionException
[ERROR] 
[ERROR] After correcting the problems, you can resume the build with the command
[ERROR]   mvn <goals> -rf :beam-runners-gearpump
[JENKINS] Archiving <https://builds.apache.org/job/beam_PostCommit_RunnableOnService_GearpumpLocal/ws/sdks/java/build-tools/pom.xml>
to org.apache.beam/beam-sdks-java-build-tools/0.3.0-incubating-SNAPSHOT/beam-sdks-java-build-tools-0.3.0-incubating-SNAPSHOT.pom
[JENKINS] Archiving <https://builds.apache.org/job/beam_PostCommit_RunnableOnService_GearpumpLocal/ws/sdks/java/build-tools/target/beam-sdks-java-build-tools-0.3.0-incubating-SNAPSHOT.jar>
to org.apache.beam/beam-sdks-java-build-tools/0.3.0-incubating-SNAPSHOT/beam-sdks-java-build-tools-0.3.0-incubating-SNAPSHOT.jar
[JENKINS] Archiving <https://builds.apache.org/job/beam_PostCommit_RunnableOnService_GearpumpLocal/ws/sdks/java/build-tools/target/beam-sdks-java-build-tools-0.3.0-incubating-SNAPSHOT-tests.jar>
to org.apache.beam/beam-sdks-java-build-tools/0.3.0-incubating-SNAPSHOT/beam-sdks-java-build-tools-0.3.0-incubating-SNAPSHOT-tests.jar
[JENKINS] Archiving <https://builds.apache.org/job/beam_PostCommit_RunnableOnService_GearpumpLocal/ws/sdks/java/core/dependency-reduced-pom.xml>
to org.apache.beam/beam-sdks-java-core/0.3.0-incubating-SNAPSHOT/beam-sdks-java-core-0.3.0-incubating-SNAPSHOT.pom
[JENKINS] Archiving <https://builds.apache.org/job/beam_PostCommit_RunnableOnService_GearpumpLocal/ws/sdks/java/core/target/beam-sdks-java-core-0.3.0-incubating-SNAPSHOT.jar>
to org.apache.beam/beam-sdks-java-core/0.3.0-incubating-SNAPSHOT/beam-sdks-java-core-0.3.0-incubating-SNAPSHOT.jar
[JENKINS] Archiving <https://builds.apache.org/job/beam_PostCommit_RunnableOnService_GearpumpLocal/ws/sdks/java/core/target/beam-sdks-java-core-0.3.0-incubating-SNAPSHOT-tests.jar>
to org.apache.beam/beam-sdks-java-core/0.3.0-incubating-SNAPSHOT/beam-sdks-java-core-0.3.0-incubating-SNAPSHOT-tests.jar
[JENKINS] Archiving <https://builds.apache.org/job/beam_PostCommit_RunnableOnService_GearpumpLocal/ws/runners/core-java/dependency-reduced-pom.xml>
to org.apache.beam/beam-runners-core-java/0.3.0-incubating-SNAPSHOT/beam-runners-core-java-0.3.0-incubating-SNAPSHOT.pom
[JENKINS] Archiving <https://builds.apache.org/job/beam_PostCommit_RunnableOnService_GearpumpLocal/ws/runners/core-java/target/beam-runners-core-java-0.3.0-incubating-SNAPSHOT.jar>
to org.apache.beam/beam-runners-core-java/0.3.0-incubating-SNAPSHOT/beam-runners-core-java-0.3.0-incubating-SNAPSHOT.jar
[JENKINS] Archiving <https://builds.apache.org/job/beam_PostCommit_RunnableOnService_GearpumpLocal/ws/runners/core-java/target/beam-runners-core-java-0.3.0-incubating-SNAPSHOT-tests.jar>
to org.apache.beam/beam-runners-core-java/0.3.0-incubating-SNAPSHOT/beam-runners-core-java-0.3.0-incubating-SNAPSHOT-tests.jar
[JENKINS] Archiving <https://builds.apache.org/job/beam_PostCommit_RunnableOnService_GearpumpLocal/ws/runners/core-java/target/beam-runners-core-java-0.3.0-incubating-SNAPSHOT-javadoc.jar>
to org.apache.beam/beam-runners-core-java/0.3.0-incubating-SNAPSHOT/beam-runners-core-java-0.3.0-incubating-SNAPSHOT-javadoc.jar
[JENKINS] Archiving <https://builds.apache.org/job/beam_PostCommit_RunnableOnService_GearpumpLocal/ws/sdks/java/pom.xml>
to org.apache.beam/beam-sdks-java-parent/0.3.0-incubating-SNAPSHOT/beam-sdks-java-parent-0.3.0-incubating-SNAPSHOT.pom
[JENKINS] Archiving <https://builds.apache.org/job/beam_PostCommit_RunnableOnService_GearpumpLocal/ws/pom.xml>
to org.apache.beam/beam-parent/0.3.0-incubating-SNAPSHOT/beam-parent-0.3.0-incubating-SNAPSHOT.pom
Compressed 36.61 KB of artifacts by 87.4% relative to #142
[JENKINS] Archiving <https://builds.apache.org/job/beam_PostCommit_RunnableOnService_GearpumpLocal/ws/sdks/pom.xml>
to org.apache.beam/beam-sdks-parent/0.3.0-incubating-SNAPSHOT/beam-sdks-parent-0.3.0-incubating-SNAPSHOT.pom
[JENKINS] Archiving <https://builds.apache.org/job/beam_PostCommit_RunnableOnService_GearpumpLocal/ws/runners/pom.xml>
to org.apache.beam/beam-runners-parent/0.3.0-incubating-SNAPSHOT/beam-runners-parent-0.3.0-incubating-SNAPSHOT.pom
channel stopped

Mime
View raw message