beam-commits mailing list archives

Site index · List index
Message view « Date » · « Thread »
Top « Date » · « Thread »
From Apache Jenkins Server <jenk...@builds.apache.org>
Subject Build failed in Jenkins: beam_PostCommit_RunnableOnService_GoogleCloudDataflow #750
Date Wed, 13 Jul 2016 20:33:15 GMT
See <https://builds.apache.org/job/beam_PostCommit_RunnableOnService_GoogleCloudDataflow/750/changes>

Changes:

[lcwik] [BEAM-446] Improve IOChannelUtils.resolve to accept multiple paths

[lcwik] remove old method and fix javadoc

[lcwik] fix javadoc issue

------------------------------------------
[...truncated 7004 lines...]
[INFO] Excluding org.tukaani:xz:jar:1.5 from the shaded jar.
[INFO] Excluding com.google.auto.service:auto-service:jar:1.0-rc2 from the shaded jar.
[INFO] Excluding com.google.auto:auto-common:jar:0.3 from the shaded jar.
[INFO] Replacing original artifact with shaded artifact.
[INFO] Replacing <https://builds.apache.org/job/beam_PostCommit_RunnableOnService_GoogleCloudDataflow/ws/sdks/java/core/target/beam-sdks-java-core-0.2.0-incubating-SNAPSHOT.jar>
with <https://builds.apache.org/job/beam_PostCommit_RunnableOnService_GoogleCloudDataflow/ws/sdks/java/core/target/beam-sdks-java-core-0.2.0-incubating-SNAPSHOT-shaded.jar>
[INFO] Replacing original test artifact with shaded test artifact.
[INFO] Replacing <https://builds.apache.org/job/beam_PostCommit_RunnableOnService_GoogleCloudDataflow/ws/sdks/java/core/target/beam-sdks-java-core-0.2.0-incubating-SNAPSHOT-tests.jar>
with <https://builds.apache.org/job/beam_PostCommit_RunnableOnService_GoogleCloudDataflow/ws/sdks/java/core/target/beam-sdks-java-core-0.2.0-incubating-SNAPSHOT-shaded-tests.jar>
[INFO] Dependency-reduced POM written at: <https://builds.apache.org/job/beam_PostCommit_RunnableOnService_GoogleCloudDataflow/ws/sdks/java/core/dependency-reduced-pom.xml>
[INFO] Dependency-reduced POM written at: <https://builds.apache.org/job/beam_PostCommit_RunnableOnService_GoogleCloudDataflow/ws/sdks/java/core/dependency-reduced-pom.xml>
[INFO] 
[INFO] --- maven-shade-plugin:2.4.1:shade (bundle-rest-without-repackaging) @ beam-sdks-java-core
---
[INFO] Including io.grpc:grpc-all:jar:0.13.1 in the shaded jar.
[INFO] Including io.grpc:grpc-auth:jar:0.13.1 in the shaded jar.
[INFO] Including io.grpc:grpc-netty:jar:0.13.1 in the shaded jar.
[INFO] Including io.netty:netty-codec-http2:jar:4.1.0.CR1 in the shaded jar.
[INFO] Including io.netty:netty-codec-http:jar:4.1.0.CR1 in the shaded jar.
[INFO] Including io.grpc:grpc-protobuf:jar:0.13.1 in the shaded jar.
[INFO] Including io.grpc:grpc-core:jar:0.13.1 in the shaded jar.
[INFO] Including io.grpc:grpc-okhttp:jar:0.13.1 in the shaded jar.
[INFO] Including com.squareup.okio:okio:jar:1.6.0 in the shaded jar.
[INFO] Including com.squareup.okhttp:okhttp:jar:2.5.0 in the shaded jar.
[INFO] Including io.grpc:grpc-protobuf-nano:jar:0.13.1 in the shaded jar.
[INFO] Including com.google.protobuf.nano:protobuf-javanano:jar:3.0.0-alpha-5 in the shaded
jar.
[INFO] Including io.grpc:grpc-stub:jar:0.13.1 in the shaded jar.
[INFO] Including com.google.auth:google-auth-library-oauth2-http:jar:0.4.0 in the shaded jar.
[INFO] Including com.google.auth:google-auth-library-credentials:jar:0.4.0 in the shaded jar.
[INFO] Including io.netty:netty-handler:jar:4.1.0.CR1 in the shaded jar.
[INFO] Including io.netty:netty-buffer:jar:4.1.0.CR1 in the shaded jar.
[INFO] Including io.netty:netty-common:jar:4.1.0.CR1 in the shaded jar.
[INFO] Including io.netty:netty-transport:jar:4.1.0.CR1 in the shaded jar.
[INFO] Including io.netty:netty-resolver:jar:4.1.0.CR1 in the shaded jar.
[INFO] Including io.netty:netty-codec:jar:4.1.0.CR1 in the shaded jar.
[INFO] Including com.google.api.grpc:grpc-pubsub-v1:jar:0.0.2 in the shaded jar.
[INFO] Including com.google.api.grpc:grpc-core-proto:jar:0.0.3 in the shaded jar.
[INFO] Including com.google.api-client:google-api-client:jar:1.22.0 in the shaded jar.
[INFO] Including com.google.apis:google-api-services-bigquery:jar:v2-rev295-1.22.0 in the
shaded jar.
[INFO] Including com.google.apis:google-api-services-pubsub:jar:v1-rev10-1.22.0 in the shaded
jar.
[INFO] Including com.google.apis:google-api-services-storage:jar:v1-rev71-1.22.0 in the shaded
jar.
[INFO] Including com.google.http-client:google-http-client:jar:1.22.0 in the shaded jar.
[INFO] Including org.apache.httpcomponents:httpclient:jar:4.0.1 in the shaded jar.
[INFO] Including org.apache.httpcomponents:httpcore:jar:4.0.1 in the shaded jar.
[INFO] Including commons-logging:commons-logging:jar:1.1.1 in the shaded jar.
[INFO] Including commons-codec:commons-codec:jar:1.3 in the shaded jar.
[INFO] Including com.google.http-client:google-http-client-jackson:jar:1.22.0 in the shaded
jar.
[INFO] Including com.google.http-client:google-http-client-jackson2:jar:1.22.0 in the shaded
jar.
[INFO] Including com.google.http-client:google-http-client-protobuf:jar:1.22.0 in the shaded
jar.
[INFO] Including com.google.oauth-client:google-oauth-client-java6:jar:1.22.0 in the shaded
jar.
[INFO] Including com.google.oauth-client:google-oauth-client:jar:1.22.0 in the shaded jar.
[INFO] Including com.google.cloud.bigdataoss:gcsio:jar:1.4.5 in the shaded jar.
[INFO] Including com.google.api-client:google-api-client-java6:jar:1.22.0 in the shaded jar.
[INFO] Including com.google.api-client:google-api-client-jackson2:jar:1.22.0 in the shaded
jar.
[INFO] Including com.google.cloud.bigdataoss:util:jar:1.4.5 in the shaded jar.
[INFO] Excluding com.google.guava:guava:jar:19.0 from the shaded jar.
[INFO] Including com.google.protobuf:protobuf-java:jar:3.0.0-beta-1 in the shaded jar.
[INFO] Including com.google.code.findbugs:annotations:jar:3.0.1 in the shaded jar.
[INFO] Including net.jcip:jcip-annotations:jar:1.0 in the shaded jar.
[INFO] Including com.google.code.findbugs:jsr305:jar:3.0.1 in the shaded jar.
[INFO] Including com.fasterxml.jackson.core:jackson-core:jar:2.7.2 in the shaded jar.
[INFO] Including com.fasterxml.jackson.core:jackson-annotations:jar:2.7.2 in the shaded jar.
[INFO] Including com.fasterxml.jackson.core:jackson-databind:jar:2.7.2 in the shaded jar.
[INFO] Including org.slf4j:slf4j-api:jar:1.7.14 in the shaded jar.
[INFO] Including org.apache.avro:avro:jar:1.7.7 in the shaded jar.
[INFO] Including org.codehaus.jackson:jackson-core-asl:jar:1.9.13 in the shaded jar.
[INFO] Including org.codehaus.jackson:jackson-mapper-asl:jar:1.9.13 in the shaded jar.
[INFO] Including com.thoughtworks.paranamer:paranamer:jar:2.3 in the shaded jar.
[INFO] Including org.xerial.snappy:snappy-java:jar:1.1.2.1 in the shaded jar.
[INFO] Including org.apache.commons:commons-compress:jar:1.9 in the shaded jar.
[INFO] Including joda-time:joda-time:jar:2.4 in the shaded jar.
[INFO] Including org.codehaus.woodstox:stax2-api:jar:3.1.4 in the shaded jar.
[INFO] Including org.codehaus.woodstox:woodstox-core-asl:jar:4.4.1 in the shaded jar.
[INFO] Including org.tukaani:xz:jar:1.5 in the shaded jar.
[INFO] Including com.google.auto.service:auto-service:jar:1.0-rc2 in the shaded jar.
[INFO] Including com.google.auto:auto-common:jar:0.3 in the shaded jar.
[WARNING] grpc-netty-0.13.1.jar, grpc-all-0.13.1.jar define 78 overlapping classes: 
[WARNING]   - io.grpc.netty.AbstractNettyHandler
[WARNING]   - io.grpc.netty.NettyClientTransport
[WARNING]   - io.grpc.netty.NettyClientStream$1
[WARNING]   - io.grpc.netty.SendResponseHeadersCommand
[WARNING]   - io.grpc.netty.NettyServer$2
[WARNING]   - io.grpc.netty.NettyClientHandler$4
[WARNING]   - io.grpc.netty.NettyClientTransport$3
[WARNING]   - io.grpc.netty.NettyClientHandler$FrameListener
[WARNING]   - io.grpc.netty.ProtocolNegotiators$1
[WARNING]   - io.grpc.netty.JettyTlsUtil
[WARNING]   - 68 more...
[WARNING] grpc-all-0.13.1.jar, grpc-stub-0.13.1.jar define 30 overlapping classes: 
[WARNING]   - io.grpc.stub.ServerCalls$UnaryRequestMethod
[WARNING]   - io.grpc.stub.StreamObserver
[WARNING]   - io.grpc.stub.ClientCalls$CallToStreamObserverAdapter
[WARNING]   - io.grpc.stub.ServerCalls$EmptyServerCallListener
[WARNING]   - io.grpc.stub.MetadataUtils$2$1
[WARNING]   - io.grpc.stub.MetadataUtils$1$1
[WARNING]   - io.grpc.stub.MetadataUtils$2$1$1
[WARNING]   - io.grpc.stub.MetadataUtils
[WARNING]   - io.grpc.stub.ServerCalls$1
[WARNING]   - io.grpc.stub.ServerCalls$ClientStreamingMethod
[WARNING]   - 20 more...
[WARNING] grpc-core-0.13.1.jar, grpc-all-0.13.1.jar define 254 overlapping classes: 
[WARNING]   - io.grpc.ClientInterceptors$1
[WARNING]   - io.grpc.internal.DelayedClientTransport$1
[WARNING]   - io.grpc.internal.AbstractReferenceCounted
[WARNING]   - io.grpc.inprocess.InProcessTransport
[WARNING]   - io.grpc.internal.ServerImpl
[WARNING]   - io.grpc.internal.MessageFramer$OutputStreamAdapter
[WARNING]   - io.grpc.internal.ReadableBuffers$BufferInputStream
[WARNING]   - io.grpc.internal.SerializingExecutor$TaskRunner
[WARNING]   - io.grpc.internal.SharedResourceHolder$ScheduledExecutorFactory
[WARNING]   - io.grpc.internal.ContextRunnable
[WARNING]   - 244 more...
[WARNING] grpc-all-0.13.1.jar, grpc-okhttp-0.13.1.jar define 75 overlapping classes: 
[WARNING]   - io.grpc.okhttp.OkHttpSettingsUtil
[WARNING]   - io.grpc.okhttp.NegotiationType
[WARNING]   - io.grpc.okhttp.AsyncFrameWriter$12
[WARNING]   - io.grpc.okhttp.OkHttpTlsUpgrader
[WARNING]   - io.grpc.okhttp.AsyncFrameWriter$WriteRunnable
[WARNING]   - io.grpc.okhttp.Utils
[WARNING]   - io.grpc.okhttp.OkHttpProtocolNegotiator$AndroidNegotiator
[WARNING]   - io.grpc.okhttp.OkHttpChannelBuilder$2
[WARNING]   - io.grpc.okhttp.internal.framed.Huffman$Node
[WARNING]   - io.grpc.okhttp.AsyncFrameWriter$7
[WARNING]   - 65 more...
[WARNING] annotations-3.0.1.jar, jcip-annotations-1.0.jar define 4 overlapping classes: 
[WARNING]   - net.jcip.annotations.GuardedBy
[WARNING]   - net.jcip.annotations.NotThreadSafe
[WARNING]   - net.jcip.annotations.ThreadSafe
[WARNING]   - net.jcip.annotations.Immutable
[WARNING] grpc-auth-0.13.1.jar, grpc-all-0.13.1.jar define 2 overlapping classes: 
[WARNING]   - io.grpc.auth.ClientAuthInterceptor$1
[WARNING]   - io.grpc.auth.ClientAuthInterceptor
[WARNING] jsr305-3.0.1.jar, annotations-3.0.1.jar define 35 overlapping classes: 
[WARNING]   - javax.annotation.RegEx
[WARNING]   - javax.annotation.concurrent.Immutable
[WARNING]   - javax.annotation.meta.TypeQualifierDefault
[WARNING]   - javax.annotation.meta.TypeQualifier
[WARNING]   - javax.annotation.Syntax
[WARNING]   - javax.annotation.Nonnull
[WARNING]   - javax.annotation.CheckReturnValue
[WARNING]   - javax.annotation.CheckForNull
[WARNING]   - javax.annotation.meta.TypeQualifierNickname
[WARNING]   - javax.annotation.MatchesPattern
[WARNING]   - 25 more...
[WARNING] grpc-protobuf-nano-0.13.1.jar, grpc-all-0.13.1.jar define 4 overlapping classes:

[WARNING]   - io.grpc.protobuf.nano.NanoProtoInputStream
[WARNING]   - io.grpc.protobuf.nano.NanoUtils
[WARNING]   - io.grpc.protobuf.nano.NanoUtils$1
[WARNING]   - io.grpc.protobuf.nano.MessageNanoFactory
[WARNING] grpc-protobuf-0.13.1.jar, grpc-all-0.13.1.jar define 4 overlapping classes: 
[WARNING]   - io.grpc.protobuf.ProtoUtils$2
[WARNING]   - io.grpc.protobuf.ProtoUtils
[WARNING]   - io.grpc.protobuf.ProtoUtils$1
[WARNING]   - io.grpc.protobuf.ProtoInputStream
[WARNING] maven-shade-plugin has detected that some class files are
[WARNING] present in two or more JARs. When this happens, only one
[WARNING] single version of the class is copied to the uber jar.
[WARNING] Usually this is not harmful and you can skip these warnings,
[WARNING] otherwise try to manually exclude artifacts based on
[WARNING] mvn dependency:tree -Ddetail=true and the above output.
[WARNING] See http://docs.codehaus.org/display/MAVENUSER/Shade+Plugin
[INFO] Replacing <https://builds.apache.org/job/beam_PostCommit_RunnableOnService_GoogleCloudDataflow/ws/sdks/java/core/target/beam-sdks-java-core-bundled-0.2.0-incubating-SNAPSHOT.jar>
with <https://builds.apache.org/job/beam_PostCommit_RunnableOnService_GoogleCloudDataflow/ws/sdks/java/core/target/beam-sdks-java-core-0.2.0-incubating-SNAPSHOT-shaded.jar>
[INFO] 
[INFO] --- maven-dependency-plugin:2.10:analyze-only (default) @ beam-sdks-java-core ---
[INFO] No dependency problems found
[INFO] 
[INFO] --- maven-checkstyle-plugin:2.17:check (default) @ beam-sdks-java-core ---
[INFO] Starting audit...
[ERROR] <https://builds.apache.org/job/beam_PostCommit_RunnableOnService_GoogleCloudDataflow/ws/sdks/java/core/src/test/java/org/apache/beam/sdk/util/IOChannelUtilsTest.java>:33:8:
Unused import: java.io.IOException. [UnusedImports]
Audit done.
[INFO] There is 1 error reported by Checkstyle 6.17 with beam/checkstyle.xml ruleset.
[ERROR] src/test/java/org/apache/beam/sdk/util/IOChannelUtilsTest.java:[33,8] (imports) UnusedImports:
Unused import: java.io.IOException.
[INFO] ------------------------------------------------------------------------
[INFO] Reactor Summary:
[INFO] 
[INFO] Apache Beam :: Parent .............................. SUCCESS [  7.135 s]
[INFO] Apache Beam :: SDKs ................................ SUCCESS [  0.450 s]
[INFO] Apache Beam :: SDKs :: Java ........................ SUCCESS [  0.552 s]
[INFO] Apache Beam :: SDKs :: Java :: Build Tools ......... SUCCESS [  4.838 s]
[INFO] Apache Beam :: SDKs :: Java :: Core ................ FAILURE [03:43 min]
[INFO] Apache Beam :: Runners ............................. SKIPPED
[INFO] Apache Beam :: Runners :: Core Java ................ SKIPPED
[INFO] Apache Beam :: Runners :: Google Cloud Dataflow .... SKIPPED
[INFO] ------------------------------------------------------------------------
[INFO] BUILD FAILURE
[INFO] ------------------------------------------------------------------------
[INFO] Total time: 04:25 min
[INFO] Finished at: 2016-07-13T20:32:50+00:00
[INFO] Final Memory: 99M/929M
[INFO] ------------------------------------------------------------------------
Waiting for Jenkins to finish collecting data
[ERROR] Failed to execute goal org.apache.maven.plugins:maven-checkstyle-plugin:2.17:check
(default) on project beam-sdks-java-core: You have 1 Checkstyle violation. -> [Help 1]
org.apache.maven.lifecycle.LifecycleExecutionException: Failed to execute goal org.apache.maven.plugins:maven-checkstyle-plugin:2.17:check
(default) on project beam-sdks-java-core: You have 1 Checkstyle violation.
	at org.apache.maven.lifecycle.internal.MojoExecutor.execute(MojoExecutor.java:212)
	at org.apache.maven.lifecycle.internal.MojoExecutor.execute(MojoExecutor.java:153)
	at org.apache.maven.lifecycle.internal.MojoExecutor.execute(MojoExecutor.java:145)
	at org.apache.maven.lifecycle.internal.LifecycleModuleBuilder.buildProject(LifecycleModuleBuilder.java:116)
	at org.apache.maven.lifecycle.internal.LifecycleModuleBuilder.buildProject(LifecycleModuleBuilder.java:80)
	at org.apache.maven.lifecycle.internal.builder.singlethreaded.SingleThreadedBuilder.build(SingleThreadedBuilder.java:51)
	at org.apache.maven.lifecycle.internal.LifecycleStarter.execute(LifecycleStarter.java:128)
	at org.apache.maven.DefaultMaven.doExecute(DefaultMaven.java:307)
	at org.apache.maven.DefaultMaven.doExecute(DefaultMaven.java:193)
	at org.apache.maven.DefaultMaven.execute(DefaultMaven.java:106)
	at org.jvnet.hudson.maven3.launcher.Maven32Launcher.main(Maven32Launcher.java:132)
	at sun.reflect.NativeMethodAccessorImpl.invoke0(Native Method)
	at sun.reflect.NativeMethodAccessorImpl.invoke(NativeMethodAccessorImpl.java:62)
	at sun.reflect.DelegatingMethodAccessorImpl.invoke(DelegatingMethodAccessorImpl.java:43)
	at java.lang.reflect.Method.invoke(Method.java:497)
	at org.codehaus.plexus.classworlds.launcher.Launcher.launchStandard(Launcher.java:330)
	at org.codehaus.plexus.classworlds.launcher.Launcher.launch(Launcher.java:238)
	at jenkins.maven3.agent.Maven32Main.launch(Maven32Main.java:186)
	at sun.reflect.NativeMethodAccessorImpl.invoke0(Native Method)
	at sun.reflect.NativeMethodAccessorImpl.invoke(NativeMethodAccessorImpl.java:62)
	at sun.reflect.DelegatingMethodAccessorImpl.invoke(DelegatingMethodAccessorImpl.java:43)
	at java.lang.reflect.Method.invoke(Method.java:497)
	at hudson.maven.Maven3Builder.call(Maven3Builder.java:136)
	at hudson.maven.Maven3Builder.call(Maven3Builder.java:71)
	at hudson.remoting.UserRequest.perform(UserRequest.java:120)
	at hudson.remoting.UserRequest.perform(UserRequest.java:48)
	at hudson.remoting.Request$2.run(Request.java:326)
	at hudson.remoting.InterceptingExecutorService$1.call(InterceptingExecutorService.java:68)
	at java.util.concurrent.FutureTask.run(FutureTask.java:266)
	at java.util.concurrent.ThreadPoolExecutor.runWorker(ThreadPoolExecutor.java:1142)
	at java.util.concurrent.ThreadPoolExecutor$Worker.run(ThreadPoolExecutor.java:617)
	at java.lang.Thread.run(Thread.java:745)
Caused by: org.apache.maven.plugin.MojoFailureException: You have 1 Checkstyle violation.
	at org.apache.maven.plugin.checkstyle.CheckstyleViolationCheckMojo.execute(CheckstyleViolationCheckMojo.java:588)
	at org.apache.maven.plugin.DefaultBuildPluginManager.executeMojo(DefaultBuildPluginManager.java:134)
	at org.apache.maven.lifecycle.internal.MojoExecutor.execute(MojoExecutor.java:208)
	... 31 more
[ERROR] 
[ERROR] Re-run Maven using the -X switch to enable full debug logging.
[ERROR] 
[ERROR] For more information about the errors and possible solutions, please read the following
articles:
[ERROR] [Help 1] http://cwiki.apache.org/confluence/display/MAVEN/MojoFailureException
[ERROR] 
[ERROR] After correcting the problems, you can resume the build with the command
[ERROR]   mvn <goals> -rf :beam-sdks-java-core
[JENKINS] Archiving <https://builds.apache.org/job/beam_PostCommit_RunnableOnService_GoogleCloudDataflow/ws/sdks/pom.xml>
to org.apache.beam/beam-sdks-parent/0.2.0-incubating-SNAPSHOT/beam-sdks-parent-0.2.0-incubating-SNAPSHOT.pom
[JENKINS] Archiving <https://builds.apache.org/job/beam_PostCommit_RunnableOnService_GoogleCloudDataflow/ws/runners/core-java/pom.xml>
to org.apache.beam/beam-runners-core-java/0.2.0-incubating-SNAPSHOT/beam-runners-core-java-0.2.0-incubating-SNAPSHOT.pom
[JENKINS] Archiving <https://builds.apache.org/job/beam_PostCommit_RunnableOnService_GoogleCloudDataflow/ws/sdks/java/pom.xml>
to org.apache.beam/beam-sdks-java-parent/0.2.0-incubating-SNAPSHOT/beam-sdks-java-parent-0.2.0-incubating-SNAPSHOT.pom
[JENKINS] Archiving <https://builds.apache.org/job/beam_PostCommit_RunnableOnService_GoogleCloudDataflow/ws/runners/pom.xml>
to org.apache.beam/beam-runners-parent/0.2.0-incubating-SNAPSHOT/beam-runners-parent-0.2.0-incubating-SNAPSHOT.pom
[JENKINS] Archiving <https://builds.apache.org/job/beam_PostCommit_RunnableOnService_GoogleCloudDataflow/ws/runners/google-cloud-dataflow-java/pom.xml>
to org.apache.beam/beam-runners-google-cloud-dataflow-java/0.2.0-incubating-SNAPSHOT/beam-runners-google-cloud-dataflow-java-0.2.0-incubating-SNAPSHOT.pom
[JENKINS] Archiving <https://builds.apache.org/job/beam_PostCommit_RunnableOnService_GoogleCloudDataflow/ws/pom.xml>
to org.apache.beam/beam-parent/0.2.0-incubating-SNAPSHOT/beam-parent-0.2.0-incubating-SNAPSHOT.pom
Compressed 35.13 KB of artifacts by 91.1% relative to #749
[JENKINS] Archiving <https://builds.apache.org/job/beam_PostCommit_RunnableOnService_GoogleCloudDataflow/ws/sdks/java/core/dependency-reduced-pom.xml>
to org.apache.beam/beam-sdks-java-core/0.2.0-incubating-SNAPSHOT/beam-sdks-java-core-0.2.0-incubating-SNAPSHOT.pom
[JENKINS] Archiving <https://builds.apache.org/job/beam_PostCommit_RunnableOnService_GoogleCloudDataflow/ws/sdks/java/core/target/beam-sdks-java-core-0.2.0-incubating-SNAPSHOT.jar>
to org.apache.beam/beam-sdks-java-core/0.2.0-incubating-SNAPSHOT/beam-sdks-java-core-0.2.0-incubating-SNAPSHOT.jar
[JENKINS] Archiving <https://builds.apache.org/job/beam_PostCommit_RunnableOnService_GoogleCloudDataflow/ws/sdks/java/core/target/beam-sdks-java-core-0.2.0-incubating-SNAPSHOT-tests.jar>
to org.apache.beam/beam-sdks-java-core/0.2.0-incubating-SNAPSHOT/beam-sdks-java-core-0.2.0-incubating-SNAPSHOT-tests.jar
[JENKINS] Archiving <https://builds.apache.org/job/beam_PostCommit_RunnableOnService_GoogleCloudDataflow/ws/sdks/java/build-tools/pom.xml>
to org.apache.beam/beam-sdks-java-build-tools/0.2.0-incubating-SNAPSHOT/beam-sdks-java-build-tools-0.2.0-incubating-SNAPSHOT.pom
[JENKINS] Archiving <https://builds.apache.org/job/beam_PostCommit_RunnableOnService_GoogleCloudDataflow/ws/sdks/java/build-tools/target/beam-sdks-java-build-tools-0.2.0-incubating-SNAPSHOT.jar>
to org.apache.beam/beam-sdks-java-build-tools/0.2.0-incubating-SNAPSHOT/beam-sdks-java-build-tools-0.2.0-incubating-SNAPSHOT.jar
[JENKINS] Archiving <https://builds.apache.org/job/beam_PostCommit_RunnableOnService_GoogleCloudDataflow/ws/sdks/java/build-tools/target/beam-sdks-java-build-tools-0.2.0-incubating-SNAPSHOT-tests.jar>
to org.apache.beam/beam-sdks-java-build-tools/0.2.0-incubating-SNAPSHOT/beam-sdks-java-build-tools-0.2.0-incubating-SNAPSHOT-tests.jar
channel stopped

Mime
View raw message