beam-commits mailing list archives

Site index · List index
Message view « Date » · « Thread »
Top « Date » · « Thread »
From Apache Jenkins Server <jenk...@builds.apache.org>
Subject Build failed in Jenkins: beam_PostCommit_MavenVerify » Apache Beam :: SDKs :: Java :: Maven Archetypes :: Examples #914
Date Mon, 18 Jul 2016 18:51:15 GMT
See <https://builds.apache.org/job/beam_PostCommit_MavenVerify/org.apache.beam$beam-sdks-java-maven-archetypes-examples/914/>

------------------------------------------
[INFO]                                                                         
[INFO] ------------------------------------------------------------------------
[INFO] Building Apache Beam :: SDKs :: Java :: Maven Archetypes :: Examples 0.2.0-incubating-SNAPSHOT
[INFO] ------------------------------------------------------------------------
[INFO] 
[INFO] --- maven-clean-plugin:2.5:clean (default-clean) @ beam-sdks-java-maven-archetypes-examples
---
[INFO] Deleting <https://builds.apache.org/job/beam_PostCommit_MavenVerify/org.apache.beam$beam-sdks-java-maven-archetypes-examples/ws/target>
[INFO] 
[INFO] --- maven-enforcer-plugin:1.3.1:enforce (enforce) @ beam-sdks-java-maven-archetypes-examples
---
[INFO] 
[INFO] --- maven-remote-resources-plugin:1.5:process (default) @ beam-sdks-java-maven-archetypes-examples
---
[INFO] 
[INFO] --- maven-resources-plugin:2.7:resources (default-resources) @ beam-sdks-java-maven-archetypes-examples
---
[INFO] Using 'UTF-8' encoding to copy filtered resources.
[INFO] Copying 13 resources
[INFO] Copying 3 resources
[INFO] 
[INFO] --- maven-resources-plugin:2.7:testResources (default-testResources) @ beam-sdks-java-maven-archetypes-examples
---
[INFO] Using 'UTF-8' encoding to copy filtered resources.
[INFO] Copying 2 resources
[INFO] Copying 3 resources
[INFO] 
[INFO] --- maven-archetype-plugin:2.4:jar (default-jar) @ beam-sdks-java-maven-archetypes-examples
---
[INFO] Building archetype jar: <https://builds.apache.org/job/beam_PostCommit_MavenVerify/org.apache.beam$beam-sdks-java-maven-archetypes-examples/ws/target/beam-sdks-java-maven-archetypes-examples-0.2.0-incubating-SNAPSHOT>
[INFO] 
[INFO] --- maven-site-plugin:3.4:attach-descriptor (attach-descriptor) @ beam-sdks-java-maven-archetypes-examples
---
[INFO] 
[INFO] --- maven-dependency-plugin:2.10:analyze-only (default) @ beam-sdks-java-maven-archetypes-examples
---
[INFO] No dependency problems found
[INFO] 
[INFO] --- apache-rat-plugin:0.11:check (default) @ beam-sdks-java-maven-archetypes-examples
---
[INFO] 51 implicit excludes (use -debug for more details).
[INFO] Exclude: **/target/**/*
[INFO] Exclude: **/dependency-reduced-pom.xml
[INFO] Exclude: .github/**/*
[INFO] Exclude: **/*.iml
[INFO] Exclude: **/package-list
[INFO] Exclude: **/user.avsc
[INFO] Exclude: **/test/resources/**/*.txt
[INFO] Exclude: **/test/**/.placeholder
[INFO] Exclude: .repository/**/*
[INFO] 15 resources included (use -debug for more details)
[INFO] Rat check: Summary of files. Unapproved: 0 unknown: 0 generated: 0 approved: 15 licence.
[INFO] 
[INFO] --- maven-install-plugin:2.5.2:install (default-install) @ beam-sdks-java-maven-archetypes-examples
---
[INFO] Installing <https://builds.apache.org/job/beam_PostCommit_MavenVerify/org.apache.beam$beam-sdks-java-maven-archetypes-examples/ws/target/beam-sdks-java-maven-archetypes-examples-0.2.0-incubating-SNAPSHOT.jar>
to /home/jenkins/jenkins-slave/workspace/beam_PostCommit_MavenVerify/.repository/org/apache/beam/beam-sdks-java-maven-archetypes-examples/0.2.0-incubating-SNAPSHOT/beam-sdks-java-maven-archetypes-examples-0.2.0-incubating-SNAPSHOT.jar
[INFO] Installing <https://builds.apache.org/job/beam_PostCommit_MavenVerify/org.apache.beam$beam-sdks-java-maven-archetypes-examples/ws/pom.xml>
to /home/jenkins/jenkins-slave/workspace/beam_PostCommit_MavenVerify/.repository/org/apache/beam/beam-sdks-java-maven-archetypes-examples/0.2.0-incubating-SNAPSHOT/beam-sdks-java-maven-archetypes-examples-0.2.0-incubating-SNAPSHOT.pom
[INFO] 
[INFO] --- maven-archetype-plugin:2.4:integration-test (default-integration-test) @ beam-sdks-java-maven-archetypes-examples
---
[INFO] Processing Archetype IT project: basic
[INFO] ----------------------------------------------------------------------------
[INFO] Using following parameters for creating project from Archetype: beam-sdks-java-maven-archetypes-examples:0.2.0-incubating-SNAPSHOT
[INFO] ----------------------------------------------------------------------------
[INFO] Parameter: groupId, Value: archetype.it
[INFO] Parameter: artifactId, Value: basic
[INFO] Parameter: version, Value: 0.1
[INFO] Parameter: package, Value: it.pkg
[INFO] Parameter: packageInPathFormat, Value: it/pkg
[INFO] Parameter: version, Value: 0.1
[INFO] Parameter: package, Value: it.pkg
[INFO] Parameter: groupId, Value: archetype.it
[INFO] Parameter: targetPlatform, Value: 1.7
[INFO] Parameter: artifactId, Value: basic
[INFO] project created from Archetype in dir: <https://builds.apache.org/job/beam_PostCommit_MavenVerify/org.apache.beam$beam-sdks-java-maven-archetypes-examples/ws/target/test-classes/projects/basic/project/basic>
[INFO] Invoking post-archetype-generation goals: verify
[INFO] Java HotSpot(TM) 64-Bit Server VM warning: ignoring option MaxPermSize=512m; support
was removed in 8.0
[INFO] [INFO] Error stacktraces are turned on.
[INFO] [INFO] Scanning for projects...
[INFO] [INFO]                                                                         
[INFO] [INFO] ------------------------------------------------------------------------
[INFO] [INFO] Building basic 0.1
[INFO] [INFO] ------------------------------------------------------------------------
[INFO] [INFO] 
[INFO] [INFO] --- maven-resources-plugin:2.6:resources (default-resources) @ basic ---
[INFO] [WARNING] Using platform encoding (UTF-8 actually) to copy filtered resources, i.e.
build is platform dependent!
[INFO] [INFO] skip non existing resourceDirectory <https://builds.apache.org/job/beam_PostCommit_MavenVerify/org.apache.beam$beam-sdks-java-maven-archetypes-examples/ws/target/test-classes/projects/basic/project/basic/src/main/resources>
[INFO] [INFO] 
[INFO] [INFO] --- maven-compiler-plugin:3.3:compile (default-compile) @ basic ---
[INFO] [INFO] Changes detected - recompiling the module!
[INFO] [WARNING] File encoding has not been set, using platform encoding UTF-8, i.e. build
is platform dependent!
[INFO] [INFO] Compiling 9 source files to <https://builds.apache.org/job/beam_PostCommit_MavenVerify/org.apache.beam$beam-sdks-java-maven-archetypes-examples/ws/target/test-classes/projects/basic/project/basic/target/classes>
[INFO] [INFO] <https://builds.apache.org/job/beam_PostCommit_MavenVerify/org.apache.beam$beam-sdks-java-maven-archetypes-examples/ws/target/test-classes/projects/basic/project/basic/src/main/java/it/pkg/common/DataflowExampleUtils.java>:
Some input files use or override a deprecated API.
[INFO] [INFO] <https://builds.apache.org/job/beam_PostCommit_MavenVerify/org.apache.beam$beam-sdks-java-maven-archetypes-examples/ws/target/test-classes/projects/basic/project/basic/src/main/java/it/pkg/common/DataflowExampleUtils.java>:
Recompile with -Xlint:deprecation for details.
[INFO] [INFO] -------------------------------------------------------------
[INFO] [ERROR] COMPILATION ERROR : 
[INFO] [INFO] -------------------------------------------------------------
[INFO] [ERROR] <https://builds.apache.org/job/beam_PostCommit_MavenVerify/org.apache.beam$beam-sdks-java-maven-archetypes-examples/ws/target/test-classes/projects/basic/project/basic/src/main/java/it/pkg/common/DataflowExampleUtils.java>:[312,66]
cannot find symbol
[INFO]   symbol:   class PrintHandler
[INFO]   location: class org.apache.beam.runners.dataflow.util.MonitoringUtil
[INFO] [INFO] 1 error
[INFO] [INFO] -------------------------------------------------------------
[INFO] [INFO] ------------------------------------------------------------------------
[INFO] [INFO] BUILD FAILURE
[INFO] [INFO] ------------------------------------------------------------------------
[INFO] [INFO] Total time: 1.814 s
[INFO] [INFO] Finished at: 2016-07-18T18:47:42+00:00
[INFO] [INFO] Final Memory: 24M/388M
[INFO] [INFO] ------------------------------------------------------------------------
[INFO] [ERROR] Failed to execute goal org.apache.maven.plugins:maven-compiler-plugin:3.3:compile
(default-compile) on project basic: Compilation failure
[INFO] [ERROR] <https://builds.apache.org/job/beam_PostCommit_MavenVerify/org.apache.beam$beam-sdks-java-maven-archetypes-examples/ws/target/test-classes/projects/basic/project/basic/src/main/java/it/pkg/common/DataflowExampleUtils.java>:[312,66]
cannot find symbol
[INFO] [ERROR] symbol:   class PrintHandler
[INFO] [ERROR] location: class org.apache.beam.runners.dataflow.util.MonitoringUtil
[INFO] [ERROR] -> [Help 1]
[INFO] org.apache.maven.lifecycle.LifecycleExecutionException: Failed to execute goal org.apache.maven.plugins:maven-compiler-plugin:3.3:compile
(default-compile) on project basic: Compilation failure
[INFO] <https://builds.apache.org/job/beam_PostCommit_MavenVerify/org.apache.beam$beam-sdks-java-maven-archetypes-examples/ws/target/test-classes/projects/basic/project/basic/src/main/java/it/pkg/common/DataflowExampleUtils.java>:[312,66]
cannot find symbol
[INFO]   symbol:   class PrintHandler
[INFO]   location: class org.apache.beam.runners.dataflow.util.MonitoringUtil
[INFO] 
[INFO] 	at org.apache.maven.lifecycle.internal.MojoExecutor.execute(MojoExecutor.java:212)
[INFO] 	at org.apache.maven.lifecycle.internal.MojoExecutor.execute(MojoExecutor.java:153)
[INFO] 	at org.apache.maven.lifecycle.internal.MojoExecutor.execute(MojoExecutor.java:145)
[INFO] 	at org.apache.maven.lifecycle.internal.LifecycleModuleBuilder.buildProject(LifecycleModuleBuilder.java:116)
[INFO] 	at org.apache.maven.lifecycle.internal.LifecycleModuleBuilder.buildProject(LifecycleModuleBuilder.java:80)
[INFO] 	at org.apache.maven.lifecycle.internal.builder.singlethreaded.SingleThreadedBuilder.build(SingleThreadedBuilder.java:51)
[INFO] 	at org.apache.maven.lifecycle.internal.LifecycleStarter.execute(LifecycleStarter.java:128)
[INFO] 	at org.apache.maven.DefaultMaven.doExecute(DefaultMaven.java:307)
[INFO] 	at org.apache.maven.DefaultMaven.doExecute(DefaultMaven.java:193)
[INFO] 	at org.apache.maven.DefaultMaven.execute(DefaultMaven.java:106)
[INFO] 	at org.apache.maven.cli.MavenCli.execute(MavenCli.java:862)
[INFO] 	at org.apache.maven.cli.MavenCli.doMain(MavenCli.java:286)
[INFO] 	at org.apache.maven.cli.MavenCli.main(MavenCli.java:197)
[INFO] 	at sun.reflect.NativeMethodAccessorImpl.invoke0(Native Method)
[INFO] 	at sun.reflect.NativeMethodAccessorImpl.invoke(NativeMethodAccessorImpl.java:62)
[INFO] 	at sun.reflect.DelegatingMethodAccessorImpl.invoke(DelegatingMethodAccessorImpl.java:43)
[INFO] 	at java.lang.reflect.Method.invoke(Method.java:497)
[INFO] 	at org.codehaus.plexus.classworlds.launcher.Launcher.launchEnhanced(Launcher.java:289)
[INFO] 	at org.codehaus.plexus.classworlds.launcher.Launcher.launch(Launcher.java:229)
[INFO] 	at org.codehaus.plexus.classworlds.launcher.Launcher.mainWithExitCode(Launcher.java:415)
[INFO] 	at org.codehaus.plexus.classworlds.launcher.Launcher.main(Launcher.java:356)
[INFO] Caused by: org.apache.maven.plugin.compiler.CompilationFailureException: Compilation
failure
[INFO] <https://builds.apache.org/job/beam_PostCommit_MavenVerify/org.apache.beam$beam-sdks-java-maven-archetypes-examples/ws/target/test-classes/projects/basic/project/basic/src/main/java/it/pkg/common/DataflowExampleUtils.java>:[312,66]
cannot find symbol
[INFO]   symbol:   class PrintHandler
[INFO]   location: class org.apache.beam.runners.dataflow.util.MonitoringUtil
[INFO] 
[INFO] 	at org.apache.maven.plugin.compiler.AbstractCompilerMojo.execute(AbstractCompilerMojo.java:911)
[INFO] 	at org.apache.maven.plugin.compiler.CompilerMojo.execute(CompilerMojo.java:129)
[INFO] 	at org.apache.maven.plugin.DefaultBuildPluginManager.executeMojo(DefaultBuildPluginManager.java:134)
[INFO] 	at org.apache.maven.lifecycle.internal.MojoExecutor.execute(MojoExecutor.java:208)
[INFO] 	... 20 more
[INFO] [ERROR] 
[INFO] [ERROR] Re-run Maven using the -X switch to enable full debug logging.
[INFO] [ERROR] 
[INFO] [ERROR] For more information about the errors and possible solutions, please read the
following articles:
[INFO] [ERROR] [Help 1] http://cwiki.apache.org/confluence/display/MAVEN/MojoFailureException
[INFO] Post-archetype-generation invoker exit code: 1
[JENKINS] Recording test results

Mime
View raw message