beam-commits mailing list archives

Site index · List index
Message view « Date » · « Thread »
Top « Date » · « Thread »
From Apache Jenkins Server <jenk...@builds.apache.org>
Subject Build failed in Jenkins: beam_PostCommit_MavenVerify #912
Date Mon, 18 Jul 2016 17:42:07 GMT
See <https://builds.apache.org/job/beam_PostCommit_MavenVerify/912/changes>

Changes:

[lcwik] [BEAM-462] Replace MonitoringUtil.PrintHandler with a handler that

------------------------------------------
[...truncated 5494 lines...]
[INFO] 
[INFO] 	at org.apache.maven.lifecycle.internal.MojoExecutor.execute(MojoExecutor.java:212)
[INFO] 	at org.apache.maven.lifecycle.internal.MojoExecutor.execute(MojoExecutor.java:153)
[INFO] 	at org.apache.maven.lifecycle.internal.MojoExecutor.execute(MojoExecutor.java:145)
[INFO] 	at org.apache.maven.lifecycle.internal.LifecycleModuleBuilder.buildProject(LifecycleModuleBuilder.java:116)
[INFO] 	at org.apache.maven.lifecycle.internal.LifecycleModuleBuilder.buildProject(LifecycleModuleBuilder.java:80)
[INFO] 	at org.apache.maven.lifecycle.internal.builder.singlethreaded.SingleThreadedBuilder.build(SingleThreadedBuilder.java:51)
[INFO] 	at org.apache.maven.lifecycle.internal.LifecycleStarter.execute(LifecycleStarter.java:128)
[INFO] 	at org.apache.maven.DefaultMaven.doExecute(DefaultMaven.java:307)
[INFO] 	at org.apache.maven.DefaultMaven.doExecute(DefaultMaven.java:193)
[INFO] 	at org.apache.maven.DefaultMaven.execute(DefaultMaven.java:106)
[INFO] 	at org.apache.maven.cli.MavenCli.execute(MavenCli.java:862)
[INFO] 	at org.apache.maven.cli.MavenCli.doMain(MavenCli.java:286)
[INFO] 	at org.apache.maven.cli.MavenCli.main(MavenCli.java:197)
[INFO] 	at sun.reflect.NativeMethodAccessorImpl.invoke0(Native Method)
[INFO] 	at sun.reflect.NativeMethodAccessorImpl.invoke(NativeMethodAccessorImpl.java:62)
[INFO] 	at sun.reflect.DelegatingMethodAccessorImpl.invoke(DelegatingMethodAccessorImpl.java:43)
[INFO] 	at java.lang.reflect.Method.invoke(Method.java:497)
[INFO] 	at org.codehaus.plexus.classworlds.launcher.Launcher.launchEnhanced(Launcher.java:289)
[INFO] 	at org.codehaus.plexus.classworlds.launcher.Launcher.launch(Launcher.java:229)
[INFO] 	at org.codehaus.plexus.classworlds.launcher.Launcher.mainWithExitCode(Launcher.java:415)
[INFO] 	at org.codehaus.plexus.classworlds.launcher.Launcher.main(Launcher.java:356)
[INFO] Caused by: org.apache.maven.plugin.compiler.CompilationFailureException: Compilation
failure
[INFO] <https://builds.apache.org/job/beam_PostCommit_MavenVerify/ws/sdks/java/maven-archetypes/examples/target/test-classes/projects/basic/project/basic/src/main/java/it/pkg/common/DataflowExampleUtils.java>:[312,66]
cannot find symbol
[INFO]   symbol:   class PrintHandler
[INFO]   location: class org.apache.beam.runners.dataflow.util.MonitoringUtil
[INFO] 
[INFO] 	at org.apache.maven.plugin.compiler.AbstractCompilerMojo.execute(AbstractCompilerMojo.java:911)
[INFO] 	at org.apache.maven.plugin.compiler.CompilerMojo.execute(CompilerMojo.java:129)
[INFO] 	at org.apache.maven.plugin.DefaultBuildPluginManager.executeMojo(DefaultBuildPluginManager.java:134)
[INFO] 	at org.apache.maven.lifecycle.internal.MojoExecutor.execute(MojoExecutor.java:208)
[INFO] 	... 20 more
[INFO] [ERROR] 
[INFO] [ERROR] Re-run Maven using the -X switch to enable full debug logging.
[INFO] [ERROR] 
[INFO] [ERROR] For more information about the errors and possible solutions, please read the
following articles:
[INFO] [ERROR] [Help 1] http://cwiki.apache.org/confluence/display/MAVEN/MojoFailureException
[INFO] Post-archetype-generation invoker exit code: 1
[JENKINS] Recording test results
[INFO]                                                                         
[INFO] ------------------------------------------------------------------------
[INFO] Skipping Apache Beam :: Parent
[INFO] This project has been banned from the build due to previous failures.
[INFO] ------------------------------------------------------------------------
[INFO] ------------------------------------------------------------------------
[INFO] Reactor Summary:
[INFO] 
[INFO] Apache Beam :: Parent .............................. SUCCESS [  9.146 s]
[INFO] Apache Beam :: SDKs ................................ SUCCESS [ 14.637 s]
[INFO] Apache Beam :: SDKs :: Java ........................ SUCCESS [ 14.986 s]
[INFO] Apache Beam :: SDKs :: Java :: Build Tools ......... SUCCESS [  8.264 s]
[INFO] Apache Beam :: SDKs :: Java :: Core ................ SUCCESS [04:44 min]
[INFO] Apache Beam :: Runners ............................. SUCCESS [  5.268 s]
[INFO] Apache Beam :: Runners :: Core Java ................ SUCCESS [01:25 min]
[INFO] Apache Beam :: Runners :: Direct Java .............. SUCCESS [02:17 min]
[INFO] Apache Beam :: Runners :: Google Cloud Dataflow .... SUCCESS [01:27 min]
[INFO] Apache Beam :: SDKs :: Java :: IO .................. SUCCESS [  8.863 s]
[INFO] Apache Beam :: SDKs :: Java :: IO :: Google Cloud Platform SUCCESS [15:39 min]
[INFO] Apache Beam :: SDKs :: Java :: IO :: HDFS .......... SUCCESS [ 12.117 s]
[INFO] Apache Beam :: SDKs :: Java :: IO :: Kafka ......... SUCCESS [ 17.811 s]
[INFO] Apache Beam :: SDKs :: Java :: Extensions .......... SUCCESS [  1.209 s]
[INFO] Apache Beam :: SDKs :: Java :: Extensions :: Join library SUCCESS [ 12.490 s]
[INFO] Apache Beam :: SDKs :: Java :: Microbenchmarks ..... SUCCESS [ 11.672 s]
[INFO] Apache Beam :: SDKs :: Java :: Java 8 Tests ........ SUCCESS [  5.988 s]
[INFO] Apache Beam :: Runners :: Flink .................... SUCCESS [ 10.418 s]
[INFO] Apache Beam :: Runners :: Flink :: Core ............ SUCCESS [02:25 min]
[INFO] Apache Beam :: Runners :: Flink :: Examples ........ SUCCESS [  9.906 s]
[INFO] Apache Beam :: Examples ............................ SUCCESS [  0.541 s]
[INFO] Apache Beam :: Examples :: Java .................... SUCCESS [08:36 min]
[INFO] Apache Beam :: Runners :: Spark .................... SUCCESS [08:09 min]
[INFO] Apache Beam :: SDKs :: Java :: Maven Archetypes .... SUCCESS [  2.825 s]
[INFO] Apache Beam :: SDKs :: Java :: Maven Archetypes :: Starter SUCCESS [ 11.420 s]
[INFO] Apache Beam :: SDKs :: Java :: Maven Archetypes :: Examples FAILURE [ 12.504 s]
[INFO] Apache Beam :: Examples :: Java 8 .................. SKIPPED
[INFO] ------------------------------------------------------------------------
[INFO] BUILD FAILURE
[INFO] ------------------------------------------------------------------------
[INFO] Total time: 50:20 min
[INFO] Finished at: 2016-07-18T17:40:17+00:00
[INFO] Final Memory: 153M/799M
[INFO] ------------------------------------------------------------------------
Waiting for Jenkins to finish collecting data
[ERROR] Failed to execute goal org.apache.maven.plugins:maven-archetype-plugin:2.4:integration-test
(default-integration-test) on project beam-sdks-java-maven-archetypes-examples:
[ERROR] Archetype IT 'basic' failed: Execution failure: exit code = 1
[ERROR] -> [Help 1]
org.apache.maven.lifecycle.LifecycleExecutionException: Failed to execute goal org.apache.maven.plugins:maven-archetype-plugin:2.4:integration-test
(default-integration-test) on project beam-sdks-java-maven-archetypes-examples: 
Archetype IT 'basic' failed: Execution failure: exit code = 1
	at org.apache.maven.lifecycle.internal.MojoExecutor.execute(MojoExecutor.java:216)
	at org.apache.maven.lifecycle.internal.MojoExecutor.execute(MojoExecutor.java:153)
	at org.apache.maven.lifecycle.internal.MojoExecutor.execute(MojoExecutor.java:145)
	at org.apache.maven.lifecycle.internal.LifecycleModuleBuilder.buildProject(LifecycleModuleBuilder.java:116)
	at org.apache.maven.lifecycle.internal.LifecycleModuleBuilder.buildProject(LifecycleModuleBuilder.java:80)
	at org.apache.maven.lifecycle.internal.builder.singlethreaded.SingleThreadedBuilder.build(SingleThreadedBuilder.java:51)
	at org.apache.maven.lifecycle.internal.LifecycleStarter.execute(LifecycleStarter.java:128)
	at org.apache.maven.DefaultMaven.doExecute(DefaultMaven.java:307)
	at org.apache.maven.DefaultMaven.doExecute(DefaultMaven.java:193)
	at org.apache.maven.DefaultMaven.execute(DefaultMaven.java:106)
	at org.jvnet.hudson.maven3.launcher.Maven32Launcher.main(Maven32Launcher.java:132)
	at sun.reflect.NativeMethodAccessorImpl.invoke0(Native Method)
	at sun.reflect.NativeMethodAccessorImpl.invoke(NativeMethodAccessorImpl.java:62)
	at sun.reflect.DelegatingMethodAccessorImpl.invoke(DelegatingMethodAccessorImpl.java:43)
	at java.lang.reflect.Method.invoke(Method.java:497)
	at org.codehaus.plexus.classworlds.launcher.Launcher.launchStandard(Launcher.java:330)
	at org.codehaus.plexus.classworlds.launcher.Launcher.launch(Launcher.java:238)
	at jenkins.maven3.agent.Maven32Main.launch(Maven32Main.java:186)
	at sun.reflect.NativeMethodAccessorImpl.invoke0(Native Method)
	at sun.reflect.NativeMethodAccessorImpl.invoke(NativeMethodAccessorImpl.java:62)
	at sun.reflect.DelegatingMethodAccessorImpl.invoke(DelegatingMethodAccessorImpl.java:43)
	at java.lang.reflect.Method.invoke(Method.java:497)
	at hudson.maven.Maven3Builder.call(Maven3Builder.java:136)
	at hudson.maven.Maven3Builder.call(Maven3Builder.java:71)
	at hudson.remoting.UserRequest.perform(UserRequest.java:120)
	at hudson.remoting.UserRequest.perform(UserRequest.java:48)
	at hudson.remoting.Request$2.run(Request.java:326)
	at hudson.remoting.InterceptingExecutorService$1.call(InterceptingExecutorService.java:68)
	at java.util.concurrent.FutureTask.run(FutureTask.java:266)
	at java.util.concurrent.ThreadPoolExecutor.runWorker(ThreadPoolExecutor.java:1142)
	at java.util.concurrent.ThreadPoolExecutor$Worker.run(ThreadPoolExecutor.java:617)
	at java.lang.Thread.run(Thread.java:745)
Caused by: org.apache.maven.plugin.MojoExecutionException: 
Archetype IT 'basic' failed: Execution failure: exit code = 1
	at org.apache.maven.archetype.mojos.IntegrationTestMojo.execute(IntegrationTestMojo.java:269)
	at org.apache.maven.plugin.DefaultBuildPluginManager.executeMojo(DefaultBuildPluginManager.java:134)
	at org.apache.maven.lifecycle.internal.MojoExecutor.execute(MojoExecutor.java:208)
	... 31 more
[ERROR] 
[ERROR] Re-run Maven using the -X switch to enable full debug logging.
[ERROR] 
[ERROR] For more information about the errors and possible solutions, please read the following
articles:
[ERROR] [Help 1] http://cwiki.apache.org/confluence/display/MAVEN/MojoExecutionException
[ERROR] 
[ERROR] After correcting the problems, you can resume the build with the command
[ERROR]   mvn <goals> -rf :beam-sdks-java-maven-archetypes-examples
[JENKINS] Archiving <https://builds.apache.org/job/beam_PostCommit_MavenVerify/ws/sdks/pom.xml>
to org.apache.beam/beam-sdks-parent/0.2.0-incubating-SNAPSHOT/beam-sdks-parent-0.2.0-incubating-SNAPSHOT.pom
No artifacts from beam_PostCommit_MavenVerify » Apache Beam :: SDKs #913 to compare, so performing
full copy of artifacts
[JENKINS] Archiving <https://builds.apache.org/job/beam_PostCommit_MavenVerify/ws/sdks/java/extensions/join-library/pom.xml>
to org.apache.beam/beam-sdks-java-extensions-join-library/0.2.0-incubating-SNAPSHOT/beam-sdks-java-extensions-join-library-0.2.0-incubating-SNAPSHOT.pom
[JENKINS] Archiving <https://builds.apache.org/job/beam_PostCommit_MavenVerify/ws/sdks/java/extensions/join-library/target/beam-sdks-java-extensions-join-library-0.2.0-incubating-SNAPSHOT.jar>
to org.apache.beam/beam-sdks-java-extensions-join-library/0.2.0-incubating-SNAPSHOT/beam-sdks-java-extensions-join-library-0.2.0-incubating-SNAPSHOT.jar
[JENKINS] Archiving <https://builds.apache.org/job/beam_PostCommit_MavenVerify/ws/sdks/java/extensions/join-library/target/beam-sdks-java-extensions-join-library-0.2.0-incubating-SNAPSHOT-sources.jar>
to org.apache.beam/beam-sdks-java-extensions-join-library/0.2.0-incubating-SNAPSHOT/beam-sdks-java-extensions-join-library-0.2.0-incubating-SNAPSHOT-sources.jar
[JENKINS] Archiving <https://builds.apache.org/job/beam_PostCommit_MavenVerify/ws/sdks/java/extensions/join-library/target/beam-sdks-java-extensions-join-library-0.2.0-incubating-SNAPSHOT-test-sources.jar>
to org.apache.beam/beam-sdks-java-extensions-join-library/0.2.0-incubating-SNAPSHOT/beam-sdks-java-extensions-join-library-0.2.0-incubating-SNAPSHOT-test-sources.jar
[JENKINS] Archiving <https://builds.apache.org/job/beam_PostCommit_MavenVerify/ws/sdks/java/extensions/join-library/target/beam-sdks-java-extensions-join-library-0.2.0-incubating-SNAPSHOT-tests.jar>
to org.apache.beam/beam-sdks-java-extensions-join-library/0.2.0-incubating-SNAPSHOT/beam-sdks-java-extensions-join-library-0.2.0-incubating-SNAPSHOT-tests.jar
No artifacts from beam_PostCommit_MavenVerify » Apache Beam :: SDKs :: Java :: Extensions
:: Join library #913 to compare, so performing full copy of artifacts
[JENKINS] Archiving <https://builds.apache.org/job/beam_PostCommit_MavenVerify/ws/sdks/java/maven-archetypes/examples/pom.xml>
to org.apache.beam/beam-sdks-java-maven-archetypes-examples/0.2.0-incubating-SNAPSHOT/beam-sdks-java-maven-archetypes-examples-0.2.0-incubating-SNAPSHOT.pom
[JENKINS] Archiving <https://builds.apache.org/job/beam_PostCommit_MavenVerify/ws/sdks/java/maven-archetypes/examples/target/beam-sdks-java-maven-archetypes-examples-0.2.0-incubating-SNAPSHOT.jar>
to org.apache.beam/beam-sdks-java-maven-archetypes-examples/0.2.0-incubating-SNAPSHOT/beam-sdks-java-maven-archetypes-examples-0.2.0-incubating-SNAPSHOT.jar
[JENKINS] Archiving <https://builds.apache.org/job/beam_PostCommit_MavenVerify/ws/runners/core-java/dependency-reduced-pom.xml>
to org.apache.beam/beam-runners-core-java/0.2.0-incubating-SNAPSHOT/beam-runners-core-java-0.2.0-incubating-SNAPSHOT.pom
[JENKINS] Archiving <https://builds.apache.org/job/beam_PostCommit_MavenVerify/ws/runners/core-java/target/beam-runners-core-java-0.2.0-incubating-SNAPSHOT.jar>
to org.apache.beam/beam-runners-core-java/0.2.0-incubating-SNAPSHOT/beam-runners-core-java-0.2.0-incubating-SNAPSHOT.jar
[JENKINS] Archiving <https://builds.apache.org/job/beam_PostCommit_MavenVerify/ws/runners/core-java/target/beam-runners-core-java-0.2.0-incubating-SNAPSHOT-tests.jar>
to org.apache.beam/beam-runners-core-java/0.2.0-incubating-SNAPSHOT/beam-runners-core-java-0.2.0-incubating-SNAPSHOT-tests.jar
[JENKINS] Archiving <https://builds.apache.org/job/beam_PostCommit_MavenVerify/ws/runners/core-java/target/beam-runners-core-java-0.2.0-incubating-SNAPSHOT-sources.jar>
to org.apache.beam/beam-runners-core-java/0.2.0-incubating-SNAPSHOT/beam-runners-core-java-0.2.0-incubating-SNAPSHOT-sources.jar
[JENKINS] Archiving <https://builds.apache.org/job/beam_PostCommit_MavenVerify/ws/runners/core-java/target/beam-runners-core-java-0.2.0-incubating-SNAPSHOT-test-sources.jar>
to org.apache.beam/beam-runners-core-java/0.2.0-incubating-SNAPSHOT/beam-runners-core-java-0.2.0-incubating-SNAPSHOT-test-sources.jar
[JENKINS] Archiving <https://builds.apache.org/job/beam_PostCommit_MavenVerify/ws/runners/core-java/target/beam-runners-core-java-0.2.0-incubating-SNAPSHOT-javadoc.jar>
to org.apache.beam/beam-runners-core-java/0.2.0-incubating-SNAPSHOT/beam-runners-core-java-0.2.0-incubating-SNAPSHOT-javadoc.jar
No artifacts from beam_PostCommit_MavenVerify » Apache Beam :: Runners :: Core Java #913
to compare, so performing full copy of artifacts
[JENKINS] Archiving <https://builds.apache.org/job/beam_PostCommit_MavenVerify/ws/sdks/java/extensions/pom.xml>
to org.apache.beam/beam-sdks-java-extensions-parent/0.2.0-incubating-SNAPSHOT/beam-sdks-java-extensions-parent-0.2.0-incubating-SNAPSHOT.pom
No artifacts from beam_PostCommit_MavenVerify » Apache Beam :: SDKs :: Java :: Extensions
#913 to compare, so performing full copy of artifacts
[JENKINS] Archiving <https://builds.apache.org/job/beam_PostCommit_MavenVerify/ws/sdks/java/pom.xml>
to org.apache.beam/beam-sdks-java-parent/0.2.0-incubating-SNAPSHOT/beam-sdks-java-parent-0.2.0-incubating-SNAPSHOT.pom
No artifacts from beam_PostCommit_MavenVerify » Apache Beam :: SDKs :: Java #913 to compare,
so performing full copy of artifacts
[JENKINS] Archiving <https://builds.apache.org/job/beam_PostCommit_MavenVerify/ws/runners/spark/pom.xml>
to org.apache.beam/beam-runners-spark/0.2.0-incubating-SNAPSHOT/beam-runners-spark-0.2.0-incubating-SNAPSHOT.pom
[JENKINS] Archiving <https://builds.apache.org/job/beam_PostCommit_MavenVerify/ws/runners/spark/target/beam-runners-spark-0.2.0-incubating-SNAPSHOT.jar>
to org.apache.beam/beam-runners-spark/0.2.0-incubating-SNAPSHOT/beam-runners-spark-0.2.0-incubating-SNAPSHOT.jar
[JENKINS] Archiving <https://builds.apache.org/job/beam_PostCommit_MavenVerify/ws/runners/spark/target/beam-runners-spark-0.2.0-incubating-SNAPSHOT-tests.jar>
to org.apache.beam/beam-runners-spark/0.2.0-incubating-SNAPSHOT/beam-runners-spark-0.2.0-incubating-SNAPSHOT-tests.jar
[JENKINS] Archiving <https://builds.apache.org/job/beam_PostCommit_MavenVerify/ws/runners/spark/target/beam-runners-spark-0.2.0-incubating-SNAPSHOT-sources.jar>
to org.apache.beam/beam-runners-spark/0.2.0-incubating-SNAPSHOT/beam-runners-spark-0.2.0-incubating-SNAPSHOT-sources.jar
[JENKINS] Archiving <https://builds.apache.org/job/beam_PostCommit_MavenVerify/ws/runners/spark/target/beam-runners-spark-0.2.0-incubating-SNAPSHOT-test-sources.jar>
to org.apache.beam/beam-runners-spark/0.2.0-incubating-SNAPSHOT/beam-runners-spark-0.2.0-incubating-SNAPSHOT-test-sources.jar
[JENKINS] Archiving <https://builds.apache.org/job/beam_PostCommit_MavenVerify/ws/runners/spark/target/beam-runners-spark-0.2.0-incubating-SNAPSHOT-javadoc.jar>
to org.apache.beam/beam-runners-spark/0.2.0-incubating-SNAPSHOT/beam-runners-spark-0.2.0-incubating-SNAPSHOT-javadoc.jar
[JENKINS] Archiving <https://builds.apache.org/job/beam_PostCommit_MavenVerify/ws/runners/spark/target/beam-runners-spark-0.2.0-incubating-SNAPSHOT-spark-app.jar>
to org.apache.beam/beam-runners-spark/0.2.0-incubating-SNAPSHOT/beam-runners-spark-0.2.0-incubating-SNAPSHOT-spark-app.jar
[JENKINS] Archiving <https://builds.apache.org/job/beam_PostCommit_MavenVerify/ws/runners/flink/pom.xml>
to org.apache.beam/beam-runners-flink-parent/0.2.0-incubating-SNAPSHOT/beam-runners-flink-parent-0.2.0-incubating-SNAPSHOT.pom
No artifacts from beam_PostCommit_MavenVerify » Apache Beam :: Runners :: Flink #913 to compare,
so performing full copy of artifacts
[JENKINS] Archiving <https://builds.apache.org/job/beam_PostCommit_MavenVerify/ws/runners/direct-java/dependency-reduced-pom.xml>
to org.apache.beam/beam-runners-direct-java/0.2.0-incubating-SNAPSHOT/beam-runners-direct-java-0.2.0-incubating-SNAPSHOT.pom
[JENKINS] Archiving <https://builds.apache.org/job/beam_PostCommit_MavenVerify/ws/runners/direct-java/target/beam-runners-direct-java-0.2.0-incubating-SNAPSHOT.jar>
to org.apache.beam/beam-runners-direct-java/0.2.0-incubating-SNAPSHOT/beam-runners-direct-java-0.2.0-incubating-SNAPSHOT.jar
[JENKINS] Archiving <https://builds.apache.org/job/beam_PostCommit_MavenVerify/ws/runners/direct-java/target/beam-runners-direct-java-0.2.0-incubating-SNAPSHOT-tests.jar>
to org.apache.beam/beam-runners-direct-java/0.2.0-incubating-SNAPSHOT/beam-runners-direct-java-0.2.0-incubating-SNAPSHOT-tests.jar
[JENKINS] Archiving <https://builds.apache.org/job/beam_PostCommit_MavenVerify/ws/runners/direct-java/target/beam-runners-direct-java-0.2.0-incubating-SNAPSHOT-sources.jar>
to org.apache.beam/beam-runners-direct-java/0.2.0-incubating-SNAPSHOT/beam-runners-direct-java-0.2.0-incubating-SNAPSHOT-sources.jar
[JENKINS] Archiving <https://builds.apache.org/job/beam_PostCommit_MavenVerify/ws/runners/direct-java/target/beam-runners-direct-java-0.2.0-incubating-SNAPSHOT-test-sources.jar>
to org.apache.beam/beam-runners-direct-java/0.2.0-incubating-SNAPSHOT/beam-runners-direct-java-0.2.0-incubating-SNAPSHOT-test-sources.jar
[JENKINS] Archiving <https://builds.apache.org/job/beam_PostCommit_MavenVerify/ws/runners/direct-java/target/beam-runners-direct-java-0.2.0-incubating-SNAPSHOT-javadoc.jar>
to org.apache.beam/beam-runners-direct-java/0.2.0-incubating-SNAPSHOT/beam-runners-direct-java-0.2.0-incubating-SNAPSHOT-javadoc.jar
No artifacts from beam_PostCommit_MavenVerify » Apache Beam :: Runners :: Direct Java #913
to compare, so performing full copy of artifacts
[JENKINS] Archiving <https://builds.apache.org/job/beam_PostCommit_MavenVerify/ws/examples/pom.xml>
to org.apache.beam/beam-examples-parent/0.2.0-incubating-SNAPSHOT/beam-examples-parent-0.2.0-incubating-SNAPSHOT.pom
No artifacts from beam_PostCommit_MavenVerify » Apache Beam :: Examples #913 to compare,
so performing full copy of artifacts
[JENKINS] Archiving <https://builds.apache.org/job/beam_PostCommit_MavenVerify/ws/sdks/java/io/google-cloud-platform/pom.xml>
to org.apache.beam/beam-sdks-java-io-google-cloud-platform/0.2.0-incubating-SNAPSHOT/beam-sdks-java-io-google-cloud-platform-0.2.0-incubating-SNAPSHOT.pom
[JENKINS] Archiving <https://builds.apache.org/job/beam_PostCommit_MavenVerify/ws/sdks/java/io/google-cloud-platform/target/beam-sdks-java-io-google-cloud-platform-0.2.0-incubating-SNAPSHOT.jar>
to org.apache.beam/beam-sdks-java-io-google-cloud-platform/0.2.0-incubating-SNAPSHOT/beam-sdks-java-io-google-cloud-platform-0.2.0-incubating-SNAPSHOT.jar
[JENKINS] Archiving <https://builds.apache.org/job/beam_PostCommit_MavenVerify/ws/sdks/java/io/google-cloud-platform/target/beam-sdks-java-io-google-cloud-platform-0.2.0-incubating-SNAPSHOT-sources.jar>
to org.apache.beam/beam-sdks-java-io-google-cloud-platform/0.2.0-incubating-SNAPSHOT/beam-sdks-java-io-google-cloud-platform-0.2.0-incubating-SNAPSHOT-sources.jar
[JENKINS] Archiving <https://builds.apache.org/job/beam_PostCommit_MavenVerify/ws/sdks/java/io/google-cloud-platform/target/beam-sdks-java-io-google-cloud-platform-0.2.0-incubating-SNAPSHOT-test-sources.jar>
to org.apache.beam/beam-sdks-java-io-google-cloud-platform/0.2.0-incubating-SNAPSHOT/beam-sdks-java-io-google-cloud-platform-0.2.0-incubating-SNAPSHOT-test-sources.jar
[JENKINS] Archiving <https://builds.apache.org/job/beam_PostCommit_MavenVerify/ws/sdks/java/io/google-cloud-platform/target/beam-sdks-java-io-google-cloud-platform-0.2.0-incubating-SNAPSHOT-tests.jar>
to org.apache.beam/beam-sdks-java-io-google-cloud-platform/0.2.0-incubating-SNAPSHOT/beam-sdks-java-io-google-cloud-platform-0.2.0-incubating-SNAPSHOT-tests.jar
No artifacts from beam_PostCommit_MavenVerify » Apache Beam :: SDKs :: Java :: IO :: Google
Cloud Platform #913 to compare, so performing full copy of artifacts
[JENKINS] Archiving <https://builds.apache.org/job/beam_PostCommit_MavenVerify/ws/runners/pom.xml>
to org.apache.beam/beam-runners-parent/0.2.0-incubating-SNAPSHOT/beam-runners-parent-0.2.0-incubating-SNAPSHOT.pom
No artifacts from beam_PostCommit_MavenVerify » Apache Beam :: Runners #913 to compare, so
performing full copy of artifacts
[JENKINS] Archiving <https://builds.apache.org/job/beam_PostCommit_MavenVerify/ws/runners/google-cloud-dataflow-java/dependency-reduced-pom.xml>
to org.apache.beam/beam-runners-google-cloud-dataflow-java/0.2.0-incubating-SNAPSHOT/beam-runners-google-cloud-dataflow-java-0.2.0-incubating-SNAPSHOT.pom
[JENKINS] Archiving <https://builds.apache.org/job/beam_PostCommit_MavenVerify/ws/runners/google-cloud-dataflow-java/target/beam-runners-google-cloud-dataflow-java-0.2.0-incubating-SNAPSHOT.jar>
to org.apache.beam/beam-runners-google-cloud-dataflow-java/0.2.0-incubating-SNAPSHOT/beam-runners-google-cloud-dataflow-java-0.2.0-incubating-SNAPSHOT.jar
[JENKINS] Archiving <https://builds.apache.org/job/beam_PostCommit_MavenVerify/ws/runners/google-cloud-dataflow-java/target/beam-runners-google-cloud-dataflow-java-0.2.0-incubating-SNAPSHOT-tests.jar>
to org.apache.beam/beam-runners-google-cloud-dataflow-java/0.2.0-incubating-SNAPSHOT/beam-runners-google-cloud-dataflow-java-0.2.0-incubating-SNAPSHOT-tests.jar
[JENKINS] Archiving <https://builds.apache.org/job/beam_PostCommit_MavenVerify/ws/runners/google-cloud-dataflow-java/target/beam-runners-google-cloud-dataflow-java-0.2.0-incubating-SNAPSHOT-sources.jar>
to org.apache.beam/beam-runners-google-cloud-dataflow-java/0.2.0-incubating-SNAPSHOT/beam-runners-google-cloud-dataflow-java-0.2.0-incubating-SNAPSHOT-sources.jar
[JENKINS] Archiving <https://builds.apache.org/job/beam_PostCommit_MavenVerify/ws/runners/google-cloud-dataflow-java/target/beam-runners-google-cloud-dataflow-java-0.2.0-incubating-SNAPSHOT-test-sources.jar>
to org.apache.beam/beam-runners-google-cloud-dataflow-java/0.2.0-incubating-SNAPSHOT/beam-runners-google-cloud-dataflow-java-0.2.0-incubating-SNAPSHOT-test-sources.jar
[JENKINS] Archiving <https://builds.apache.org/job/beam_PostCommit_MavenVerify/ws/runners/google-cloud-dataflow-java/target/beam-runners-google-cloud-dataflow-java-0.2.0-incubating-SNAPSHOT-javadoc.jar>
to org.apache.beam/beam-runners-google-cloud-dataflow-java/0.2.0-incubating-SNAPSHOT/beam-runners-google-cloud-dataflow-java-0.2.0-incubating-SNAPSHOT-javadoc.jar
No artifacts from beam_PostCommit_MavenVerify » Apache Beam :: Runners :: Google Cloud Dataflow
#913 to compare, so performing full copy of artifacts
[JENKINS] Archiving <https://builds.apache.org/job/beam_PostCommit_MavenVerify/ws/sdks/java/io/pom.xml>
to org.apache.beam/beam-sdks-java-io-parent/0.2.0-incubating-SNAPSHOT/beam-sdks-java-io-parent-0.2.0-incubating-SNAPSHOT.pom
No artifacts from beam_PostCommit_MavenVerify » Apache Beam :: SDKs :: Java :: IO #913 to
compare, so performing full copy of artifacts
[JENKINS] Archiving <https://builds.apache.org/job/beam_PostCommit_MavenVerify/ws/examples/java/pom.xml>
to org.apache.beam/beam-examples-java/0.2.0-incubating-SNAPSHOT/beam-examples-java-0.2.0-incubating-SNAPSHOT.pom
[JENKINS] Archiving <https://builds.apache.org/job/beam_PostCommit_MavenVerify/ws/examples/java/target/beam-examples-java-0.2.0-incubating-SNAPSHOT.jar>
to org.apache.beam/beam-examples-java/0.2.0-incubating-SNAPSHOT/beam-examples-java-0.2.0-incubating-SNAPSHOT.jar
[JENKINS] Archiving <https://builds.apache.org/job/beam_PostCommit_MavenVerify/ws/examples/java/target/beam-examples-java-0.2.0-incubating-SNAPSHOT-sources.jar>
to org.apache.beam/beam-examples-java/0.2.0-incubating-SNAPSHOT/beam-examples-java-0.2.0-incubating-SNAPSHOT-sources.jar
[JENKINS] Archiving <https://builds.apache.org/job/beam_PostCommit_MavenVerify/ws/examples/java/target/beam-examples-java-0.2.0-incubating-SNAPSHOT-test-sources.jar>
to org.apache.beam/beam-examples-java/0.2.0-incubating-SNAPSHOT/beam-examples-java-0.2.0-incubating-SNAPSHOT-test-sources.jar
[JENKINS] Archiving <https://builds.apache.org/job/beam_PostCommit_MavenVerify/ws/examples/java/target/beam-examples-java-0.2.0-incubating-SNAPSHOT-javadoc.jar>
to org.apache.beam/beam-examples-java/0.2.0-incubating-SNAPSHOT/beam-examples-java-0.2.0-incubating-SNAPSHOT-javadoc.jar
[JENKINS] Archiving <https://builds.apache.org/job/beam_PostCommit_MavenVerify/ws/examples/java/target/beam-examples-java-0.2.0-incubating-SNAPSHOT-tests.jar>
to org.apache.beam/beam-examples-java/0.2.0-incubating-SNAPSHOT/beam-examples-java-0.2.0-incubating-SNAPSHOT-tests.jar
No artifacts from beam_PostCommit_MavenVerify » Apache Beam :: Examples :: Java #913 to compare,
so performing full copy of artifacts
[JENKINS] Archiving <https://builds.apache.org/job/beam_PostCommit_MavenVerify/ws/runners/flink/runner/pom.xml>
to org.apache.beam/beam-runners-flink_2.10/0.2.0-incubating-SNAPSHOT/beam-runners-flink_2.10-0.2.0-incubating-SNAPSHOT.pom
[JENKINS] Archiving <https://builds.apache.org/job/beam_PostCommit_MavenVerify/ws/runners/flink/runner/target/beam-runners-flink_2.10-0.2.0-incubating-SNAPSHOT.jar>
to org.apache.beam/beam-runners-flink_2.10/0.2.0-incubating-SNAPSHOT/beam-runners-flink_2.10-0.2.0-incubating-SNAPSHOT.jar
[JENKINS] Archiving <https://builds.apache.org/job/beam_PostCommit_MavenVerify/ws/runners/flink/runner/target/beam-runners-flink_2.10-0.2.0-incubating-SNAPSHOT-tests.jar>
to org.apache.beam/beam-runners-flink_2.10/0.2.0-incubating-SNAPSHOT/beam-runners-flink_2.10-0.2.0-incubating-SNAPSHOT-tests.jar
[JENKINS] Archiving <https://builds.apache.org/job/beam_PostCommit_MavenVerify/ws/runners/flink/runner/target/beam-runners-flink_2.10-0.2.0-incubating-SNAPSHOT-sources.jar>
to org.apache.beam/beam-runners-flink_2.10/0.2.0-incubating-SNAPSHOT/beam-runners-flink_2.10-0.2.0-incubating-SNAPSHOT-sources.jar
[JENKINS] Archiving <https://builds.apache.org/job/beam_PostCommit_MavenVerify/ws/runners/flink/runner/target/beam-runners-flink_2.10-0.2.0-incubating-SNAPSHOT-test-sources.jar>
to org.apache.beam/beam-runners-flink_2.10/0.2.0-incubating-SNAPSHOT/beam-runners-flink_2.10-0.2.0-incubating-SNAPSHOT-test-sources.jar
[JENKINS] Archiving <https://builds.apache.org/job/beam_PostCommit_MavenVerify/ws/runners/flink/runner/target/beam-runners-flink_2.10-0.2.0-incubating-SNAPSHOT-javadoc.jar>
to org.apache.beam/beam-runners-flink_2.10/0.2.0-incubating-SNAPSHOT/beam-runners-flink_2.10-0.2.0-incubating-SNAPSHOT-javadoc.jar
No artifacts from beam_PostCommit_MavenVerify » Apache Beam :: Runners :: Flink :: Core #913
to compare, so performing full copy of artifacts
[JENKINS] Archiving <https://builds.apache.org/job/beam_PostCommit_MavenVerify/ws/pom.xml>
to org.apache.beam/beam-parent/0.2.0-incubating-SNAPSHOT/beam-parent-0.2.0-incubating-SNAPSHOT.pom
No artifacts from beam_PostCommit_MavenVerify » Apache Beam :: Parent #913 to compare, so
performing full copy of artifacts
[JENKINS] Archiving <https://builds.apache.org/job/beam_PostCommit_MavenVerify/ws/sdks/java/core/dependency-reduced-pom.xml>
to org.apache.beam/beam-sdks-java-core/0.2.0-incubating-SNAPSHOT/beam-sdks-java-core-0.2.0-incubating-SNAPSHOT.pom
[JENKINS] Archiving <https://builds.apache.org/job/beam_PostCommit_MavenVerify/ws/sdks/java/core/target/beam-sdks-java-core-0.2.0-incubating-SNAPSHOT.jar>
to org.apache.beam/beam-sdks-java-core/0.2.0-incubating-SNAPSHOT/beam-sdks-java-core-0.2.0-incubating-SNAPSHOT.jar
[JENKINS] Archiving <https://builds.apache.org/job/beam_PostCommit_MavenVerify/ws/sdks/java/core/target/beam-sdks-java-core-0.2.0-incubating-SNAPSHOT-tests.jar>
to org.apache.beam/beam-sdks-java-core/0.2.0-incubating-SNAPSHOT/beam-sdks-java-core-0.2.0-incubating-SNAPSHOT-tests.jar
[JENKINS] Archiving <https://builds.apache.org/job/beam_PostCommit_MavenVerify/ws/sdks/java/core/target/beam-sdks-java-core-0.2.0-incubating-SNAPSHOT-sources.jar>
to org.apache.beam/beam-sdks-java-core/0.2.0-incubating-SNAPSHOT/beam-sdks-java-core-0.2.0-incubating-SNAPSHOT-sources.jar
[JENKINS] Archiving <https://builds.apache.org/job/beam_PostCommit_MavenVerify/ws/sdks/java/core/target/beam-sdks-java-core-0.2.0-incubating-SNAPSHOT-test-sources.jar>
to org.apache.beam/beam-sdks-java-core/0.2.0-incubating-SNAPSHOT/beam-sdks-java-core-0.2.0-incubating-SNAPSHOT-test-sources.jar
[JENKINS] Archiving <https://builds.apache.org/job/beam_PostCommit_MavenVerify/ws/sdks/java/core/target/beam-sdks-java-core-0.2.0-incubating-SNAPSHOT-javadoc.jar>
to org.apache.beam/beam-sdks-java-core/0.2.0-incubating-SNAPSHOT/beam-sdks-java-core-0.2.0-incubating-SNAPSHOT-javadoc.jar
No artifacts from beam_PostCommit_MavenVerify » Apache Beam :: SDKs :: Java :: Core #913
to compare, so performing full copy of artifacts
[JENKINS] Archiving <https://builds.apache.org/job/beam_PostCommit_MavenVerify/ws/sdks/java/microbenchmarks/pom.xml>
to org.apache.beam/beam-sdks-java-microbenchmarks/0.2.0-incubating-SNAPSHOT/beam-sdks-java-microbenchmarks-0.2.0-incubating-SNAPSHOT.pom
[JENKINS] Archiving <https://builds.apache.org/job/beam_PostCommit_MavenVerify/ws/sdks/java/microbenchmarks/target/beam-sdks-java-microbenchmarks-0.2.0-incubating-SNAPSHOT.jar>
to org.apache.beam/beam-sdks-java-microbenchmarks/0.2.0-incubating-SNAPSHOT/beam-sdks-java-microbenchmarks-0.2.0-incubating-SNAPSHOT.jar
[JENKINS] Archiving <https://builds.apache.org/job/beam_PostCommit_MavenVerify/ws/sdks/java/microbenchmarks/target/beam-sdks-java-microbenchmarks-0.2.0-incubating-SNAPSHOT-sources.jar>
to org.apache.beam/beam-sdks-java-microbenchmarks/0.2.0-incubating-SNAPSHOT/beam-sdks-java-microbenchmarks-0.2.0-incubating-SNAPSHOT-sources.jar
[JENKINS] Archiving <https://builds.apache.org/job/beam_PostCommit_MavenVerify/ws/sdks/java/microbenchmarks/target/beam-sdks-java-microbenchmarks-0.2.0-incubating-SNAPSHOT-test-sources.jar>
to org.apache.beam/beam-sdks-java-microbenchmarks/0.2.0-incubating-SNAPSHOT/beam-sdks-java-microbenchmarks-0.2.0-incubating-SNAPSHOT-test-sources.jar
[JENKINS] Archiving <https://builds.apache.org/job/beam_PostCommit_MavenVerify/ws/sdks/java/microbenchmarks/target/beam-sdks-java-microbenchmarks-0.2.0-incubating-SNAPSHOT-tests.jar>
to org.apache.beam/beam-sdks-java-microbenchmarks/0.2.0-incubating-SNAPSHOT/beam-sdks-java-microbenchmarks-0.2.0-incubating-SNAPSHOT-tests.jar
No artifacts from beam_PostCommit_MavenVerify » Apache Beam :: SDKs :: Java :: Microbenchmarks
#913 to compare, so performing full copy of artifacts
[JENKINS] Archiving <https://builds.apache.org/job/beam_PostCommit_MavenVerify/ws/runners/flink/examples/pom.xml>
to org.apache.beam/beam-runners-flink_2.10-examples/0.2.0-incubating-SNAPSHOT/beam-runners-flink_2.10-examples-0.2.0-incubating-SNAPSHOT.pom
[JENKINS] Archiving <https://builds.apache.org/job/beam_PostCommit_MavenVerify/ws/runners/flink/examples/target/beam-runners-flink_2.10-examples-0.2.0-incubating-SNAPSHOT.jar>
to org.apache.beam/beam-runners-flink_2.10-examples/0.2.0-incubating-SNAPSHOT/beam-runners-flink_2.10-examples-0.2.0-incubating-SNAPSHOT.jar
[JENKINS] Archiving <https://builds.apache.org/job/beam_PostCommit_MavenVerify/ws/runners/flink/examples/target/beam-runners-flink_2.10-examples-0.2.0-incubating-SNAPSHOT-tests.jar>
to org.apache.beam/beam-runners-flink_2.10-examples/0.2.0-incubating-SNAPSHOT/beam-runners-flink_2.10-examples-0.2.0-incubating-SNAPSHOT-tests.jar
[JENKINS] Archiving <https://builds.apache.org/job/beam_PostCommit_MavenVerify/ws/runners/flink/examples/target/beam-runners-flink_2.10-examples-0.2.0-incubating-SNAPSHOT-sources.jar>
to org.apache.beam/beam-runners-flink_2.10-examples/0.2.0-incubating-SNAPSHOT/beam-runners-flink_2.10-examples-0.2.0-incubating-SNAPSHOT-sources.jar
[JENKINS] Archiving <https://builds.apache.org/job/beam_PostCommit_MavenVerify/ws/runners/flink/examples/target/beam-runners-flink_2.10-examples-0.2.0-incubating-SNAPSHOT-test-sources.jar>
to org.apache.beam/beam-runners-flink_2.10-examples/0.2.0-incubating-SNAPSHOT/beam-runners-flink_2.10-examples-0.2.0-incubating-SNAPSHOT-test-sources.jar
[JENKINS] Archiving <https://builds.apache.org/job/beam_PostCommit_MavenVerify/ws/runners/flink/examples/target/beam-runners-flink_2.10-examples-0.2.0-incubating-SNAPSHOT-javadoc.jar>
to org.apache.beam/beam-runners-flink_2.10-examples/0.2.0-incubating-SNAPSHOT/beam-runners-flink_2.10-examples-0.2.0-incubating-SNAPSHOT-javadoc.jar
No artifacts from beam_PostCommit_MavenVerify » Apache Beam :: Runners :: Flink :: Examples
#913 to compare, so performing full copy of artifacts
[JENKINS] Archiving <https://builds.apache.org/job/beam_PostCommit_MavenVerify/ws/sdks/java/io/hdfs/pom.xml>
to org.apache.beam/beam-sdks-java-io-hdfs/0.2.0-incubating-SNAPSHOT/beam-sdks-java-io-hdfs-0.2.0-incubating-SNAPSHOT.pom
[JENKINS] Archiving <https://builds.apache.org/job/beam_PostCommit_MavenVerify/ws/sdks/java/io/hdfs/target/beam-sdks-java-io-hdfs-0.2.0-incubating-SNAPSHOT.jar>
to org.apache.beam/beam-sdks-java-io-hdfs/0.2.0-incubating-SNAPSHOT/beam-sdks-java-io-hdfs-0.2.0-incubating-SNAPSHOT.jar
[JENKINS] Archiving <https://builds.apache.org/job/beam_PostCommit_MavenVerify/ws/sdks/java/io/hdfs/target/beam-sdks-java-io-hdfs-0.2.0-incubating-SNAPSHOT-sources.jar>
to org.apache.beam/beam-sdks-java-io-hdfs/0.2.0-incubating-SNAPSHOT/beam-sdks-java-io-hdfs-0.2.0-incubating-SNAPSHOT-sources.jar
[JENKINS] Archiving <https://builds.apache.org/job/beam_PostCommit_MavenVerify/ws/sdks/java/io/hdfs/target/beam-sdks-java-io-hdfs-0.2.0-incubating-SNAPSHOT-test-sources.jar>
to org.apache.beam/beam-sdks-java-io-hdfs/0.2.0-incubating-SNAPSHOT/beam-sdks-java-io-hdfs-0.2.0-incubating-SNAPSHOT-test-sources.jar
[JENKINS] Archiving <https://builds.apache.org/job/beam_PostCommit_MavenVerify/ws/sdks/java/io/hdfs/target/beam-sdks-java-io-hdfs-0.2.0-incubating-SNAPSHOT-tests.jar>
to org.apache.beam/beam-sdks-java-io-hdfs/0.2.0-incubating-SNAPSHOT/beam-sdks-java-io-hdfs-0.2.0-incubating-SNAPSHOT-tests.jar
No artifacts from beam_PostCommit_MavenVerify » Apache Beam :: SDKs :: Java :: IO :: HDFS
#913 to compare, so performing full copy of artifacts
[JENKINS] Archiving <https://builds.apache.org/job/beam_PostCommit_MavenVerify/ws/sdks/java/io/kafka/pom.xml>
to org.apache.beam/beam-sdks-java-io-kafka/0.2.0-incubating-SNAPSHOT/beam-sdks-java-io-kafka-0.2.0-incubating-SNAPSHOT.pom
[JENKINS] Archiving <https://builds.apache.org/job/beam_PostCommit_MavenVerify/ws/sdks/java/io/kafka/target/beam-sdks-java-io-kafka-0.2.0-incubating-SNAPSHOT.jar>
to org.apache.beam/beam-sdks-java-io-kafka/0.2.0-incubating-SNAPSHOT/beam-sdks-java-io-kafka-0.2.0-incubating-SNAPSHOT.jar
[JENKINS] Archiving <https://builds.apache.org/job/beam_PostCommit_MavenVerify/ws/sdks/java/io/kafka/target/beam-sdks-java-io-kafka-0.2.0-incubating-SNAPSHOT-sources.jar>
to org.apache.beam/beam-sdks-java-io-kafka/0.2.0-incubating-SNAPSHOT/beam-sdks-java-io-kafka-0.2.0-incubating-SNAPSHOT-sources.jar
[JENKINS] Archiving <https://builds.apache.org/job/beam_PostCommit_MavenVerify/ws/sdks/java/io/kafka/target/beam-sdks-java-io-kafka-0.2.0-incubating-SNAPSHOT-test-sources.jar>
to org.apache.beam/beam-sdks-java-io-kafka/0.2.0-incubating-SNAPSHOT/beam-sdks-java-io-kafka-0.2.0-incubating-SNAPSHOT-test-sources.jar
[JENKINS] Archiving <https://builds.apache.org/job/beam_PostCommit_MavenVerify/ws/sdks/java/io/kafka/target/beam-sdks-java-io-kafka-0.2.0-incubating-SNAPSHOT-tests.jar>
to org.apache.beam/beam-sdks-java-io-kafka/0.2.0-incubating-SNAPSHOT/beam-sdks-java-io-kafka-0.2.0-incubating-SNAPSHOT-tests.jar
[JENKINS] Archiving <https://builds.apache.org/job/beam_PostCommit_MavenVerify/ws/sdks/java/io/kafka/target/beam-sdks-java-io-kafka-0.2.0-incubating-SNAPSHOT-javadoc.jar>
to org.apache.beam/beam-sdks-java-io-kafka/0.2.0-incubating-SNAPSHOT/beam-sdks-java-io-kafka-0.2.0-incubating-SNAPSHOT-javadoc.jar
No artifacts from beam_PostCommit_MavenVerify » Apache Beam :: SDKs :: Java :: IO :: Kafka
#913 to compare, so performing full copy of artifacts
[JENKINS] Archiving <https://builds.apache.org/job/beam_PostCommit_MavenVerify/ws/sdks/java/maven-archetypes/starter/pom.xml>
to org.apache.beam/beam-sdks-java-maven-archetypes-starter/0.2.0-incubating-SNAPSHOT/beam-sdks-java-maven-archetypes-starter-0.2.0-incubating-SNAPSHOT.pom
[JENKINS] Archiving <https://builds.apache.org/job/beam_PostCommit_MavenVerify/ws/sdks/java/maven-archetypes/starter/target/beam-sdks-java-maven-archetypes-starter-0.2.0-incubating-SNAPSHOT.jar>
to org.apache.beam/beam-sdks-java-maven-archetypes-starter/0.2.0-incubating-SNAPSHOT/beam-sdks-java-maven-archetypes-starter-0.2.0-incubating-SNAPSHOT.jar
No artifacts from beam_PostCommit_MavenVerify » Apache Beam :: SDKs :: Java :: Maven Archetypes
:: Starter #913 to compare, so performing full copy of artifacts
[JENKINS] Archiving <https://builds.apache.org/job/beam_PostCommit_MavenVerify/ws/sdks/java/build-tools/pom.xml>
to org.apache.beam/beam-sdks-java-build-tools/0.2.0-incubating-SNAPSHOT/beam-sdks-java-build-tools-0.2.0-incubating-SNAPSHOT.pom
[JENKINS] Archiving <https://builds.apache.org/job/beam_PostCommit_MavenVerify/ws/sdks/java/build-tools/target/beam-sdks-java-build-tools-0.2.0-incubating-SNAPSHOT.jar>
to org.apache.beam/beam-sdks-java-build-tools/0.2.0-incubating-SNAPSHOT/beam-sdks-java-build-tools-0.2.0-incubating-SNAPSHOT.jar
[JENKINS] Archiving <https://builds.apache.org/job/beam_PostCommit_MavenVerify/ws/sdks/java/build-tools/target/beam-sdks-java-build-tools-0.2.0-incubating-SNAPSHOT-tests.jar>
to org.apache.beam/beam-sdks-java-build-tools/0.2.0-incubating-SNAPSHOT/beam-sdks-java-build-tools-0.2.0-incubating-SNAPSHOT-tests.jar
No artifacts from beam_PostCommit_MavenVerify » Apache Beam :: SDKs :: Java :: Build Tools
#913 to compare, so performing full copy of artifacts
[JENKINS] Archiving <https://builds.apache.org/job/beam_PostCommit_MavenVerify/ws/sdks/java/maven-archetypes/pom.xml>
to org.apache.beam/beam-sdks-java-maven-archetypes-parent/0.2.0-incubating-SNAPSHOT/beam-sdks-java-maven-archetypes-parent-0.2.0-incubating-SNAPSHOT.pom
No artifacts from beam_PostCommit_MavenVerify » Apache Beam :: SDKs :: Java :: Maven Archetypes
#913 to compare, so performing full copy of artifacts
Sending e-mails to: commits@beam.incubator.apache.org
channel stopped


Mime
View raw message