beam-commits mailing list archives

Site index · List index
Message view « Date » · « Thread »
Top « Date » · « Thread »
From Apache Jenkins Server <jenk...@builds.apache.org>
Subject Build failed in Jenkins: beam_PostCommit_MavenVerify #889
Date Fri, 15 Jul 2016 00:16:13 GMT
See <https://builds.apache.org/job/beam_PostCommit_MavenVerify/889/changes>

Changes:

[klk] [BEAM-37] DoFnReflector: Add invoker interface and generate code

------------------------------------------
[...truncated 3553 lines...]
[INFO] Downloaded: https://repo.maven.apache.org/maven2/org/apache/maven/maven-repository-metadata/3.0/maven-repository-metadata-3.0.jar
(30 KB at 177.0 KB/sec)
[INFO] Downloading: https://repo.maven.apache.org/maven2/org/sonatype/aether/aether-spi/1.7/aether-spi-1.7.jar
[INFO] Downloaded: https://repo.maven.apache.org/maven2/org/apache/maven/maven-aether-provider/3.0/maven-aether-provider-3.0.jar
(50 KB at 276.2 KB/sec)
[INFO] Downloading: https://repo.maven.apache.org/maven2/org/sonatype/aether/aether-api/1.7/aether-api-1.7.jar
[INFO] Downloaded: https://repo.maven.apache.org/maven2/org/apache/maven/maven-core/3.0/maven-core-3.0.jar
(515 KB at 2586.4 KB/sec)
[INFO] Downloading: https://repo.maven.apache.org/maven2/org/sonatype/aether/aether-util/1.7/aether-util-1.7.jar
[INFO] Downloaded: https://repo.maven.apache.org/maven2/org/apache/maven/maven-model-builder/3.0/maven-model-builder-3.0.jar
(145 KB at 722.5 KB/sec)
[INFO] Downloading: https://repo.maven.apache.org/maven2/org/codehaus/plexus/plexus-interpolation/1.14/plexus-interpolation-1.14.jar
[INFO] Downloaded: https://repo.maven.apache.org/maven2/org/sonatype/aether/aether-spi/1.7/aether-spi-1.7.jar
(14 KB at 61.5 KB/sec)
[INFO] Downloading: https://repo.maven.apache.org/maven2/org/codehaus/plexus/plexus-classworlds/2.2.3/plexus-classworlds-2.2.3.jar
[INFO] Downloaded: https://repo.maven.apache.org/maven2/org/sonatype/aether/aether-impl/1.7/aether-impl-1.7.jar
(104 KB at 473.9 KB/sec)
[INFO] Downloading: https://repo.maven.apache.org/maven2/org/apache/maven/maven-compat/3.0/maven-compat-3.0.jar
[INFO] Downloaded: https://repo.maven.apache.org/maven2/org/sonatype/aether/aether-api/1.7/aether-api-1.7.jar
(73 KB at 323.4 KB/sec)
[INFO] Downloading: https://repo.maven.apache.org/maven2/org/apache/maven/maven-artifact/3.0/maven-artifact-3.0.jar
[INFO] Downloaded: https://repo.maven.apache.org/maven2/org/codehaus/plexus/plexus-interpolation/1.14/plexus-interpolation-1.14.jar
(60 KB at 242.4 KB/sec)
[INFO] Downloading: https://repo.maven.apache.org/maven2/org/codehaus/plexus/plexus-utils/3.0.22/plexus-utils-3.0.22.jar
[INFO] Downloaded: https://repo.maven.apache.org/maven2/org/codehaus/plexus/plexus-classworlds/2.2.3/plexus-classworlds-2.2.3.jar
(46 KB at 170.5 KB/sec)
[INFO] Downloading: https://repo.maven.apache.org/maven2/org/ow2/asm/asm/5.0.2/asm-5.0.2.jar
[INFO] Downloaded: https://repo.maven.apache.org/maven2/org/sonatype/aether/aether-util/1.7/aether-util-1.7.jar
(106 KB at 389.0 KB/sec)
[INFO] Downloading: https://repo.maven.apache.org/maven2/org/ow2/asm/asm-commons/5.0.2/asm-commons-5.0.2.jar
[INFO] Downloaded: https://repo.maven.apache.org/maven2/org/apache/maven/maven-artifact/3.0/maven-artifact-3.0.jar
(51 KB at 185.0 KB/sec)
[INFO] Downloading: https://repo.maven.apache.org/maven2/org/ow2/asm/asm-tree/5.0.2/asm-tree-5.0.2.jar
[INFO] Downloaded: https://repo.maven.apache.org/maven2/org/codehaus/plexus/plexus-utils/3.0.22/plexus-utils-3.0.22.jar
(240 KB at 779.0 KB/sec)
[INFO] Downloading: https://repo.maven.apache.org/maven2/org/jdom/jdom/1.1/jdom-1.1.jar
[INFO] Downloaded: https://repo.maven.apache.org/maven2/org/ow2/asm/asm-tree/5.0.2/asm-tree-5.0.2.jar
(29 KB at 90.6 KB/sec)
[INFO] Downloading: https://repo.maven.apache.org/maven2/org/apache/maven/shared/maven-dependency-tree/2.2/maven-dependency-tree-2.2.jar
[INFO] Downloaded: https://repo.maven.apache.org/maven2/org/ow2/asm/asm-commons/5.0.2/asm-commons-5.0.2.jar
(41 KB at 126.5 KB/sec)
[INFO] Downloading: https://repo.maven.apache.org/maven2/org/eclipse/aether/aether-util/0.9.0.M2/aether-util-0.9.0.M2.jar
[INFO] Downloaded: https://repo.maven.apache.org/maven2/org/ow2/asm/asm/5.0.2/asm-5.0.2.jar
(52 KB at 160.9 KB/sec)
[INFO] Downloading: https://repo.maven.apache.org/maven2/org/vafer/jdependency/1.0/jdependency-1.0.jar
[INFO] Downloaded: https://repo.maven.apache.org/maven2/org/apache/maven/maven-compat/3.0/maven-compat-3.0.jar
(279 KB at 811.1 KB/sec)
[INFO] Downloading: https://repo.maven.apache.org/maven2/org/ow2/asm/asm-analysis/5.0.3/asm-analysis-5.0.3.jar
[INFO] Downloaded: https://repo.maven.apache.org/maven2/org/apache/maven/shared/maven-dependency-tree/2.2/maven-dependency-tree-2.2.jar
(63 KB at 173.9 KB/sec)
[INFO] Downloading: https://repo.maven.apache.org/maven2/org/ow2/asm/asm-util/5.0.3/asm-util-5.0.3.jar
[INFO] Downloaded: https://repo.maven.apache.org/maven2/org/jdom/jdom/1.1/jdom-1.1.jar (150
KB at 414.2 KB/sec)
[INFO] Downloading: https://repo.maven.apache.org/maven2/com/google/guava/guava/11.0.2/guava-11.0.2.jar
[INFO] Downloaded: https://repo.maven.apache.org/maven2/org/vafer/jdependency/1.0/jdependency-1.0.jar
(22 KB at 58.1 KB/sec)
[INFO] Downloading: https://repo.maven.apache.org/maven2/com/google/code/findbugs/jsr305/1.3.9/jsr305-1.3.9.jar
[INFO] Downloaded: https://repo.maven.apache.org/maven2/org/eclipse/aether/aether-util/0.9.0.M2/aether-util-0.9.0.M2.jar
(131 KB at 345.1 KB/sec)
[INFO] Downloaded: https://repo.maven.apache.org/maven2/org/ow2/asm/asm-analysis/5.0.3/asm-analysis-5.0.3.jar
(20 KB at 51.6 KB/sec)
[INFO] Downloaded: https://repo.maven.apache.org/maven2/org/ow2/asm/asm-util/5.0.3/asm-util-5.0.3.jar
(43 KB at 104.1 KB/sec)
[INFO] Downloaded: https://repo.maven.apache.org/maven2/com/google/code/findbugs/jsr305/1.3.9/jsr305-1.3.9.jar
(33 KB at 76.9 KB/sec)
[INFO] Downloaded: https://repo.maven.apache.org/maven2/com/google/guava/guava/11.0.2/guava-11.0.2.jar
(1610 KB at 2900.1 KB/sec)
[INFO] Excluding io.grpc:grpc-all:jar:0.13.1 from the shaded jar.
[INFO] Excluding io.grpc:grpc-auth:jar:0.13.1 from the shaded jar.
[INFO] Excluding io.grpc:grpc-netty:jar:0.13.1 from the shaded jar.
[INFO] Excluding io.netty:netty-codec-http2:jar:4.1.0.CR1 from the shaded jar.
[INFO] Excluding io.netty:netty-codec-http:jar:4.1.0.CR1 from the shaded jar.
[INFO] Excluding io.grpc:grpc-protobuf:jar:0.13.1 from the shaded jar.
[INFO] Excluding io.grpc:grpc-core:jar:0.13.1 from the shaded jar.
[INFO] Excluding io.grpc:grpc-okhttp:jar:0.13.1 from the shaded jar.
[INFO] Excluding com.squareup.okio:okio:jar:1.6.0 from the shaded jar.
[INFO] Excluding com.squareup.okhttp:okhttp:jar:2.5.0 from the shaded jar.
[INFO] Excluding io.grpc:grpc-protobuf-nano:jar:0.13.1 from the shaded jar.
[INFO] Excluding com.google.protobuf.nano:protobuf-javanano:jar:3.0.0-alpha-5 from the shaded
jar.
[INFO] Excluding io.grpc:grpc-stub:jar:0.13.1 from the shaded jar.
[INFO] Excluding com.google.auth:google-auth-library-oauth2-http:jar:0.4.0 from the shaded
jar.
[INFO] Excluding com.google.auth:google-auth-library-credentials:jar:0.4.0 from the shaded
jar.
[INFO] Excluding io.netty:netty-handler:jar:4.1.0.CR1 from the shaded jar.
[INFO] Excluding io.netty:netty-buffer:jar:4.1.0.CR1 from the shaded jar.
[INFO] Excluding io.netty:netty-common:jar:4.1.0.CR1 from the shaded jar.
[INFO] Excluding io.netty:netty-transport:jar:4.1.0.CR1 from the shaded jar.
[INFO] Excluding io.netty:netty-resolver:jar:4.1.0.CR1 from the shaded jar.
[INFO] Excluding io.netty:netty-codec:jar:4.1.0.CR1 from the shaded jar.
[INFO] Excluding com.google.api.grpc:grpc-pubsub-v1:jar:0.0.2 from the shaded jar.
[INFO] Excluding com.google.api.grpc:grpc-core-proto:jar:0.0.3 from the shaded jar.
[INFO] Excluding com.google.api-client:google-api-client:jar:1.22.0 from the shaded jar.
[INFO] Excluding com.google.apis:google-api-services-bigquery:jar:v2-rev295-1.22.0 from the
shaded jar.
[INFO] Excluding com.google.apis:google-api-services-pubsub:jar:v1-rev10-1.22.0 from the shaded
jar.
[INFO] Excluding com.google.apis:google-api-services-storage:jar:v1-rev71-1.22.0 from the
shaded jar.
[INFO] Excluding com.google.http-client:google-http-client:jar:1.22.0 from the shaded jar.
[INFO] Excluding org.apache.httpcomponents:httpclient:jar:4.0.1 from the shaded jar.
[INFO] Excluding org.apache.httpcomponents:httpcore:jar:4.0.1 from the shaded jar.
[INFO] Excluding commons-logging:commons-logging:jar:1.1.1 from the shaded jar.
[INFO] Excluding commons-codec:commons-codec:jar:1.3 from the shaded jar.
[INFO] Excluding com.google.http-client:google-http-client-jackson:jar:1.22.0 from the shaded
jar.
[INFO] Excluding com.google.http-client:google-http-client-jackson2:jar:1.22.0 from the shaded
jar.
[INFO] Excluding com.google.http-client:google-http-client-protobuf:jar:1.22.0 from the shaded
jar.
[INFO] Excluding com.google.oauth-client:google-oauth-client-java6:jar:1.22.0 from the shaded
jar.
[INFO] Excluding com.google.oauth-client:google-oauth-client:jar:1.22.0 from the shaded jar.
[INFO] Excluding com.google.cloud.bigdataoss:gcsio:jar:1.4.5 from the shaded jar.
[INFO] Excluding com.google.api-client:google-api-client-java6:jar:1.22.0 from the shaded
jar.
[INFO] Excluding com.google.api-client:google-api-client-jackson2:jar:1.22.0 from the shaded
jar.
[INFO] Excluding com.google.cloud.bigdataoss:util:jar:1.4.5 from the shaded jar.
[INFO] Including com.google.guava:guava:jar:19.0 in the shaded jar.
[INFO] Excluding com.google.protobuf:protobuf-java:jar:3.0.0-beta-1 from the shaded jar.
[INFO] Excluding com.google.code.findbugs:annotations:jar:3.0.1 from the shaded jar.
[INFO] Excluding net.jcip:jcip-annotations:jar:1.0 from the shaded jar.
[INFO] Excluding com.google.code.findbugs:jsr305:jar:3.0.1 from the shaded jar.
[INFO] Excluding com.fasterxml.jackson.core:jackson-core:jar:2.7.2 from the shaded jar.
[INFO] Excluding com.fasterxml.jackson.core:jackson-annotations:jar:2.7.2 from the shaded
jar.
[INFO] Excluding com.fasterxml.jackson.core:jackson-databind:jar:2.7.2 from the shaded jar.
[INFO] Excluding org.slf4j:slf4j-api:jar:1.7.14 from the shaded jar.
[INFO] Excluding net.bytebuddy:byte-buddy:jar:1.4.3 from the shaded jar.
[INFO] Excluding org.apache.avro:avro:jar:1.7.7 from the shaded jar.
[INFO] Excluding org.codehaus.jackson:jackson-core-asl:jar:1.9.13 from the shaded jar.
[INFO] Excluding org.codehaus.jackson:jackson-mapper-asl:jar:1.9.13 from the shaded jar.
[INFO] Excluding com.thoughtworks.paranamer:paranamer:jar:2.3 from the shaded jar.
[INFO] Excluding org.xerial.snappy:snappy-java:jar:1.1.2.1 from the shaded jar.
[INFO] Excluding org.apache.commons:commons-compress:jar:1.9 from the shaded jar.
[INFO] Excluding joda-time:joda-time:jar:2.4 from the shaded jar.
[INFO] Excluding org.codehaus.woodstox:stax2-api:jar:3.1.4 from the shaded jar.
[INFO] Excluding org.codehaus.woodstox:woodstox-core-asl:jar:4.4.1 from the shaded jar.
[INFO] Excluding org.tukaani:xz:jar:1.5 from the shaded jar.
[INFO] Excluding com.google.auto.service:auto-service:jar:1.0-rc2 from the shaded jar.
[INFO] Excluding com.google.auto:auto-common:jar:0.3 from the shaded jar.
[INFO]                                                                         
[INFO] ------------------------------------------------------------------------
[INFO] Skipping Apache Beam :: Parent
[INFO] This project has been banned from the build due to previous failures.
[INFO] ------------------------------------------------------------------------
[INFO] ------------------------------------------------------------------------
[INFO] Reactor Summary:
[INFO] 
[INFO] Apache Beam :: Parent .............................. SUCCESS [ 45.358 s]
[INFO] Apache Beam :: SDKs ................................ SUCCESS [  1.880 s]
[INFO] Apache Beam :: SDKs :: Java ........................ SUCCESS [  2.788 s]
[INFO] Apache Beam :: SDKs :: Java :: Build Tools ......... SUCCESS [ 10.781 s]
[INFO] Apache Beam :: SDKs :: Java :: Core ................ FAILURE [06:00 min]
[INFO] Apache Beam :: Runners ............................. SKIPPED
[INFO] Apache Beam :: Runners :: Core Java ................ SKIPPED
[INFO] Apache Beam :: Runners :: Direct Java .............. SKIPPED
[INFO] Apache Beam :: Runners :: Google Cloud Dataflow .... SKIPPED
[INFO] Apache Beam :: SDKs :: Java :: IO .................. SKIPPED
[INFO] Apache Beam :: SDKs :: Java :: IO :: Google Cloud Platform SKIPPED
[INFO] Apache Beam :: SDKs :: Java :: IO :: HDFS .......... SKIPPED
[INFO] Apache Beam :: SDKs :: Java :: IO :: Kafka ......... SKIPPED
[INFO] Apache Beam :: SDKs :: Java :: Extensions .......... SKIPPED
[INFO] Apache Beam :: SDKs :: Java :: Extensions :: Join library SKIPPED
[INFO] Apache Beam :: SDKs :: Java :: Microbenchmarks ..... SKIPPED
[INFO] Apache Beam :: SDKs :: Java :: Java 8 Tests ........ SKIPPED
[INFO] Apache Beam :: Runners :: Flink .................... SKIPPED
[INFO] Apache Beam :: Runners :: Flink :: Core ............ SKIPPED
[INFO] Apache Beam :: Runners :: Flink :: Examples ........ SKIPPED
[INFO] Apache Beam :: Examples ............................ SKIPPED
[INFO] Apache Beam :: Examples :: Java .................... SKIPPED
[INFO] Apache Beam :: Runners :: Spark .................... SKIPPED
[INFO] Apache Beam :: SDKs :: Java :: Maven Archetypes .... SKIPPED
[INFO] Apache Beam :: SDKs :: Java :: Maven Archetypes :: Starter SKIPPED
[INFO] Apache Beam :: SDKs :: Java :: Maven Archetypes :: Examples SKIPPED
[INFO] Apache Beam :: Examples :: Java 8 .................. SKIPPED
[INFO] ------------------------------------------------------------------------
[INFO] BUILD FAILURE
[INFO] ------------------------------------------------------------------------
[INFO] Total time: 07:44 min
[INFO] Finished at: 2016-07-15T00:15:55+00:00
[INFO] Final Memory: 84M/884M
[INFO] ------------------------------------------------------------------------
[ERROR] Failed to execute goal org.apache.maven.plugins:maven-shade-plugin:2.4.1:shade (bundle-and-repackage)
on project beam-sdks-java-core: Error creating shaded jar: <https://builds.apache.org/job/beam_PostCommit_MavenVerify/ws/.repository/com/google/guava/guava/19.0/guava-19.0.jar>
(No such file or directory) -> [Help 1]
org.apache.maven.lifecycle.LifecycleExecutionException: Failed to execute goal org.apache.maven.plugins:maven-shade-plugin:2.4.1:shade
(bundle-and-repackage) on project beam-sdks-java-core: Error creating shaded jar: <https://builds.apache.org/job/beam_PostCommit_MavenVerify/ws/.repository/com/google/guava/guava/19.0/guava-19.0.jar>
(No such file or directory)
	at org.apache.maven.lifecycle.internal.MojoExecutor.execute(MojoExecutor.java:216)
	at org.apache.maven.lifecycle.internal.MojoExecutor.execute(MojoExecutor.java:153)
	at org.apache.maven.lifecycle.internal.MojoExecutor.execute(MojoExecutor.java:145)
	at org.apache.maven.lifecycle.internal.LifecycleModuleBuilder.buildProject(LifecycleModuleBuilder.java:116)
	at org.apache.maven.lifecycle.internal.LifecycleModuleBuilder.buildProject(LifecycleModuleBuilder.java:80)
	at org.apache.maven.lifecycle.internal.builder.singlethreaded.SingleThreadedBuilder.build(SingleThreadedBuilder.java:51)
	at org.apache.maven.lifecycle.internal.LifecycleStarter.execute(LifecycleStarter.java:128)
	at org.apache.maven.DefaultMaven.doExecute(DefaultMaven.java:307)
	at org.apache.maven.DefaultMaven.doExecute(DefaultMaven.java:193)
	at org.apache.maven.DefaultMaven.execute(DefaultMaven.java:106)
	at org.jvnet.hudson.maven3.launcher.Maven32Launcher.main(Maven32Launcher.java:132)
	at sun.reflect.NativeMethodAccessorImpl.invoke0(Native Method)
	at sun.reflect.NativeMethodAccessorImpl.invoke(NativeMethodAccessorImpl.java:62)
	at sun.reflect.DelegatingMethodAccessorImpl.invoke(DelegatingMethodAccessorImpl.java:43)
	at java.lang.reflect.Method.invoke(Method.java:497)
	at org.codehaus.plexus.classworlds.launcher.Launcher.launchStandard(Launcher.java:330)
	at org.codehaus.plexus.classworlds.launcher.Launcher.launch(Launcher.java:238)
	at jenkins.maven3.agent.Maven32Main.launch(Maven32Main.java:186)
	at sun.reflect.NativeMethodAccessorImpl.invoke0(Native Method)
	at sun.reflect.NativeMethodAccessorImpl.invoke(NativeMethodAccessorImpl.java:62)
	at sun.reflect.DelegatingMethodAccessorImpl.invoke(DelegatingMethodAccessorImpl.java:43)
	at java.lang.reflect.Method.invoke(Method.java:497)
	at hudson.maven.Maven3Builder.call(Maven3Builder.java:136)
	at hudson.maven.Maven3Builder.call(Maven3Builder.java:71)
	at hudson.remoting.UserRequest.perform(UserRequest.java:120)
	at hudson.remoting.UserRequest.perform(UserRequest.java:48)
	at hudson.remoting.Request$2.run(Request.java:326)
	at hudson.remoting.InterceptingExecutorService$1.call(InterceptingExecutorService.java:68)
	at java.util.concurrent.FutureTask.run(FutureTask.java:266)
	at java.util.concurrent.ThreadPoolExecutor.runWorker(ThreadPoolExecutor.java:1142)
	at java.util.concurrent.ThreadPoolExecutor$Worker.run(ThreadPoolExecutor.java:617)
	at java.lang.Thread.run(Thread.java:745)
Caused by: org.apache.maven.plugin.MojoExecutionException: Error creating shaded jar: <https://builds.apache.org/job/beam_PostCommit_MavenVerify/ws/.repository/com/google/guava/guava/19.0/guava-19.0.jar>
(No such file or directory)
	at org.apache.maven.plugins.shade.mojo.ShadeMojo.execute(ShadeMojo.java:539)
	at org.apache.maven.plugin.DefaultBuildPluginManager.executeMojo(DefaultBuildPluginManager.java:134)
	at org.apache.maven.lifecycle.internal.MojoExecutor.execute(MojoExecutor.java:208)
	... 31 more
Caused by: java.io.FileNotFoundException: <https://builds.apache.org/job/beam_PostCommit_MavenVerify/ws/.repository/com/google/guava/guava/19.0/guava-19.0.jar>
(No such file or directory)
	at java.util.zip.ZipFile.open(Native Method)
	at java.util.zip.ZipFile.<init>(ZipFile.java:219)
	at java.util.zip.ZipFile.<init>(ZipFile.java:149)
	at java.util.jar.JarFile.<init>(JarFile.java:166)
	at java.util.jar.JarFile.<init>(JarFile.java:130)
	at org.apache.maven.plugins.shade.DefaultShader.newJarFile(DefaultShader.java:298)
	at org.apache.maven.plugins.shade.DefaultShader.shade(DefaultShader.java:109)
	at org.apache.maven.plugins.shade.mojo.ShadeMojo.execute(ShadeMojo.java:454)
	... 33 more
[ERROR] 
[ERROR] Re-run Maven using the -X switch to enable full debug logging.
[ERROR] 
[ERROR] For more information about the errors and possible solutions, please read the following
articles:
[ERROR] [Help 1] http://cwiki.apache.org/confluence/display/MAVEN/MojoExecutionException
[ERROR] 
[ERROR] After correcting the problems, you can resume the build with the command
[ERROR]   mvn <goals> -rf :beam-sdks-java-core
[JENKINS] Archiving <https://builds.apache.org/job/beam_PostCommit_MavenVerify/ws/sdks/pom.xml>
to org.apache.beam/beam-sdks-parent/0.2.0-incubating-SNAPSHOT/beam-sdks-parent-0.2.0-incubating-SNAPSHOT.pom
No artifacts from beam_PostCommit_MavenVerify » Apache Beam :: SDKs #888 to compare, so performing
full copy of artifacts
[JENKINS] Archiving <https://builds.apache.org/job/beam_PostCommit_MavenVerify/ws/sdks/java/extensions/join-library/pom.xml>
to org.apache.beam/beam-sdks-java-extensions-join-library/0.2.0-incubating-SNAPSHOT/beam-sdks-java-extensions-join-library-0.2.0-incubating-SNAPSHOT.pom
[JENKINS] Archiving <https://builds.apache.org/job/beam_PostCommit_MavenVerify/ws/sdks/java/maven-archetypes/examples/pom.xml>
to org.apache.beam/beam-sdks-java-maven-archetypes-examples/0.2.0-incubating-SNAPSHOT/beam-sdks-java-maven-archetypes-examples-0.2.0-incubating-SNAPSHOT.pom
[JENKINS] Archiving <https://builds.apache.org/job/beam_PostCommit_MavenVerify/ws/runners/core-java/pom.xml>
to org.apache.beam/beam-runners-core-java/0.2.0-incubating-SNAPSHOT/beam-runners-core-java-0.2.0-incubating-SNAPSHOT.pom
No artifacts from beam_PostCommit_MavenVerify » Apache Beam :: Runners :: Core Java #888
to compare, so performing full copy of artifacts
[JENKINS] Archiving <https://builds.apache.org/job/beam_PostCommit_MavenVerify/ws/sdks/java/extensions/pom.xml>
to org.apache.beam/beam-sdks-java-extensions-parent/0.2.0-incubating-SNAPSHOT/beam-sdks-java-extensions-parent-0.2.0-incubating-SNAPSHOT.pom
[JENKINS] Archiving <https://builds.apache.org/job/beam_PostCommit_MavenVerify/ws/sdks/java/pom.xml>
to org.apache.beam/beam-sdks-java-parent/0.2.0-incubating-SNAPSHOT/beam-sdks-java-parent-0.2.0-incubating-SNAPSHOT.pom
No artifacts from beam_PostCommit_MavenVerify » Apache Beam :: SDKs :: Java #888 to compare,
so performing full copy of artifacts
[JENKINS] Archiving <https://builds.apache.org/job/beam_PostCommit_MavenVerify/ws/runners/spark/pom.xml>
to org.apache.beam/beam-runners-spark/0.2.0-incubating-SNAPSHOT/beam-runners-spark-0.2.0-incubating-SNAPSHOT.pom
[JENKINS] Archiving <https://builds.apache.org/job/beam_PostCommit_MavenVerify/ws/runners/flink/pom.xml>
to org.apache.beam/beam-runners-flink-parent/0.2.0-incubating-SNAPSHOT/beam-runners-flink-parent-0.2.0-incubating-SNAPSHOT.pom
[JENKINS] Archiving <https://builds.apache.org/job/beam_PostCommit_MavenVerify/ws/runners/direct-java/pom.xml>
to org.apache.beam/beam-runners-direct-java/0.2.0-incubating-SNAPSHOT/beam-runners-direct-java-0.2.0-incubating-SNAPSHOT.pom
No artifacts from beam_PostCommit_MavenVerify » Apache Beam :: Runners :: Direct Java #888
to compare, so performing full copy of artifacts
[JENKINS] Archiving <https://builds.apache.org/job/beam_PostCommit_MavenVerify/ws/examples/pom.xml>
to org.apache.beam/beam-examples-parent/0.2.0-incubating-SNAPSHOT/beam-examples-parent-0.2.0-incubating-SNAPSHOT.pom
[JENKINS] Archiving <https://builds.apache.org/job/beam_PostCommit_MavenVerify/ws/sdks/java/io/google-cloud-platform/pom.xml>
to org.apache.beam/beam-sdks-java-io-google-cloud-platform/0.2.0-incubating-SNAPSHOT/beam-sdks-java-io-google-cloud-platform-0.2.0-incubating-SNAPSHOT.pom
[JENKINS] Archiving <https://builds.apache.org/job/beam_PostCommit_MavenVerify/ws/runners/pom.xml>
to org.apache.beam/beam-runners-parent/0.2.0-incubating-SNAPSHOT/beam-runners-parent-0.2.0-incubating-SNAPSHOT.pom
No artifacts from beam_PostCommit_MavenVerify » Apache Beam :: Runners #888 to compare, so
performing full copy of artifacts
[JENKINS] Archiving <https://builds.apache.org/job/beam_PostCommit_MavenVerify/ws/runners/google-cloud-dataflow-java/pom.xml>
to org.apache.beam/beam-runners-google-cloud-dataflow-java/0.2.0-incubating-SNAPSHOT/beam-runners-google-cloud-dataflow-java-0.2.0-incubating-SNAPSHOT.pom
No artifacts from beam_PostCommit_MavenVerify » Apache Beam :: Runners :: Google Cloud Dataflow
#888 to compare, so performing full copy of artifacts
[JENKINS] Archiving <https://builds.apache.org/job/beam_PostCommit_MavenVerify/ws/sdks/java/io/pom.xml>
to org.apache.beam/beam-sdks-java-io-parent/0.2.0-incubating-SNAPSHOT/beam-sdks-java-io-parent-0.2.0-incubating-SNAPSHOT.pom
No artifacts from beam_PostCommit_MavenVerify » Apache Beam :: SDKs :: Java :: IO #888 to
compare, so performing full copy of artifacts
[JENKINS] Archiving <https://builds.apache.org/job/beam_PostCommit_MavenVerify/ws/examples/java/pom.xml>
to org.apache.beam/beam-examples-java/0.2.0-incubating-SNAPSHOT/beam-examples-java-0.2.0-incubating-SNAPSHOT.pom
[JENKINS] Archiving <https://builds.apache.org/job/beam_PostCommit_MavenVerify/ws/runners/flink/runner/pom.xml>
to org.apache.beam/beam-runners-flink_2.10/0.2.0-incubating-SNAPSHOT/beam-runners-flink_2.10-0.2.0-incubating-SNAPSHOT.pom
[JENKINS] Archiving <https://builds.apache.org/job/beam_PostCommit_MavenVerify/ws/pom.xml>
to org.apache.beam/beam-parent/0.2.0-incubating-SNAPSHOT/beam-parent-0.2.0-incubating-SNAPSHOT.pom
No artifacts from beam_PostCommit_MavenVerify » Apache Beam :: Parent #888 to compare, so
performing full copy of artifacts
[JENKINS] Archiving <https://builds.apache.org/job/beam_PostCommit_MavenVerify/ws/sdks/java/core/pom.xml>
to org.apache.beam/beam-sdks-java-core/0.2.0-incubating-SNAPSHOT/beam-sdks-java-core-0.2.0-incubating-SNAPSHOT.pom
[JENKINS] Archiving <https://builds.apache.org/job/beam_PostCommit_MavenVerify/ws/sdks/java/core/target/beam-sdks-java-core-0.2.0-incubating-SNAPSHOT.jar>
to org.apache.beam/beam-sdks-java-core/0.2.0-incubating-SNAPSHOT/beam-sdks-java-core-0.2.0-incubating-SNAPSHOT.jar
[JENKINS] Archiving <https://builds.apache.org/job/beam_PostCommit_MavenVerify/ws/sdks/java/core/target/beam-sdks-java-core-0.2.0-incubating-SNAPSHOT-tests.jar>
to org.apache.beam/beam-sdks-java-core/0.2.0-incubating-SNAPSHOT/beam-sdks-java-core-0.2.0-incubating-SNAPSHOT-tests.jar
[JENKINS] Archiving <https://builds.apache.org/job/beam_PostCommit_MavenVerify/ws/sdks/java/core/target/beam-sdks-java-core-0.2.0-incubating-SNAPSHOT-sources.jar>
to org.apache.beam/beam-sdks-java-core/0.2.0-incubating-SNAPSHOT/beam-sdks-java-core-0.2.0-incubating-SNAPSHOT-sources.jar
[JENKINS] Archiving <https://builds.apache.org/job/beam_PostCommit_MavenVerify/ws/sdks/java/core/target/beam-sdks-java-core-0.2.0-incubating-SNAPSHOT-test-sources.jar>
to org.apache.beam/beam-sdks-java-core/0.2.0-incubating-SNAPSHOT/beam-sdks-java-core-0.2.0-incubating-SNAPSHOT-test-sources.jar
[JENKINS] Archiving <https://builds.apache.org/job/beam_PostCommit_MavenVerify/ws/sdks/java/core/target/beam-sdks-java-core-0.2.0-incubating-SNAPSHOT-javadoc.jar>
to org.apache.beam/beam-sdks-java-core/0.2.0-incubating-SNAPSHOT/beam-sdks-java-core-0.2.0-incubating-SNAPSHOT-javadoc.jar
No artifacts from beam_PostCommit_MavenVerify » Apache Beam :: SDKs :: Java :: Core #888
to compare, so performing full copy of artifacts
[JENKINS] Archiving <https://builds.apache.org/job/beam_PostCommit_MavenVerify/ws/sdks/java/microbenchmarks/pom.xml>
to org.apache.beam/beam-sdks-java-microbenchmarks/0.2.0-incubating-SNAPSHOT/beam-sdks-java-microbenchmarks-0.2.0-incubating-SNAPSHOT.pom
[JENKINS] Archiving <https://builds.apache.org/job/beam_PostCommit_MavenVerify/ws/runners/flink/examples/pom.xml>
to org.apache.beam/beam-runners-flink_2.10-examples/0.2.0-incubating-SNAPSHOT/beam-runners-flink_2.10-examples-0.2.0-incubating-SNAPSHOT.pom
[JENKINS] Archiving <https://builds.apache.org/job/beam_PostCommit_MavenVerify/ws/sdks/java/io/hdfs/pom.xml>
to org.apache.beam/beam-sdks-java-io-hdfs/0.2.0-incubating-SNAPSHOT/beam-sdks-java-io-hdfs-0.2.0-incubating-SNAPSHOT.pom
[JENKINS] Archiving <https://builds.apache.org/job/beam_PostCommit_MavenVerify/ws/sdks/java/io/kafka/pom.xml>
to org.apache.beam/beam-sdks-java-io-kafka/0.2.0-incubating-SNAPSHOT/beam-sdks-java-io-kafka-0.2.0-incubating-SNAPSHOT.pom
[JENKINS] Archiving <https://builds.apache.org/job/beam_PostCommit_MavenVerify/ws/sdks/java/maven-archetypes/starter/pom.xml>
to org.apache.beam/beam-sdks-java-maven-archetypes-starter/0.2.0-incubating-SNAPSHOT/beam-sdks-java-maven-archetypes-starter-0.2.0-incubating-SNAPSHOT.pom
[JENKINS] Archiving <https://builds.apache.org/job/beam_PostCommit_MavenVerify/ws/sdks/java/build-tools/pom.xml>
to org.apache.beam/beam-sdks-java-build-tools/0.2.0-incubating-SNAPSHOT/beam-sdks-java-build-tools-0.2.0-incubating-SNAPSHOT.pom
[JENKINS] Archiving <https://builds.apache.org/job/beam_PostCommit_MavenVerify/ws/sdks/java/build-tools/target/beam-sdks-java-build-tools-0.2.0-incubating-SNAPSHOT.jar>
to org.apache.beam/beam-sdks-java-build-tools/0.2.0-incubating-SNAPSHOT/beam-sdks-java-build-tools-0.2.0-incubating-SNAPSHOT.jar
[JENKINS] Archiving <https://builds.apache.org/job/beam_PostCommit_MavenVerify/ws/sdks/java/build-tools/target/beam-sdks-java-build-tools-0.2.0-incubating-SNAPSHOT-tests.jar>
to org.apache.beam/beam-sdks-java-build-tools/0.2.0-incubating-SNAPSHOT/beam-sdks-java-build-tools-0.2.0-incubating-SNAPSHOT-tests.jar
No artifacts from beam_PostCommit_MavenVerify » Apache Beam :: SDKs :: Java :: Build Tools
#888 to compare, so performing full copy of artifacts
[JENKINS] Archiving <https://builds.apache.org/job/beam_PostCommit_MavenVerify/ws/sdks/java/maven-archetypes/pom.xml>
to org.apache.beam/beam-sdks-java-maven-archetypes-parent/0.2.0-incubating-SNAPSHOT/beam-sdks-java-maven-archetypes-parent-0.2.0-incubating-SNAPSHOT.pom
Sending e-mails to: commits@beam.incubator.apache.org
channel stopped

Mime
View raw message