beam-commits mailing list archives

Site index · List index
Message view « Date » · « Thread »
Top « Date » · « Thread »
From "Daniel Halperin (JIRA)" <j...@apache.org>
Subject [jira] [Updated] (BEAM-133) Test flakiness in the Spark runner
Date Sat, 25 Jun 2016 17:16:37 GMT

     [ https://issues.apache.org/jira/browse/BEAM-133?page=com.atlassian.jira.plugin.system.issuetabpanels:all-tabpanel
]

Daniel Halperin updated BEAM-133:
---------------------------------
    Component/s:     (was: project-management)
                 testing

> Test flakiness in the Spark runner
> ----------------------------------
>
>                 Key: BEAM-133
>                 URL: https://issues.apache.org/jira/browse/BEAM-133
>             Project: Beam
>          Issue Type: Bug
>          Components: testing
>            Reporter: Davor Bonaci
>            Assignee: Davor Bonaci
>             Fix For: Not applicable
>
>
> Jenkins shows some flakiness in the Spark runner in the context of an unrelated pre-commit
test.
> {code}
>     Results :
>     Tests in error: 
>       AvroPipelineTest.testGeneric:75 » Runtime java.io.IOException: Could not creat...
>       NumShardsTest.testText:77 » Runtime java.io.IOException: Could not create File...
>       HadoopFileFormatPipelineTest.testSequenceFile:83 » Runtime java.io.IOException...
>       TransformTranslatorTest.testTextIOReadAndWriteTransforms:76->runPipeline:96
» Runtime
>       KafkaStreamingTest.testRun:121 » Runtime java.io.IOException: failure to login...
>     Tests run: 27, Failures: 0, Errors: 5, Skipped: 0
>     [ERROR] There are test failures.
> {code}
> https://builds.apache.org/job/beam_PreCommit/98/console
> Amit, does this sounds like a test code issue or the infrastructure issue?



--
This message was sent by Atlassian JIRA
(v6.3.4#6332)

Mime
View raw message