beam-commits mailing list archives

Site index · List index
Message view « Date » · « Thread »
Top « Date » · « Thread »
From Apache Jenkins Server <jenk...@builds.apache.org>
Subject Build failed in Jenkins: beam_PostCommit_MavenVerify #542
Date Wed, 01 Jun 2016 18:12:59 GMT
See <https://builds.apache.org/job/beam_PostCommit_MavenVerify/542/>

------------------------------------------
[...truncated 2829 lines...]
[WARNING] Entry: apache-beam-0.1.0-incubating-SNAPSHOT/.repository/org/apache/beam/io/google-cloud-platform/0.1.0-incubating-SNAPSHOT/_remote.repositories
longer than 100 characters.
[WARNING] Entry: apache-beam-0.1.0-incubating-SNAPSHOT/.repository/org/apache/beam/io/google-cloud-platform/0.1.0-incubating-SNAPSHOT/google-cloud-platform-0.1.0-incubating-SNAPSHOT.jar
longer than 100 characters.
[WARNING] Entry: apache-beam-0.1.0-incubating-SNAPSHOT/.repository/org/apache/beam/io/google-cloud-platform/maven-metadata-local.xml
longer than 100 characters.
[WARNING] Entry: apache-beam-0.1.0-incubating-SNAPSHOT/.repository/org/apache/beam/io/kafka/0.1.0-incubating-SNAPSHOT/kafka-0.1.0-incubating-SNAPSHOT.jar
longer than 100 characters.
[WARNING] Entry: apache-beam-0.1.0-incubating-SNAPSHOT/.repository/org/apache/beam/io/kafka/0.1.0-incubating-SNAPSHOT/kafka-0.1.0-incubating-SNAPSHOT-test-sources.jar
longer than 100 characters.
[WARNING] Entry: apache-beam-0.1.0-incubating-SNAPSHOT/.repository/org/apache/beam/io/kafka/0.1.0-incubating-SNAPSHOT/kafka-0.1.0-incubating-SNAPSHOT-src.tar.gz
longer than 100 characters.
[WARNING] Entry: apache-beam-0.1.0-incubating-SNAPSHOT/.repository/org/apache/beam/io/kafka/0.1.0-incubating-SNAPSHOT/maven-metadata-local.xml
longer than 100 characters.
[WARNING] Entry: apache-beam-0.1.0-incubating-SNAPSHOT/.repository/org/apache/beam/io/kafka/0.1.0-incubating-SNAPSHOT/kafka-0.1.0-incubating-SNAPSHOT-tests.jar
longer than 100 characters.
[WARNING] Entry: apache-beam-0.1.0-incubating-SNAPSHOT/.repository/org/apache/beam/io/kafka/0.1.0-incubating-SNAPSHOT/kafka-0.1.0-incubating-SNAPSHOT.pom
longer than 100 characters.
[WARNING] Entry: apache-beam-0.1.0-incubating-SNAPSHOT/.repository/org/apache/beam/io/kafka/0.1.0-incubating-SNAPSHOT/kafka-0.1.0-incubating-SNAPSHOT-src.zip
longer than 100 characters.
[WARNING] Entry: apache-beam-0.1.0-incubating-SNAPSHOT/.repository/org/apache/beam/io/kafka/0.1.0-incubating-SNAPSHOT/kafka-0.1.0-incubating-SNAPSHOT-sources.jar
longer than 100 characters.
[WARNING] Entry: apache-beam-0.1.0-incubating-SNAPSHOT/.repository/org/apache/beam/io/kafka/0.1.0-incubating-SNAPSHOT/_remote.repositories
longer than 100 characters.
[WARNING] Entry: apache-beam-0.1.0-incubating-SNAPSHOT/.repository/org/apache/beam/runners/google-cloud-dataflow-java/resolver-status.properties
longer than 100 characters.
[WARNING] Entry: apache-beam-0.1.0-incubating-SNAPSHOT/.repository/org/apache/beam/runners/google-cloud-dataflow-java/0.1.0-incubating-SNAPSHOT/google-cloud-dataflow-java-0.1.0-incubating-SNAPSHOT.pom
longer than 100 characters.
[WARNING] Entry: apache-beam-0.1.0-incubating-SNAPSHOT/.repository/org/apache/beam/runners/google-cloud-dataflow-java/0.1.0-incubating-SNAPSHOT/google-cloud-dataflow-java-0.1.0-incubating-SNAPSHOT-tests.jar
longer than 100 characters.
[WARNING] Entry: apache-beam-0.1.0-incubating-SNAPSHOT/.repository/org/apache/beam/runners/google-cloud-dataflow-java/0.1.0-incubating-SNAPSHOT/google-cloud-dataflow-java-0.1.0-incubating-SNAPSHOT-javadoc.jar
longer than 100 characters.
[WARNING] Entry: apache-beam-0.1.0-incubating-SNAPSHOT/.repository/org/apache/beam/runners/google-cloud-dataflow-java/0.1.0-incubating-SNAPSHOT/google-cloud-dataflow-java-0.1.0-incubating-SNAPSHOT-src.tar.gz
longer than 100 characters.
[WARNING] Entry: apache-beam-0.1.0-incubating-SNAPSHOT/.repository/org/apache/beam/runners/google-cloud-dataflow-java/0.1.0-incubating-SNAPSHOT/google-cloud-dataflow-java-0.1.0-incubating-SNAPSHOT-test-sources.jar
longer than 100 characters.
[WARNING] Entry: apache-beam-0.1.0-incubating-SNAPSHOT/.repository/org/apache/beam/runners/google-cloud-dataflow-java/0.1.0-incubating-SNAPSHOT/google-cloud-dataflow-java-0.1.0-incubating-SNAPSHOT-sources.jar
longer than 100 characters.
[WARNING] Entry: apache-beam-0.1.0-incubating-SNAPSHOT/.repository/org/apache/beam/runners/google-cloud-dataflow-java/0.1.0-incubating-SNAPSHOT/google-cloud-dataflow-java-0.1.0-incubating-SNAPSHOT-src.zip
longer than 100 characters.
[WARNING] Entry: apache-beam-0.1.0-incubating-SNAPSHOT/.repository/org/apache/beam/runners/google-cloud-dataflow-java/0.1.0-incubating-SNAPSHOT/google-cloud-dataflow-java-0.1.0-incubating-SNAPSHOT.jar
longer than 100 characters.
[WARNING] Entry: apache-beam-0.1.0-incubating-SNAPSHOT/.repository/org/apache/beam/runners/google-cloud-dataflow-java/0.1.0-incubating-SNAPSHOT/maven-metadata-local.xml
longer than 100 characters.
[WARNING] Entry: apache-beam-0.1.0-incubating-SNAPSHOT/.repository/org/apache/beam/runners/google-cloud-dataflow-java/0.1.0-incubating-SNAPSHOT/_remote.repositories
longer than 100 characters.
[WARNING] Entry: apache-beam-0.1.0-incubating-SNAPSHOT/.repository/org/apache/beam/runners/google-cloud-dataflow-java/maven-metadata-local.xml
longer than 100 characters.
[WARNING] Entry: apache-beam-0.1.0-incubating-SNAPSHOT/.repository/org/apache/beam/runners/direct/0.1.0-incubating-SNAPSHOT/direct-0.1.0-incubating-SNAPSHOT-tests.jar
longer than 100 characters.
[WARNING] Entry: apache-beam-0.1.0-incubating-SNAPSHOT/.repository/org/apache/beam/runners/direct/0.1.0-incubating-SNAPSHOT/direct-0.1.0-incubating-SNAPSHOT.pom
longer than 100 characters.
[WARNING] Entry: apache-beam-0.1.0-incubating-SNAPSHOT/.repository/org/apache/beam/runners/direct/0.1.0-incubating-SNAPSHOT/direct-0.1.0-incubating-SNAPSHOT-javadoc.jar
longer than 100 characters.
[WARNING] Entry: apache-beam-0.1.0-incubating-SNAPSHOT/.repository/org/apache/beam/runners/direct/0.1.0-incubating-SNAPSHOT/direct-0.1.0-incubating-SNAPSHOT-src.tar.gz
longer than 100 characters.
[WARNING] Entry: apache-beam-0.1.0-incubating-SNAPSHOT/.repository/org/apache/beam/runners/direct/0.1.0-incubating-SNAPSHOT/direct-0.1.0-incubating-SNAPSHOT-test-sources.jar
longer than 100 characters.
[WARNING] Entry: apache-beam-0.1.0-incubating-SNAPSHOT/.repository/org/apache/beam/runners/direct/0.1.0-incubating-SNAPSHOT/maven-metadata-local.xml
longer than 100 characters.
[WARNING] Entry: apache-beam-0.1.0-incubating-SNAPSHOT/.repository/org/apache/beam/runners/direct/0.1.0-incubating-SNAPSHOT/_remote.repositories
longer than 100 characters.
[WARNING] Entry: apache-beam-0.1.0-incubating-SNAPSHOT/.repository/org/apache/beam/runners/direct/0.1.0-incubating-SNAPSHOT/direct-0.1.0-incubating-SNAPSHOT-src.zip
longer than 100 characters.
[WARNING] Entry: apache-beam-0.1.0-incubating-SNAPSHOT/.repository/org/apache/beam/runners/direct/0.1.0-incubating-SNAPSHOT/direct-0.1.0-incubating-SNAPSHOT-sources.jar
longer than 100 characters.
[WARNING] Entry: apache-beam-0.1.0-incubating-SNAPSHOT/.repository/org/apache/beam/runners/direct/0.1.0-incubating-SNAPSHOT/direct-0.1.0-incubating-SNAPSHOT.jar
longer than 100 characters.
[WARNING] Entry: apache-beam-0.1.0-incubating-SNAPSHOT/.repository/org/apache/beam/runners/direct/maven-metadata-local.xml
longer than 100 characters.
[WARNING] Entry: apache-beam-0.1.0-incubating-SNAPSHOT/.repository/org/apache/beam/runners/flink-parent/0.1.0-incubating-SNAPSHOT/flink-parent-0.1.0-incubating-SNAPSHOT-tests.jar
longer than 100 characters.
[WARNING] Entry: apache-beam-0.1.0-incubating-SNAPSHOT/.repository/org/apache/beam/runners/flink-parent/0.1.0-incubating-SNAPSHOT/flink-parent-0.1.0-incubating-SNAPSHOT.pom
longer than 100 characters.
[WARNING] Entry: apache-beam-0.1.0-incubating-SNAPSHOT/.repository/org/apache/beam/runners/flink-parent/0.1.0-incubating-SNAPSHOT/flink-parent-0.1.0-incubating-SNAPSHOT-src.zip
longer than 100 characters.
[WARNING] Entry: apache-beam-0.1.0-incubating-SNAPSHOT/.repository/org/apache/beam/runners/flink-parent/0.1.0-incubating-SNAPSHOT/maven-metadata-local.xml
longer than 100 characters.
[WARNING] Entry: apache-beam-0.1.0-incubating-SNAPSHOT/.repository/org/apache/beam/runners/flink-parent/0.1.0-incubating-SNAPSHOT/flink-parent-0.1.0-incubating-SNAPSHOT-src.tar.gz
longer than 100 characters.
[WARNING] Entry: apache-beam-0.1.0-incubating-SNAPSHOT/.repository/org/apache/beam/runners/flink-parent/0.1.0-incubating-SNAPSHOT/_remote.repositories
longer than 100 characters.
[WARNING] Entry: apache-beam-0.1.0-incubating-SNAPSHOT/.repository/org/apache/beam/runners/flink-parent/maven-metadata-local.xml
longer than 100 characters.
[WARNING] Entry: apache-beam-0.1.0-incubating-SNAPSHOT/.repository/org/apache/beam/runners/spark/0.1.0-incubating-SNAPSHOT/spark-0.1.0-incubating-SNAPSHOT-javadoc.jar
longer than 100 characters.
[WARNING] Entry: apache-beam-0.1.0-incubating-SNAPSHOT/.repository/org/apache/beam/runners/spark/0.1.0-incubating-SNAPSHOT/spark-0.1.0-incubating-SNAPSHOT-test-sources.jar
longer than 100 characters.
[WARNING] Entry: apache-beam-0.1.0-incubating-SNAPSHOT/.repository/org/apache/beam/runners/spark/0.1.0-incubating-SNAPSHOT/spark-0.1.0-incubating-SNAPSHOT-tests.jar
longer than 100 characters.
[WARNING] Entry: apache-beam-0.1.0-incubating-SNAPSHOT/.repository/org/apache/beam/runners/spark/0.1.0-incubating-SNAPSHOT/spark-0.1.0-incubating-SNAPSHOT.jar
longer than 100 characters.
[WARNING] Entry: apache-beam-0.1.0-incubating-SNAPSHOT/.repository/org/apache/beam/runners/spark/0.1.0-incubating-SNAPSHOT/spark-0.1.0-incubating-SNAPSHOT-src.tar.gz
longer than 100 characters.
[WARNING] Entry: apache-beam-0.1.0-incubating-SNAPSHOT/.repository/org/apache/beam/runners/spark/0.1.0-incubating-SNAPSHOT/spark-0.1.0-incubating-SNAPSHOT.pom
longer than 100 characters.
[WARNING] Entry: apache-beam-0.1.0-incubating-SNAPSHOT/.repository/org/apache/beam/runners/spark/0.1.0-incubating-SNAPSHOT/spark-0.1.0-incubating-SNAPSHOT-spark-app.jar
longer than 100 characters.
[WARNING] Entry: apache-beam-0.1.0-incubating-SNAPSHOT/.repository/org/apache/beam/runners/spark/0.1.0-incubating-SNAPSHOT/maven-metadata-local.xml
longer than 100 characters.
[WARNING] Entry: apache-beam-0.1.0-incubating-SNAPSHOT/.repository/org/apache/beam/runners/spark/0.1.0-incubating-SNAPSHOT/spark-0.1.0-incubating-SNAPSHOT-src.zip
longer than 100 characters.
[WARNING] Entry: apache-beam-0.1.0-incubating-SNAPSHOT/.repository/org/apache/beam/runners/spark/0.1.0-incubating-SNAPSHOT/spark-0.1.0-incubating-SNAPSHOT-sources.jar
longer than 100 characters.
[WARNING] Entry: apache-beam-0.1.0-incubating-SNAPSHOT/.repository/org/apache/beam/runners/spark/0.1.0-incubating-SNAPSHOT/_remote.repositories
longer than 100 characters.
[WARNING] Entry: apache-beam-0.1.0-incubating-SNAPSHOT/.repository/org/apache/beam/runners/spark/maven-metadata-local.xml
longer than 100 characters.
[WARNING] Entry: apache-beam-0.1.0-incubating-SNAPSHOT/.repository/org/apache/beam/runners/flink_2.10/0.1.0-incubating-SNAPSHOT/flink_2.10-0.1.0-incubating-SNAPSHOT-src.zip
longer than 100 characters.
[WARNING] Entry: apache-beam-0.1.0-incubating-SNAPSHOT/.repository/org/apache/beam/runners/flink_2.10/0.1.0-incubating-SNAPSHOT/flink_2.10-0.1.0-incubating-SNAPSHOT-tests.jar
longer than 100 characters.
[WARNING] Entry: apache-beam-0.1.0-incubating-SNAPSHOT/.repository/org/apache/beam/runners/flink_2.10/0.1.0-incubating-SNAPSHOT/flink_2.10-0.1.0-incubating-SNAPSHOT.pom
longer than 100 characters.
[WARNING] Entry: apache-beam-0.1.0-incubating-SNAPSHOT/.repository/org/apache/beam/runners/flink_2.10/0.1.0-incubating-SNAPSHOT/flink_2.10-0.1.0-incubating-SNAPSHOT.jar
longer than 100 characters.
[WARNING] Entry: apache-beam-0.1.0-incubating-SNAPSHOT/.repository/org/apache/beam/runners/flink_2.10/0.1.0-incubating-SNAPSHOT/flink_2.10-0.1.0-incubating-SNAPSHOT-sources.jar
longer than 100 characters.
[WARNING] Entry: apache-beam-0.1.0-incubating-SNAPSHOT/.repository/org/apache/beam/runners/flink_2.10/0.1.0-incubating-SNAPSHOT/flink_2.10-0.1.0-incubating-SNAPSHOT-src.tar.gz
longer than 100 characters.
[WARNING] Entry: apache-beam-0.1.0-incubating-SNAPSHOT/.repository/org/apache/beam/runners/flink_2.10/0.1.0-incubating-SNAPSHOT/maven-metadata-local.xml
longer than 100 characters.
[WARNING] Entry: apache-beam-0.1.0-incubating-SNAPSHOT/.repository/org/apache/beam/runners/flink_2.10/0.1.0-incubating-SNAPSHOT/flink_2.10-0.1.0-incubating-SNAPSHOT-javadoc.jar
longer than 100 characters.
[WARNING] Entry: apache-beam-0.1.0-incubating-SNAPSHOT/.repository/org/apache/beam/runners/flink_2.10/0.1.0-incubating-SNAPSHOT/_remote.repositories
longer than 100 characters.
[WARNING] Entry: apache-beam-0.1.0-incubating-SNAPSHOT/.repository/org/apache/beam/runners/flink_2.10/0.1.0-incubating-SNAPSHOT/flink_2.10-0.1.0-incubating-SNAPSHOT-test-sources.jar
longer than 100 characters.
[WARNING] Entry: apache-beam-0.1.0-incubating-SNAPSHOT/.repository/org/apache/beam/runners/flink_2.10/maven-metadata-local.xml
longer than 100 characters.
[WARNING] Entry: apache-beam-0.1.0-incubating-SNAPSHOT/.repository/org/apache/beam/runners/parent/0.1.0-incubating-SNAPSHOT/parent-0.1.0-incubating-SNAPSHOT-src.tar.gz
longer than 100 characters.
[WARNING] Entry: apache-beam-0.1.0-incubating-SNAPSHOT/.repository/org/apache/beam/runners/parent/0.1.0-incubating-SNAPSHOT/parent-0.1.0-incubating-SNAPSHOT.pom
longer than 100 characters.
[WARNING] Entry: apache-beam-0.1.0-incubating-SNAPSHOT/.repository/org/apache/beam/runners/parent/0.1.0-incubating-SNAPSHOT/parent-0.1.0-incubating-SNAPSHOT-src.zip
longer than 100 characters.
[WARNING] Entry: apache-beam-0.1.0-incubating-SNAPSHOT/.repository/org/apache/beam/runners/parent/0.1.0-incubating-SNAPSHOT/maven-metadata-local.xml
longer than 100 characters.
[WARNING] Entry: apache-beam-0.1.0-incubating-SNAPSHOT/.repository/org/apache/beam/runners/parent/0.1.0-incubating-SNAPSHOT/_remote.repositories
longer than 100 characters.
[WARNING] Entry: apache-beam-0.1.0-incubating-SNAPSHOT/.repository/org/apache/beam/runners/parent/maven-metadata-local.xml
longer than 100 characters.
[WARNING] Entry: apache-beam-0.1.0-incubating-SNAPSHOT/.repository/org/apache/beam/runners/flink_2.10-examples/0.1.0-incubating-SNAPSHOT/flink_2.10-examples-0.1.0-incubating-SNAPSHOT-sources.jar
longer than 100 characters.
[WARNING] Entry: apache-beam-0.1.0-incubating-SNAPSHOT/.repository/org/apache/beam/runners/flink_2.10-examples/0.1.0-incubating-SNAPSHOT/flink_2.10-examples-0.1.0-incubating-SNAPSHOT.jar
longer than 100 characters.
[WARNING] Entry: apache-beam-0.1.0-incubating-SNAPSHOT/.repository/org/apache/beam/runners/flink_2.10-examples/0.1.0-incubating-SNAPSHOT/flink_2.10-examples-0.1.0-incubating-SNAPSHOT.pom
longer than 100 characters.
[WARNING] Entry: apache-beam-0.1.0-incubating-SNAPSHOT/.repository/org/apache/beam/runners/flink_2.10-examples/0.1.0-incubating-SNAPSHOT/flink_2.10-examples-0.1.0-incubating-SNAPSHOT-javadoc.jar
longer than 100 characters.
[WARNING] Entry: apache-beam-0.1.0-incubating-SNAPSHOT/.repository/org/apache/beam/runners/flink_2.10-examples/0.1.0-incubating-SNAPSHOT/flink_2.10-examples-0.1.0-incubating-SNAPSHOT-tests.jar
longer than 100 characters.
[WARNING] Entry: apache-beam-0.1.0-incubating-SNAPSHOT/.repository/org/apache/beam/runners/flink_2.10-examples/0.1.0-incubating-SNAPSHOT/flink_2.10-examples-0.1.0-incubating-SNAPSHOT-src.zip
longer than 100 characters.
[WARNING] Entry: apache-beam-0.1.0-incubating-SNAPSHOT/.repository/org/apache/beam/runners/flink_2.10-examples/0.1.0-incubating-SNAPSHOT/flink_2.10-examples-0.1.0-incubating-SNAPSHOT-test-sources.jar
longer than 100 characters.
[WARNING] Entry: apache-beam-0.1.0-incubating-SNAPSHOT/.repository/org/apache/beam/runners/flink_2.10-examples/0.1.0-incubating-SNAPSHOT/maven-metadata-local.xml
longer than 100 characters.
[WARNING] Entry: apache-beam-0.1.0-incubating-SNAPSHOT/.repository/org/apache/beam/runners/flink_2.10-examples/0.1.0-incubating-SNAPSHOT/flink_2.10-examples-0.1.0-incubating-SNAPSHOT-src.tar.gz
longer than 100 characters.
[WARNING] Entry: apache-beam-0.1.0-incubating-SNAPSHOT/.repository/org/apache/beam/runners/flink_2.10-examples/0.1.0-incubating-SNAPSHOT/_remote.repositories
longer than 100 characters.
[WARNING] Entry: apache-beam-0.1.0-incubating-SNAPSHOT/.repository/org/apache/beam/runners/flink_2.10-examples/maven-metadata-local.xml
longer than 100 characters.
[WARNING] Entry: apache-beam-0.1.0-incubating-SNAPSHOT/.repository/org/apache/beam/runners/core/0.1.0-incubating-SNAPSHOT/core-0.1.0-incubating-SNAPSHOT.jar
longer than 100 characters.
[WARNING] Entry: apache-beam-0.1.0-incubating-SNAPSHOT/.repository/org/apache/beam/runners/core/0.1.0-incubating-SNAPSHOT/core-0.1.0-incubating-SNAPSHOT-javadoc.jar
longer than 100 characters.
[WARNING] Entry: apache-beam-0.1.0-incubating-SNAPSHOT/.repository/org/apache/beam/runners/core/0.1.0-incubating-SNAPSHOT/core-0.1.0-incubating-SNAPSHOT-test-sources.jar
longer than 100 characters.
[WARNING] Entry: apache-beam-0.1.0-incubating-SNAPSHOT/.repository/org/apache/beam/runners/core/0.1.0-incubating-SNAPSHOT/core-0.1.0-incubating-SNAPSHOT-src.zip
longer than 100 characters.
[WARNING] Entry: apache-beam-0.1.0-incubating-SNAPSHOT/.repository/org/apache/beam/runners/core/0.1.0-incubating-SNAPSHOT/core-0.1.0-incubating-SNAPSHOT.pom
longer than 100 characters.
[WARNING] Entry: apache-beam-0.1.0-incubating-SNAPSHOT/.repository/org/apache/beam/runners/core/0.1.0-incubating-SNAPSHOT/core-0.1.0-incubating-SNAPSHOT-tests.jar
longer than 100 characters.
[WARNING] Entry: apache-beam-0.1.0-incubating-SNAPSHOT/.repository/org/apache/beam/runners/core/0.1.0-incubating-SNAPSHOT/core-0.1.0-incubating-SNAPSHOT-src.tar.gz
longer than 100 characters.
[WARNING] Entry: apache-beam-0.1.0-incubating-SNAPSHOT/.repository/org/apache/beam/runners/core/0.1.0-incubating-SNAPSHOT/core-0.1.0-incubating-SNAPSHOT-sources.jar
longer than 100 characters.
[WARNING] Entry: apache-beam-0.1.0-incubating-SNAPSHOT/.repository/org/apache/beam/runners/core/0.1.0-incubating-SNAPSHOT/maven-metadata-local.xml
longer than 100 characters.
[WARNING] Entry: apache-beam-0.1.0-incubating-SNAPSHOT/.repository/org/apache/beam/runners/core/0.1.0-incubating-SNAPSHOT/_remote.repositories
longer than 100 characters.
[WARNING] Entry: apache-beam-0.1.0-incubating-SNAPSHOT/.repository/org/apache/beam/runners/core/maven-metadata-local.xml
longer than 100 characters.
[WARNING] Entry: apache-beam-0.1.0-incubating-SNAPSHOT/.repository/org/apache/beam/java8tests-all/0.1.0-incubating-SNAPSHOT/java8tests-all-0.1.0-incubating-SNAPSHOT-test-sources.jar
longer than 100 characters.
[WARNING] Entry: apache-beam-0.1.0-incubating-SNAPSHOT/.repository/org/apache/beam/java8tests-all/0.1.0-incubating-SNAPSHOT/java8tests-all-0.1.0-incubating-SNAPSHOT-src.zip
longer than 100 characters.
[WARNING] Entry: apache-beam-0.1.0-incubating-SNAPSHOT/.repository/org/apache/beam/java8tests-all/0.1.0-incubating-SNAPSHOT/java8tests-all-0.1.0-incubating-SNAPSHOT.jar
longer than 100 characters.
[WARNING] Entry: apache-beam-0.1.0-incubating-SNAPSHOT/.repository/org/apache/beam/java8tests-all/0.1.0-incubating-SNAPSHOT/java8tests-all-0.1.0-incubating-SNAPSHOT.pom
longer than 100 characters.
[WARNING] Entry: apache-beam-0.1.0-incubating-SNAPSHOT/.repository/org/apache/beam/java8tests-all/0.1.0-incubating-SNAPSHOT/java8tests-all-0.1.0-incubating-SNAPSHOT-tests.jar
longer than 100 characters.
[WARNING] Entry: apache-beam-0.1.0-incubating-SNAPSHOT/.repository/org/apache/beam/java8tests-all/0.1.0-incubating-SNAPSHOT/java8tests-all-0.1.0-incubating-SNAPSHOT-src.tar.gz
longer than 100 characters.
[WARNING] Entry: apache-beam-0.1.0-incubating-SNAPSHOT/.repository/org/apache/beam/java8tests-all/0.1.0-incubating-SNAPSHOT/maven-metadata-local.xml
longer than 100 characters.
[WARNING] Entry: apache-beam-0.1.0-incubating-SNAPSHOT/.repository/org/apache/beam/java8tests-all/0.1.0-incubating-SNAPSHOT/java8tests-all-0.1.0-incubating-SNAPSHOT-sources.jar
longer than 100 characters.
[WARNING] Entry: apache-beam-0.1.0-incubating-SNAPSHOT/.repository/org/apache/beam/java8tests-all/0.1.0-incubating-SNAPSHOT/_remote.repositories
longer than 100 characters.
[WARNING] Entry: apache-beam-0.1.0-incubating-SNAPSHOT/.repository/org/apache/beam/java8tests-all/maven-metadata-local.xml
longer than 100 characters.
[WARNING] Entry: apache-beam-0.1.0-incubating-SNAPSHOT/.repository/org/apache/beam/java8examples-all/0.1.0-incubating-SNAPSHOT/java8examples-all-0.1.0-incubating-SNAPSHOT.jar
longer than 100 characters.
[WARNING] Entry: apache-beam-0.1.0-incubating-SNAPSHOT/.repository/org/apache/beam/java8examples-all/0.1.0-incubating-SNAPSHOT/java8examples-all-0.1.0-incubating-SNAPSHOT-src.zip
longer than 100 characters.
[WARNING] Entry: apache-beam-0.1.0-incubating-SNAPSHOT/.repository/org/apache/beam/java8examples-all/0.1.0-incubating-SNAPSHOT/java8examples-all-0.1.0-incubating-SNAPSHOT-src.tar.gz
longer than 100 characters.
[WARNING] Entry: apache-beam-0.1.0-incubating-SNAPSHOT/.repository/org/apache/beam/java8examples-all/0.1.0-incubating-SNAPSHOT/java8examples-all-0.1.0-incubating-SNAPSHOT-tests.jar
longer than 100 characters.
[WARNING] Entry: apache-beam-0.1.0-incubating-SNAPSHOT/.repository/org/apache/beam/java8examples-all/0.1.0-incubating-SNAPSHOT/java8examples-all-0.1.0-incubating-SNAPSHOT-javadoc.jar
longer than 100 characters.
[WARNING] Entry: apache-beam-0.1.0-incubating-SNAPSHOT/.repository/org/apache/beam/java8examples-all/0.1.0-incubating-SNAPSHOT/maven-metadata-local.xml
longer than 100 characters.
[WARNING] Entry: apache-beam-0.1.0-incubating-SNAPSHOT/.repository/org/apache/beam/java8examples-all/0.1.0-incubating-SNAPSHOT/java8examples-all-0.1.0-incubating-SNAPSHOT-sources.jar
longer than 100 characters.
[WARNING] Entry: apache-beam-0.1.0-incubating-SNAPSHOT/.repository/org/apache/beam/java8examples-all/0.1.0-incubating-SNAPSHOT/java8examples-all-0.1.0-incubating-SNAPSHOT.pom
longer than 100 characters.
[WARNING] Entry: apache-beam-0.1.0-incubating-SNAPSHOT/.repository/org/apache/beam/java8examples-all/0.1.0-incubating-SNAPSHOT/java8examples-all-0.1.0-incubating-SNAPSHOT-test-sources.jar
longer than 100 characters.
[WARNING] Entry: apache-beam-0.1.0-incubating-SNAPSHOT/.repository/org/apache/beam/java8examples-all/0.1.0-incubating-SNAPSHOT/_remote.repositories
longer than 100 characters.
[WARNING] Entry: apache-beam-0.1.0-incubating-SNAPSHOT/.repository/org/apache/beam/java8examples-all/maven-metadata-local.xml
longer than 100 characters.
[WARNING] Entry: apache-beam-0.1.0-incubating-SNAPSHOT/.repository/org/apache/beam/maven-archetypes-examples/0.1.0-incubating-SNAPSHOT/maven-archetypes-examples-0.1.0-incubating-SNAPSHOT.pom
longer than 100 characters.
[WARNING] Entry: apache-beam-0.1.0-incubating-SNAPSHOT/.repository/org/apache/beam/maven-archetypes-examples/0.1.0-incubating-SNAPSHOT/maven-archetypes-examples-0.1.0-incubating-SNAPSHOT-src.tar.gz
longer than 100 characters.
[WARNING] Entry: apache-beam-0.1.0-incubating-SNAPSHOT/.repository/org/apache/beam/maven-archetypes-examples/0.1.0-incubating-SNAPSHOT/maven-archetypes-examples-0.1.0-incubating-SNAPSHOT.jar
longer than 100 characters.
[WARNING] Entry: apache-beam-0.1.0-incubating-SNAPSHOT/.repository/org/apache/beam/maven-archetypes-examples/0.1.0-incubating-SNAPSHOT/maven-metadata-local.xml
longer than 100 characters.
[WARNING] Entry: apache-beam-0.1.0-incubating-SNAPSHOT/.repository/org/apache/beam/maven-archetypes-examples/0.1.0-incubating-SNAPSHOT/maven-archetypes-examples-0.1.0-incubating-SNAPSHOT-src.zip
longer than 100 characters.
[WARNING] Entry: apache-beam-0.1.0-incubating-SNAPSHOT/.repository/org/apache/beam/maven-archetypes-examples/0.1.0-incubating-SNAPSHOT/_remote.repositories
longer than 100 characters.
[WARNING] Entry: apache-beam-0.1.0-incubating-SNAPSHOT/.repository/org/apache/beam/maven-archetypes-examples/maven-metadata-local.xml
longer than 100 characters.
[WARNING] Entry: apache-beam-0.1.0-incubating-SNAPSHOT/.repository/org/apache/beam/parent/0.1.0-incubating-SNAPSHOT/parent-0.1.0-incubating-SNAPSHOT-src.tar.gz
longer than 100 characters.
[INFO]                                                                         
[INFO] ------------------------------------------------------------------------
[INFO] Skipping Apache Beam :: Parent
[INFO] This project has been banned from the build due to previous failures.
[INFO] ------------------------------------------------------------------------
[INFO] ------------------------------------------------------------------------
[INFO] Reactor Summary:
[INFO] 
[INFO] Apache Beam :: Parent .............................. FAILURE [ 31.865 s]
[INFO] Apache Beam :: SDKs ................................ SKIPPED
[INFO] Apache Beam :: SDKs :: Java ........................ SKIPPED
[INFO] Apache Beam :: SDKs :: Java :: Build Tools ......... SKIPPED
[INFO] Apache Beam :: SDKs :: Java :: Core ................ SKIPPED
[INFO] Apache Beam :: SDKs :: Java :: IO .................. SKIPPED
[INFO] Apache Beam :: SDKs :: Java :: IO :: Google Cloud Platform SKIPPED
[INFO] Apache Beam :: SDKs :: Java :: IO :: HDFS .......... SKIPPED
[INFO] Apache Beam :: SDKs :: Java :: IO :: Kafka ......... SKIPPED
[INFO] Apache Beam :: SDKs :: Java :: Extensions .......... SKIPPED
[INFO] Apache Beam :: SDKs :: Java :: Extensions :: Join library SKIPPED
[INFO] Apache Beam :: SDKs :: Java :: Tests ............... SKIPPED
[INFO] Apache Beam :: Runners ............................. SKIPPED
[INFO] Apache Beam :: Runners :: Core ..................... SKIPPED
[INFO] Apache Beam :: Runners :: Google Cloud Dataflow .... SKIPPED
[INFO] Apache Beam :: Runners :: Direct ................... SKIPPED
[INFO] Apache Beam :: Examples :: Java All ................ SKIPPED
[INFO] Apache Beam :: Runners :: Flink .................... SKIPPED
[INFO] Apache Beam :: Runners :: Flink :: Core ............ SKIPPED
[INFO] Apache Beam :: Runners :: Flink :: Examples ........ SKIPPED
[INFO] Apache Beam :: Runners :: Spark .................... SKIPPED
[INFO] Apache Beam :: SDKs :: Java :: Maven Archetypes .... SKIPPED
[INFO] Apache Beam :: SDKs :: Java :: Maven Archetypes :: Starter SKIPPED
[INFO] Apache Beam :: SDKs :: Java :: Maven Archetypes :: Examples SKIPPED
[INFO] Apache Beam :: Examples :: Java 8 All .............. SKIPPED
[INFO] Apache Beam :: Examples ............................ SKIPPED
[INFO] ------------------------------------------------------------------------
[INFO] BUILD FAILURE
[INFO] ------------------------------------------------------------------------
[INFO] Total time: 41.191 s
[INFO] Finished at: 2016-06-01T18:08:47+00:00
[INFO] Final Memory: 37M/545M
[INFO] ------------------------------------------------------------------------
Waiting for Jenkins to finish collecting data
[ERROR] Failed to execute goal org.apache.maven.plugins:maven-assembly-plugin:2.4.1:single
(src) on project parent: Failed to create assembly: Error creating assembly archive src: Problem
creating TAR: request to write '8192' bytes exceeds size in header of '204752503' bytes ->
[Help 1]
org.apache.maven.lifecycle.LifecycleExecutionException: Failed to execute goal org.apache.maven.plugins:maven-assembly-plugin:2.4.1:single
(src) on project parent: Failed to create assembly: Error creating assembly archive src: Problem
creating TAR: request to write '8192' bytes exceeds size in header of '204752503' bytes
	at org.apache.maven.lifecycle.internal.MojoExecutor.execute(MojoExecutor.java:216)
	at org.apache.maven.lifecycle.internal.MojoExecutor.execute(MojoExecutor.java:153)
	at org.apache.maven.lifecycle.internal.MojoExecutor.execute(MojoExecutor.java:145)
	at org.apache.maven.lifecycle.internal.LifecycleModuleBuilder.buildProject(LifecycleModuleBuilder.java:116)
	at org.apache.maven.lifecycle.internal.LifecycleModuleBuilder.buildProject(LifecycleModuleBuilder.java:80)
	at org.apache.maven.lifecycle.internal.builder.singlethreaded.SingleThreadedBuilder.build(SingleThreadedBuilder.java:51)
	at org.apache.maven.lifecycle.internal.LifecycleStarter.execute(LifecycleStarter.java:128)
	at org.apache.maven.DefaultMaven.doExecute(DefaultMaven.java:307)
	at org.apache.maven.DefaultMaven.doExecute(DefaultMaven.java:193)
	at org.apache.maven.DefaultMaven.execute(DefaultMaven.java:106)
	at org.jvnet.hudson.maven3.launcher.Maven32Launcher.main(Maven32Launcher.java:132)
	at sun.reflect.NativeMethodAccessorImpl.invoke0(Native Method)
	at sun.reflect.NativeMethodAccessorImpl.invoke(NativeMethodAccessorImpl.java:62)
	at sun.reflect.DelegatingMethodAccessorImpl.invoke(DelegatingMethodAccessorImpl.java:43)
	at java.lang.reflect.Method.invoke(Method.java:497)
	at org.codehaus.plexus.classworlds.launcher.Launcher.launchStandard(Launcher.java:330)
	at org.codehaus.plexus.classworlds.launcher.Launcher.launch(Launcher.java:238)
	at jenkins.maven3.agent.Maven32Main.launch(Maven32Main.java:186)
	at sun.reflect.NativeMethodAccessorImpl.invoke0(Native Method)
	at sun.reflect.NativeMethodAccessorImpl.invoke(NativeMethodAccessorImpl.java:62)
	at sun.reflect.DelegatingMethodAccessorImpl.invoke(DelegatingMethodAccessorImpl.java:43)
	at java.lang.reflect.Method.invoke(Method.java:497)
	at hudson.maven.Maven3Builder.call(Maven3Builder.java:136)
	at hudson.maven.Maven3Builder.call(Maven3Builder.java:71)
	at hudson.remoting.UserRequest.perform(UserRequest.java:120)
	at hudson.remoting.UserRequest.perform(UserRequest.java:48)
	at hudson.remoting.Request$2.run(Request.java:326)
	at hudson.remoting.InterceptingExecutorService$1.call(InterceptingExecutorService.java:68)
	at java.util.concurrent.FutureTask.run(FutureTask.java:266)
	at java.util.concurrent.ThreadPoolExecutor.runWorker(ThreadPoolExecutor.java:1142)
	at java.util.concurrent.ThreadPoolExecutor$Worker.run(ThreadPoolExecutor.java:617)
	at java.lang.Thread.run(Thread.java:745)
Caused by: org.apache.maven.plugin.MojoExecutionException: Failed to create assembly: Error
creating assembly archive src: Problem creating TAR: request to write '8192' bytes exceeds
size in header of '204752503' bytes
	at org.apache.maven.plugin.assembly.mojos.AbstractAssemblyMojo.execute(AbstractAssemblyMojo.java:475)
	at org.apache.maven.plugin.DefaultBuildPluginManager.executeMojo(DefaultBuildPluginManager.java:134)
	at org.apache.maven.lifecycle.internal.MojoExecutor.execute(MojoExecutor.java:208)
	... 31 more
Caused by: org.apache.maven.plugin.assembly.archive.ArchiveCreationException: Error creating
assembly archive src: Problem creating TAR: request to write '8192' bytes exceeds size in
header of '204752503' bytes
	at org.apache.maven.plugin.assembly.archive.DefaultAssemblyArchiver.createArchive(DefaultAssemblyArchiver.java:188)
	at org.apache.maven.plugin.assembly.mojos.AbstractAssemblyMojo.execute(AbstractAssemblyMojo.java:429)
	... 33 more
Caused by: org.codehaus.plexus.archiver.ArchiverException: Problem creating TAR: request to
write '8192' bytes exceeds size in header of '204752503' bytes
	at org.codehaus.plexus.archiver.AbstractArchiver.createArchive(AbstractArchiver.java:927)
	at org.apache.maven.plugin.assembly.archive.archiver.AssemblyProxyArchiver.createArchive(AssemblyProxyArchiver.java:506)
	at org.apache.maven.plugin.assembly.archive.DefaultAssemblyArchiver.createArchive(DefaultAssemblyArchiver.java:184)
	... 34 more
Caused by: java.io.IOException: request to write '8192' bytes exceeds size in header of '204752503'
bytes
	at org.codehaus.plexus.archiver.tar.TarOutputStream.write(TarOutputStream.java:284)
	at org.codehaus.plexus.archiver.tar.TarArchiver.tarFile(TarArchiver.java:365)
	at org.codehaus.plexus.archiver.tar.TarArchiver.execute(TarArchiver.java:210)
	at org.codehaus.plexus.archiver.AbstractArchiver.createArchive(AbstractArchiver.java:910)
	... 36 more
[ERROR] 
[ERROR] Re-run Maven using the -X switch to enable full debug logging.
[ERROR] 
[ERROR] For more information about the errors and possible solutions, please read the following
articles:
[ERROR] [Help 1] http://cwiki.apache.org/confluence/display/MAVEN/MojoExecutionException
[JENKINS] Archiving <https://builds.apache.org/job/beam_PostCommit_MavenVerify/ws/sdks/java/io/pom.xml>
to org.apache.beam.io/parent/0.1.0-incubating-SNAPSHOT/parent-0.1.0-incubating-SNAPSHOT.pom
[JENKINS] Archiving <https://builds.apache.org/job/beam_PostCommit_MavenVerify/ws/runners/flink/examples/pom.xml>
to org.apache.beam.runners/flink_2.10-examples/0.1.0-incubating-SNAPSHOT/flink_2.10-examples-0.1.0-incubating-SNAPSHOT.pom
[JENKINS] Archiving <https://builds.apache.org/job/beam_PostCommit_MavenVerify/ws/runners/core-java/pom.xml>
to org.apache.beam.runners/core/0.1.0-incubating-SNAPSHOT/core-0.1.0-incubating-SNAPSHOT.pom
[JENKINS] Archiving <https://builds.apache.org/job/beam_PostCommit_MavenVerify/ws/sdks/java/extensions/pom.xml>
to org.apache.beam.extensions/parent/0.1.0-incubating-SNAPSHOT/parent-0.1.0-incubating-SNAPSHOT.pom
[JENKINS] Archiving <https://builds.apache.org/job/beam_PostCommit_MavenVerify/ws/runners/direct-java/pom.xml>
to org.apache.beam.runners/direct/0.1.0-incubating-SNAPSHOT/direct-0.1.0-incubating-SNAPSHOT.pom
[JENKINS] Archiving <https://builds.apache.org/job/beam_PostCommit_MavenVerify/ws/examples/java/pom.xml>
to org.apache.beam/java-examples-all/0.1.0-incubating-SNAPSHOT/java-examples-all-0.1.0-incubating-SNAPSHOT.pom
[JENKINS] Archiving <https://builds.apache.org/job/beam_PostCommit_MavenVerify/ws/sdks/java/extensions/join-library/pom.xml>
to org.apache.beam.extensions/join-library/0.1.0-incubating-SNAPSHOT/join-library-0.1.0-incubating-SNAPSHOT.pom
[JENKINS] Archiving <https://builds.apache.org/job/beam_PostCommit_MavenVerify/ws/sdks/java/build-tools/pom.xml>
to org.apache.beam/java-build-tools/0.1.0-incubating-SNAPSHOT/java-build-tools-0.1.0-incubating-SNAPSHOT.pom
[JENKINS] Archiving <https://builds.apache.org/job/beam_PostCommit_MavenVerify/ws/sdks/java/maven-archetypes/examples/pom.xml>
to org.apache.beam/maven-archetypes-examples/0.1.0-incubating-SNAPSHOT/maven-archetypes-examples-0.1.0-incubating-SNAPSHOT.pom
[JENKINS] Archiving <https://builds.apache.org/job/beam_PostCommit_MavenVerify/ws/sdks/java/pom.xml>
to org.apache.beam/java-sdk-parent/0.1.0-incubating-SNAPSHOT/java-sdk-parent-0.1.0-incubating-SNAPSHOT.pom
[JENKINS] Archiving <https://builds.apache.org/job/beam_PostCommit_MavenVerify/ws/sdks/java/io/hdfs/pom.xml>
to org.apache.beam.io/hdfs/0.1.0-incubating-SNAPSHOT/hdfs-0.1.0-incubating-SNAPSHOT.pom
[JENKINS] Archiving <https://builds.apache.org/job/beam_PostCommit_MavenVerify/ws/sdks/java/io/google-cloud-platform/pom.xml>
to org.apache.beam.io/google-cloud-platform/0.1.0-incubating-SNAPSHOT/google-cloud-platform-0.1.0-incubating-SNAPSHOT.pom
[JENKINS] Archiving <https://builds.apache.org/job/beam_PostCommit_MavenVerify/ws/pom.xml>
to org.apache.beam/parent/0.1.0-incubating-SNAPSHOT/parent-0.1.0-incubating-SNAPSHOT.pom
[JENKINS] Archiving <https://builds.apache.org/job/beam_PostCommit_MavenVerify/ws/sdks/java/maven-archetypes/starter/pom.xml>
to org.apache.beam/maven-archetypes-starter/0.1.0-incubating-SNAPSHOT/maven-archetypes-starter-0.1.0-incubating-SNAPSHOT.pom
[JENKINS] Archiving <https://builds.apache.org/job/beam_PostCommit_MavenVerify/ws/sdks/java/maven-archetypes/pom.xml>
to org.apache.beam/maven-archetypes-parent/0.1.0-incubating-SNAPSHOT/maven-archetypes-parent-0.1.0-incubating-SNAPSHOT.pom
[JENKINS] Archiving <https://builds.apache.org/job/beam_PostCommit_MavenVerify/ws/runners/spark/pom.xml>
to org.apache.beam.runners/spark/0.1.0-incubating-SNAPSHOT/spark-0.1.0-incubating-SNAPSHOT.pom
[JENKINS] Archiving <https://builds.apache.org/job/beam_PostCommit_MavenVerify/ws/runners/google-cloud-dataflow-java/pom.xml>
to org.apache.beam.runners/google-cloud-dataflow-java/0.1.0-incubating-SNAPSHOT/google-cloud-dataflow-java-0.1.0-incubating-SNAPSHOT.pom
[JENKINS] Archiving <https://builds.apache.org/job/beam_PostCommit_MavenVerify/ws/examples/pom.xml>
to org.apache.beam/examples-parent/0.1.0-incubating-SNAPSHOT/examples-parent-0.1.0-incubating-SNAPSHOT.pom
[JENKINS] Archiving <https://builds.apache.org/job/beam_PostCommit_MavenVerify/ws/runners/pom.xml>
to org.apache.beam.runners/parent/0.1.0-incubating-SNAPSHOT/parent-0.1.0-incubating-SNAPSHOT.pom
[JENKINS] Archiving <https://builds.apache.org/job/beam_PostCommit_MavenVerify/ws/runners/flink/runner/pom.xml>
to org.apache.beam.runners/flink_2.10/0.1.0-incubating-SNAPSHOT/flink_2.10-0.1.0-incubating-SNAPSHOT.pom
[JENKINS] Archiving <https://builds.apache.org/job/beam_PostCommit_MavenVerify/ws/sdks/pom.xml>
to org.apache.beam/sdks-parent/0.1.0-incubating-SNAPSHOT/sdks-parent-0.1.0-incubating-SNAPSHOT.pom
[JENKINS] Archiving <https://builds.apache.org/job/beam_PostCommit_MavenVerify/ws/sdks/java/io/kafka/pom.xml>
to org.apache.beam.io/kafka/0.1.0-incubating-SNAPSHOT/kafka-0.1.0-incubating-SNAPSHOT.pom
[JENKINS] Archiving <https://builds.apache.org/job/beam_PostCommit_MavenVerify/ws/runners/flink/pom.xml>
to org.apache.beam.runners/flink-parent/0.1.0-incubating-SNAPSHOT/flink-parent-0.1.0-incubating-SNAPSHOT.pom
[JENKINS] Archiving <https://builds.apache.org/job/beam_PostCommit_MavenVerify/ws/sdks/java/core/pom.xml>
to org.apache.beam/java-sdk-all/0.1.0-incubating-SNAPSHOT/java-sdk-all-0.1.0-incubating-SNAPSHOT.pom
Sending e-mails to: commits@beam.incubator.apache.org
channel stopped

Mime
View raw message