beam-commits mailing list archives

Site index · List index
Message view « Date » · « Thread »
Top « Date » · « Thread »
From Apache Jenkins Server <jenk...@builds.apache.org>
Subject Build failed in Jenkins: beam_PostCommit_MavenVerify #600
Date Thu, 09 Jun 2016 07:40:16 GMT
See <https://builds.apache.org/job/beam_PostCommit_MavenVerify/600/>

------------------------------------------
[...truncated 6122 lines...]
[INFO] Downloaded: https://repo.maven.apache.org/maven2/commons-daemon/commons-daemon/1.0.13/commons-daemon-1.0.13.jar
(24 KB at 19.2 KB/sec)
[INFO] Downloaded: https://repo.maven.apache.org/maven2/commons-beanutils/commons-beanutils-bean-collections/1.8.3/commons-beanutils-bean-collections-1.8.3.jar
(26 KB at 21.0 KB/sec)
[INFO] Downloading: https://repo.maven.apache.org/maven2/javax/inject/javax.inject/1/javax.inject-1.jar
[INFO] Downloading: https://repo.maven.apache.org/maven2/aopalliance/aopalliance/1.0/aopalliance-1.0.jar
[INFO] Downloaded: https://repo.maven.apache.org/maven2/javax/inject/javax.inject/1/javax.inject-1.jar
(3 KB at 1.9 KB/sec)
[INFO] Downloading: https://repo.maven.apache.org/maven2/org/apache/flink/flink-clients_2.10/1.0.0/flink-clients_2.10-1.0.0.jar
[INFO] Downloaded: https://repo.maven.apache.org/maven2/aopalliance/aopalliance/1.0/aopalliance-1.0.jar
(5 KB at 3.4 KB/sec)
[INFO] Downloading: https://repo.maven.apache.org/maven2/org/apache/flink/flink-optimizer_2.10/1.0.0/flink-optimizer_2.10-1.0.0.jar
[INFO] Downloaded: https://repo.maven.apache.org/maven2/com/google/inject/guice/3.0/guice-3.0.jar
(694 KB at 541.2 KB/sec)
[INFO] Downloading: https://repo.maven.apache.org/maven2/org/apache/flink/flink-streaming-java_2.10/1.0.0/flink-streaming-java_2.10-1.0.0-tests.jar
[INFO] Downloaded: https://repo.maven.apache.org/maven2/org/apache/flink/flink-streaming-java_2.10/1.0.0/flink-streaming-java_2.10-1.0.0-tests.jar
(632 KB at 458.3 KB/sec)
[INFO] Downloading: https://repo.maven.apache.org/maven2/org/apache/flink/flink-test-utils_2.10/1.0.0/flink-test-utils_2.10-1.0.0.jar
[INFO] Downloaded: https://repo.maven.apache.org/maven2/org/apache/flink/flink-clients_2.10/1.0.0/flink-clients_2.10-1.0.0.jar
(2414 KB at 1513.9 KB/sec)
[INFO] Downloading: https://repo.maven.apache.org/maven2/org/apache/flink/flink-core/1.0.0/flink-core-1.0.0-tests.jar
[INFO] Downloaded: https://repo.maven.apache.org/maven2/org/apache/flink/flink-optimizer_2.10/1.0.0/flink-optimizer_2.10-1.0.0.jar
(2683 KB at 1663.8 KB/sec)
[INFO] Downloading: https://repo.maven.apache.org/maven2/org/apache/flink/flink-runtime_2.10/1.0.0/flink-runtime_2.10-1.0.0-tests.jar
[INFO] Downloaded: https://repo.maven.apache.org/maven2/org/apache/flink/flink-test-utils_2.10/1.0.0/flink-test-utils_2.10-1.0.0.jar
(2401 KB at 1472.0 KB/sec)
[INFO] Downloading: https://repo.maven.apache.org/maven2/org/scalatest/scalatest_2.10/2.2.2/scalatest_2.10-2.2.2.jar
[INFO] Downloaded: https://repo.maven.apache.org/maven2/org/apache/flink/flink-core/1.0.0/flink-core-1.0.0-tests.jar
(632 KB at 381.8 KB/sec)
[INFO] Downloading: https://repo.maven.apache.org/maven2/org/scala-lang/scala-reflect/2.10.4/scala-reflect-2.10.4.jar
[INFO] Downloaded: https://repo.maven.apache.org/maven2/org/apache/flink/flink-runtime_2.10/1.0.0/flink-runtime_2.10-1.0.0-tests.jar
(1884 KB at 1051.5 KB/sec)
[INFO] Downloading: https://repo.maven.apache.org/maven2/org/apache/curator/curator-test/2.8.0/curator-test-2.8.0.jar
[INFO] Downloaded: https://repo.maven.apache.org/maven2/org/apache/curator/curator-test/2.8.0/curator-test-2.8.0.jar
(39 KB at 21.3 KB/sec)
[INFO] Downloaded: https://repo.maven.apache.org/maven2/org/scala-lang/scala-reflect/2.10.4/scala-reflect-2.10.4.jar
(3129 KB at 1634.5 KB/sec)
[INFO] Downloaded: https://repo.maven.apache.org/maven2/org/apache/flink/flink-shaded-hadoop2/1.0.0/flink-shaded-hadoop2-1.0.0.jar
(17893 KB at 8548.5 KB/sec)
[INFO] Downloaded: https://repo.maven.apache.org/maven2/org/scalatest/scalatest_2.10/2.2.2/scalatest_2.10-2.2.2.jar
(7326 KB at 3408.6 KB/sec)
[INFO] I/O exception (java.net.SocketException) caught when processing request to {s}->https://repo.maven.apache.org:443:
Connection timed out
[INFO] Retrying request to {s}->https://repo.maven.apache.org:443
[INFO] I/O exception (java.net.SocketException) caught when processing request to {s}->https://repo.maven.apache.org:443:
Connection timed out
[INFO] Retrying request to {s}->https://repo.maven.apache.org:443
[INFO] I/O exception (java.net.SocketException) caught when processing request to {s}->https://repo.maven.apache.org:443:
Connection timed out
[INFO] Retrying request to {s}->https://repo.maven.apache.org:443
[INFO]                                                                         
[INFO] ------------------------------------------------------------------------
[INFO] Skipping Apache Beam :: Parent
[INFO] This project has been banned from the build due to previous failures.
[INFO] ------------------------------------------------------------------------
[INFO] ------------------------------------------------------------------------
[INFO] Reactor Summary:
[INFO] 
[INFO] Apache Beam :: Parent .............................. SUCCESS [ 25.118 s]
[INFO] Apache Beam :: SDKs ................................ SUCCESS [  1.245 s]
[INFO] Apache Beam :: SDKs :: Java ........................ SUCCESS [  1.144 s]
[INFO] Apache Beam :: SDKs :: Java :: Build Tools ......... SUCCESS [  3.912 s]
[INFO] Apache Beam :: SDKs :: Java :: Core ................ SUCCESS [02:44 min]
[INFO] Apache Beam :: SDKs :: Java :: IO .................. SUCCESS [  0.633 s]
[INFO] Apache Beam :: SDKs :: Java :: IO :: Google Cloud Platform SUCCESS [  9.016 s]
[INFO] Apache Beam :: SDKs :: Java :: IO :: HDFS .......... SUCCESS [ 18.243 s]
[INFO] Apache Beam :: SDKs :: Java :: IO :: Kafka ......... SUCCESS [ 13.985 s]
[INFO] Apache Beam :: SDKs :: Java :: Extensions .......... SUCCESS [  0.580 s]
[INFO] Apache Beam :: SDKs :: Java :: Extensions :: Join library SUCCESS [  6.068 s]
[INFO] Apache Beam :: SDKs :: Java :: Java 8 Tests ........ SUCCESS [  9.361 s]
[INFO] Apache Beam :: Runners ............................. SUCCESS [  0.945 s]
[INFO] Apache Beam :: Runners :: Core Java ................ SUCCESS [ 12.050 s]
[INFO] Apache Beam :: Runners :: Google Cloud Dataflow .... SUCCESS [ 40.625 s]
[INFO] Apache Beam :: Runners :: Direct Java .............. SUCCESS [01:25 min]
[INFO] Apache Beam :: Examples ............................ SUCCESS [  0.645 s]
[INFO] Apache Beam :: Examples :: Java .................... SUCCESS [08:35 min]
[INFO] Apache Beam :: Runners :: Flink .................... SUCCESS [  1.565 s]
[INFO] Apache Beam :: Runners :: Flink :: Core ............ FAILURE [  01:03 h]
[INFO] Apache Beam :: Runners :: Flink :: Examples ........ SKIPPED
[INFO] Apache Beam :: Runners :: Spark .................... SKIPPED
[INFO] Apache Beam :: SDKs :: Java :: Maven Archetypes .... SKIPPED
[INFO] Apache Beam :: SDKs :: Java :: Maven Archetypes :: Starter SKIPPED
[INFO] Apache Beam :: SDKs :: Java :: Maven Archetypes :: Examples SKIPPED
[INFO] Apache Beam :: Examples :: Java 8 .................. SKIPPED
[INFO] ------------------------------------------------------------------------
[INFO] BUILD FAILURE
[INFO] ------------------------------------------------------------------------
[INFO] Total time: 01:19 h
[INFO] Finished at: 2016-06-09T07:39:55+00:00
[INFO] Final Memory: 72M/856M
[INFO] ------------------------------------------------------------------------
Waiting for Jenkins to finish collecting data
[ERROR] Failed to execute goal on project beam-runners-flink_2.10: Could not resolve dependencies
for project org.apache.beam:beam-runners-flink_2.10:jar:0.2.0-incubating-SNAPSHOT: Could not
transfer artifact org.apache.flink:flink-core:jar:1.0.0 from/to central (https://repo.maven.apache.org/maven2):
Connection timed out -> [Help 1]
org.apache.maven.lifecycle.LifecycleExecutionException: Failed to execute goal on project
beam-runners-flink_2.10: Could not resolve dependencies for project org.apache.beam:beam-runners-flink_2.10:jar:0.2.0-incubating-SNAPSHOT:
Could not transfer artifact org.apache.flink:flink-core:jar:1.0.0 from/to central (https://repo.maven.apache.org/maven2):
Connection timed out
	at org.apache.maven.lifecycle.internal.LifecycleDependencyResolver.getDependencies(LifecycleDependencyResolver.java:221)
	at org.apache.maven.lifecycle.internal.LifecycleDependencyResolver.resolveProjectDependencies(LifecycleDependencyResolver.java:127)
	at org.apache.maven.lifecycle.internal.MojoExecutor.ensureDependenciesAreResolved(MojoExecutor.java:257)
	at org.apache.maven.lifecycle.internal.MojoExecutor.execute(MojoExecutor.java:200)
	at org.apache.maven.lifecycle.internal.MojoExecutor.execute(MojoExecutor.java:153)
	at org.apache.maven.lifecycle.internal.MojoExecutor.execute(MojoExecutor.java:145)
	at org.apache.maven.lifecycle.internal.LifecycleModuleBuilder.buildProject(LifecycleModuleBuilder.java:116)
	at org.apache.maven.lifecycle.internal.LifecycleModuleBuilder.buildProject(LifecycleModuleBuilder.java:80)
	at org.apache.maven.lifecycle.internal.builder.singlethreaded.SingleThreadedBuilder.build(SingleThreadedBuilder.java:51)
	at org.apache.maven.lifecycle.internal.LifecycleStarter.execute(LifecycleStarter.java:128)
	at org.apache.maven.DefaultMaven.doExecute(DefaultMaven.java:307)
	at org.apache.maven.DefaultMaven.doExecute(DefaultMaven.java:193)
	at org.apache.maven.DefaultMaven.execute(DefaultMaven.java:106)
	at org.jvnet.hudson.maven3.launcher.Maven32Launcher.main(Maven32Launcher.java:132)
	at sun.reflect.NativeMethodAccessorImpl.invoke0(Native Method)
	at sun.reflect.NativeMethodAccessorImpl.invoke(NativeMethodAccessorImpl.java:62)
	at sun.reflect.DelegatingMethodAccessorImpl.invoke(DelegatingMethodAccessorImpl.java:43)
	at java.lang.reflect.Method.invoke(Method.java:497)
	at org.codehaus.plexus.classworlds.launcher.Launcher.launchStandard(Launcher.java:330)
	at org.codehaus.plexus.classworlds.launcher.Launcher.launch(Launcher.java:238)
	at jenkins.maven3.agent.Maven32Main.launch(Maven32Main.java:186)
	at sun.reflect.NativeMethodAccessorImpl.invoke0(Native Method)
	at sun.reflect.NativeMethodAccessorImpl.invoke(NativeMethodAccessorImpl.java:62)
	at sun.reflect.DelegatingMethodAccessorImpl.invoke(DelegatingMethodAccessorImpl.java:43)
	at java.lang.reflect.Method.invoke(Method.java:497)
	at hudson.maven.Maven3Builder.call(Maven3Builder.java:136)
	at hudson.maven.Maven3Builder.call(Maven3Builder.java:71)
	at hudson.remoting.UserRequest.perform(UserRequest.java:120)
	at hudson.remoting.UserRequest.perform(UserRequest.java:48)
	at hudson.remoting.Request$2.run(Request.java:326)
	at hudson.remoting.InterceptingExecutorService$1.call(InterceptingExecutorService.java:68)
	at java.util.concurrent.FutureTask.run(FutureTask.java:266)
	at java.util.concurrent.ThreadPoolExecutor.runWorker(ThreadPoolExecutor.java:1142)
	at java.util.concurrent.ThreadPoolExecutor$Worker.run(ThreadPoolExecutor.java:617)
	at java.lang.Thread.run(Thread.java:745)
Caused by: org.apache.maven.project.DependencyResolutionException: Could not resolve dependencies
for project org.apache.beam:beam-runners-flink_2.10:jar:0.2.0-incubating-SNAPSHOT: Could not
transfer artifact org.apache.flink:flink-core:jar:1.0.0 from/to central (https://repo.maven.apache.org/maven2):
Connection timed out
	at org.apache.maven.project.DefaultProjectDependenciesResolver.resolve(DefaultProjectDependenciesResolver.java:211)
	at org.apache.maven.lifecycle.internal.LifecycleDependencyResolver.getDependencies(LifecycleDependencyResolver.java:195)
	... 34 more
Caused by: org.eclipse.aether.resolution.DependencyResolutionException: Could not transfer
artifact org.apache.flink:flink-core:jar:1.0.0 from/to central (https://repo.maven.apache.org/maven2):
Connection timed out
	at org.eclipse.aether.internal.impl.DefaultRepositorySystem.resolveDependencies(DefaultRepositorySystem.java:384)
	at org.apache.maven.project.DefaultProjectDependenciesResolver.resolve(DefaultProjectDependenciesResolver.java:205)
	... 35 more
Caused by: org.eclipse.aether.resolution.ArtifactResolutionException: Could not transfer artifact
org.apache.flink:flink-core:jar:1.0.0 from/to central (https://repo.maven.apache.org/maven2):
Connection timed out
	at org.eclipse.aether.internal.impl.DefaultArtifactResolver.resolve(DefaultArtifactResolver.java:444)
	at org.eclipse.aether.internal.impl.DefaultArtifactResolver.resolveArtifacts(DefaultArtifactResolver.java:246)
	at org.eclipse.aether.internal.impl.DefaultRepositorySystem.resolveDependencies(DefaultRepositorySystem.java:367)
	... 36 more
Caused by: org.eclipse.aether.transfer.ArtifactTransferException: Could not transfer artifact
org.apache.flink:flink-core:jar:1.0.0 from/to central (https://repo.maven.apache.org/maven2):
Connection timed out
	at org.eclipse.aether.connector.basic.ArtifactTransportListener.transferFailed(ArtifactTransportListener.java:43)
	at org.eclipse.aether.connector.basic.BasicRepositoryConnector$TaskRunner.run(BasicRepositoryConnector.java:355)
	at org.eclipse.aether.util.concurrency.RunnableErrorForwarder$1.run(RunnableErrorForwarder.java:67)
	... 3 more
Caused by: org.apache.maven.wagon.TransferFailedException: Connection timed out
	at org.apache.maven.wagon.providers.http.AbstractHttpClientWagon.fillInputData(AbstractHttpClientWagon.java:1066)
	at org.apache.maven.wagon.providers.http.AbstractHttpClientWagon.fillInputData(AbstractHttpClientWagon.java:960)
	at org.apache.maven.wagon.StreamWagon.getInputStream(StreamWagon.java:116)
	at org.apache.maven.wagon.StreamWagon.getIfNewer(StreamWagon.java:88)
	at org.apache.maven.wagon.StreamWagon.get(StreamWagon.java:61)
	at org.eclipse.aether.transport.wagon.WagonTransporter$GetTaskRunner.run(WagonTransporter.java:560)
	at org.eclipse.aether.transport.wagon.WagonTransporter.execute(WagonTransporter.java:427)
	at org.eclipse.aether.transport.wagon.WagonTransporter.get(WagonTransporter.java:404)
	at org.eclipse.aether.connector.basic.BasicRepositoryConnector$GetTaskRunner.runTask(BasicRepositoryConnector.java:447)
	at org.eclipse.aether.connector.basic.BasicRepositoryConnector$TaskRunner.run(BasicRepositoryConnector.java:350)
	... 4 more
Caused by: java.net.SocketException: Connection timed out
	at java.net.SocketInputStream.socketRead0(Native Method)
	at java.net.SocketInputStream.socketRead(SocketInputStream.java:116)
	at java.net.SocketInputStream.read(SocketInputStream.java:170)
	at java.net.SocketInputStream.read(SocketInputStream.java:141)
	at sun.security.ssl.InputRecord.readFully(InputRecord.java:465)
	at sun.security.ssl.InputRecord.read(InputRecord.java:503)
	at sun.security.ssl.SSLSocketImpl.readRecord(SSLSocketImpl.java:973)
	at sun.security.ssl.SSLSocketImpl.readDataRecord(SSLSocketImpl.java:930)
	at sun.security.ssl.AppInputStream.read(AppInputStream.java:105)
	at org.apache.maven.wagon.providers.http.httpclient.impl.io.SessionInputBufferImpl.streamRead(SessionInputBufferImpl.java:136)
	at org.apache.maven.wagon.providers.http.httpclient.impl.io.SessionInputBufferImpl.fillBuffer(SessionInputBufferImpl.java:152)
	at org.apache.maven.wagon.providers.http.httpclient.impl.io.SessionInputBufferImpl.readLine(SessionInputBufferImpl.java:270)
	at org.apache.maven.wagon.providers.http.httpclient.impl.conn.DefaultHttpResponseParser.parseHead(DefaultHttpResponseParser.java:140)
	at org.apache.maven.wagon.providers.http.httpclient.impl.conn.DefaultHttpResponseParser.parseHead(DefaultHttpResponseParser.java:57)
	at org.apache.maven.wagon.providers.http.httpclient.impl.io.AbstractMessageParser.parse(AbstractMessageParser.java:260)
	at org.apache.maven.wagon.providers.http.httpclient.impl.DefaultBHttpClientConnection.receiveResponseHeader(DefaultBHttpClientConnection.java:161)
	at org.apache.maven.wagon.providers.http.httpclient.impl.conn.CPoolProxy.receiveResponseHeader(CPoolProxy.java:153)
	at org.apache.maven.wagon.providers.http.httpclient.protocol.HttpRequestExecutor.doReceiveResponse(HttpRequestExecutor.java:271)
	at org.apache.maven.wagon.providers.http.httpclient.protocol.HttpRequestExecutor.execute(HttpRequestExecutor.java:123)
	at org.apache.maven.wagon.providers.http.httpclient.impl.execchain.MainClientExec.execute(MainClientExec.java:254)
	at org.apache.maven.wagon.providers.http.httpclient.impl.execchain.ProtocolExec.execute(ProtocolExec.java:195)
	at org.apache.maven.wagon.providers.http.httpclient.impl.execchain.RetryExec.execute(RetryExec.java:86)
	at org.apache.maven.wagon.providers.http.httpclient.impl.execchain.RedirectExec.execute(RedirectExec.java:108)
	at org.apache.maven.wagon.providers.http.httpclient.impl.client.InternalHttpClient.doExecute(InternalHttpClient.java:184)
	at org.apache.maven.wagon.providers.http.httpclient.impl.client.CloseableHttpClient.execute(CloseableHttpClient.java:82)
	at org.apache.maven.wagon.providers.http.AbstractHttpClientWagon.execute(AbstractHttpClientWagon.java:832)
	at org.apache.maven.wagon.providers.http.AbstractHttpClientWagon.fillInputData(AbstractHttpClientWagon.java:983)
	... 13 more
[ERROR] 
[ERROR] Re-run Maven using the -X switch to enable full debug logging.
[ERROR] 
[ERROR] For more information about the errors and possible solutions, please read the following
articles:
[ERROR] [Help 1] http://cwiki.apache.org/confluence/display/MAVEN/DependencyResolutionException
[ERROR] 
[ERROR] After correcting the problems, you can resume the build with the command
[ERROR]   mvn <goals> -rf :beam-runners-flink_2.10
[JENKINS] Archiving <https://builds.apache.org/job/beam_PostCommit_MavenVerify/ws/sdks/pom.xml>
to org.apache.beam/beam-sdks-parent/0.2.0-incubating-SNAPSHOT/beam-sdks-parent-0.2.0-incubating-SNAPSHOT.pom
[JENKINS] Archiving <https://builds.apache.org/job/beam_PostCommit_MavenVerify/ws/sdks/java/extensions/join-library/pom.xml>
to org.apache.beam/beam-sdks-java-extensions-join-library/0.2.0-incubating-SNAPSHOT/beam-sdks-java-extensions-join-library-0.2.0-incubating-SNAPSHOT.pom
[JENKINS] Archiving <https://builds.apache.org/job/beam_PostCommit_MavenVerify/ws/sdks/java/extensions/join-library/target/beam-sdks-java-extensions-join-library-0.2.0-incubating-SNAPSHOT.jar>
to org.apache.beam/beam-sdks-java-extensions-join-library/0.2.0-incubating-SNAPSHOT/beam-sdks-java-extensions-join-library-0.2.0-incubating-SNAPSHOT.jar
[JENKINS] Archiving <https://builds.apache.org/job/beam_PostCommit_MavenVerify/ws/sdks/java/extensions/join-library/target/beam-sdks-java-extensions-join-library-0.2.0-incubating-SNAPSHOT-sources.jar>
to org.apache.beam/beam-sdks-java-extensions-join-library/0.2.0-incubating-SNAPSHOT/beam-sdks-java-extensions-join-library-0.2.0-incubating-SNAPSHOT-sources.jar
[JENKINS] Archiving <https://builds.apache.org/job/beam_PostCommit_MavenVerify/ws/sdks/java/extensions/join-library/target/beam-sdks-java-extensions-join-library-0.2.0-incubating-SNAPSHOT-test-sources.jar>
to org.apache.beam/beam-sdks-java-extensions-join-library/0.2.0-incubating-SNAPSHOT/beam-sdks-java-extensions-join-library-0.2.0-incubating-SNAPSHOT-test-sources.jar
[JENKINS] Archiving <https://builds.apache.org/job/beam_PostCommit_MavenVerify/ws/sdks/java/extensions/join-library/target/beam-sdks-java-extensions-join-library-0.2.0-incubating-SNAPSHOT-tests.jar>
to org.apache.beam/beam-sdks-java-extensions-join-library/0.2.0-incubating-SNAPSHOT/beam-sdks-java-extensions-join-library-0.2.0-incubating-SNAPSHOT-tests.jar
[JENKINS] Archiving <https://builds.apache.org/job/beam_PostCommit_MavenVerify/ws/sdks/java/maven-archetypes/examples/pom.xml>
to org.apache.beam/beam-sdks-java-maven-archetypes-examples/0.2.0-incubating-SNAPSHOT/beam-sdks-java-maven-archetypes-examples-0.2.0-incubating-SNAPSHOT.pom
[JENKINS] Archiving <https://builds.apache.org/job/beam_PostCommit_MavenVerify/ws/runners/core-java/pom.xml>
to org.apache.beam/beam-runners-core-java/0.2.0-incubating-SNAPSHOT/beam-runners-core-java-0.2.0-incubating-SNAPSHOT.pom
[JENKINS] Archiving <https://builds.apache.org/job/beam_PostCommit_MavenVerify/ws/runners/core-java/target/beam-runners-core-java-0.2.0-incubating-SNAPSHOT.jar>
to org.apache.beam/beam-runners-core-java/0.2.0-incubating-SNAPSHOT/beam-runners-core-java-0.2.0-incubating-SNAPSHOT.jar
[JENKINS] Archiving <https://builds.apache.org/job/beam_PostCommit_MavenVerify/ws/runners/core-java/target/beam-runners-core-java-0.2.0-incubating-SNAPSHOT-tests.jar>
to org.apache.beam/beam-runners-core-java/0.2.0-incubating-SNAPSHOT/beam-runners-core-java-0.2.0-incubating-SNAPSHOT-tests.jar
[JENKINS] Archiving <https://builds.apache.org/job/beam_PostCommit_MavenVerify/ws/runners/core-java/target/beam-runners-core-java-0.2.0-incubating-SNAPSHOT-sources.jar>
to org.apache.beam/beam-runners-core-java/0.2.0-incubating-SNAPSHOT/beam-runners-core-java-0.2.0-incubating-SNAPSHOT-sources.jar
[JENKINS] Archiving <https://builds.apache.org/job/beam_PostCommit_MavenVerify/ws/runners/core-java/target/beam-runners-core-java-0.2.0-incubating-SNAPSHOT-test-sources.jar>
to org.apache.beam/beam-runners-core-java/0.2.0-incubating-SNAPSHOT/beam-runners-core-java-0.2.0-incubating-SNAPSHOT-test-sources.jar
[JENKINS] Archiving <https://builds.apache.org/job/beam_PostCommit_MavenVerify/ws/runners/core-java/target/beam-runners-core-java-0.2.0-incubating-SNAPSHOT-javadoc.jar>
to org.apache.beam/beam-runners-core-java/0.2.0-incubating-SNAPSHOT/beam-runners-core-java-0.2.0-incubating-SNAPSHOT-javadoc.jar
[JENKINS] Archiving <https://builds.apache.org/job/beam_PostCommit_MavenVerify/ws/sdks/java/extensions/pom.xml>
to org.apache.beam/beam-sdks-java-extensions-parent/0.2.0-incubating-SNAPSHOT/beam-sdks-java-extensions-parent-0.2.0-incubating-SNAPSHOT.pom
[JENKINS] Archiving <https://builds.apache.org/job/beam_PostCommit_MavenVerify/ws/sdks/java/pom.xml>
to org.apache.beam/beam-sdks-java-parent/0.2.0-incubating-SNAPSHOT/beam-sdks-java-parent-0.2.0-incubating-SNAPSHOT.pom
[JENKINS] Archiving <https://builds.apache.org/job/beam_PostCommit_MavenVerify/ws/runners/spark/pom.xml>
to org.apache.beam/beam-runners-spark/0.2.0-incubating-SNAPSHOT/beam-runners-spark-0.2.0-incubating-SNAPSHOT.pom
[JENKINS] Archiving <https://builds.apache.org/job/beam_PostCommit_MavenVerify/ws/runners/flink/pom.xml>
to org.apache.beam/beam-runners-flink-parent/0.2.0-incubating-SNAPSHOT/beam-runners-flink-parent-0.2.0-incubating-SNAPSHOT.pom
[JENKINS] Archiving <https://builds.apache.org/job/beam_PostCommit_MavenVerify/ws/runners/direct-java/dependency-reduced-pom.xml>
to org.apache.beam/beam-runners-direct-java/0.2.0-incubating-SNAPSHOT/beam-runners-direct-java-0.2.0-incubating-SNAPSHOT.pom
[JENKINS] Archiving <https://builds.apache.org/job/beam_PostCommit_MavenVerify/ws/runners/direct-java/target/beam-runners-direct-java-0.2.0-incubating-SNAPSHOT.jar>
to org.apache.beam/beam-runners-direct-java/0.2.0-incubating-SNAPSHOT/beam-runners-direct-java-0.2.0-incubating-SNAPSHOT.jar
[JENKINS] Archiving <https://builds.apache.org/job/beam_PostCommit_MavenVerify/ws/runners/direct-java/target/beam-runners-direct-java-0.2.0-incubating-SNAPSHOT-tests.jar>
to org.apache.beam/beam-runners-direct-java/0.2.0-incubating-SNAPSHOT/beam-runners-direct-java-0.2.0-incubating-SNAPSHOT-tests.jar
[JENKINS] Archiving <https://builds.apache.org/job/beam_PostCommit_MavenVerify/ws/runners/direct-java/target/beam-runners-direct-java-0.2.0-incubating-SNAPSHOT-sources.jar>
to org.apache.beam/beam-runners-direct-java/0.2.0-incubating-SNAPSHOT/beam-runners-direct-java-0.2.0-incubating-SNAPSHOT-sources.jar
[JENKINS] Archiving <https://builds.apache.org/job/beam_PostCommit_MavenVerify/ws/runners/direct-java/target/beam-runners-direct-java-0.2.0-incubating-SNAPSHOT-test-sources.jar>
to org.apache.beam/beam-runners-direct-java/0.2.0-incubating-SNAPSHOT/beam-runners-direct-java-0.2.0-incubating-SNAPSHOT-test-sources.jar
[JENKINS] Archiving <https://builds.apache.org/job/beam_PostCommit_MavenVerify/ws/runners/direct-java/target/beam-runners-direct-java-0.2.0-incubating-SNAPSHOT-javadoc.jar>
to org.apache.beam/beam-runners-direct-java/0.2.0-incubating-SNAPSHOT/beam-runners-direct-java-0.2.0-incubating-SNAPSHOT-javadoc.jar
[JENKINS] Archiving <https://builds.apache.org/job/beam_PostCommit_MavenVerify/ws/examples/pom.xml>
to org.apache.beam/beam-examples-parent/0.2.0-incubating-SNAPSHOT/beam-examples-parent-0.2.0-incubating-SNAPSHOT.pom
[JENKINS] Archiving <https://builds.apache.org/job/beam_PostCommit_MavenVerify/ws/sdks/java/io/google-cloud-platform/pom.xml>
to org.apache.beam/beam-sdks-java-io-google-cloud-platform/0.2.0-incubating-SNAPSHOT/beam-sdks-java-io-google-cloud-platform-0.2.0-incubating-SNAPSHOT.pom
[JENKINS] Archiving <https://builds.apache.org/job/beam_PostCommit_MavenVerify/ws/sdks/java/io/google-cloud-platform/target/beam-sdks-java-io-google-cloud-platform-0.2.0-incubating-SNAPSHOT.jar>
to org.apache.beam/beam-sdks-java-io-google-cloud-platform/0.2.0-incubating-SNAPSHOT/beam-sdks-java-io-google-cloud-platform-0.2.0-incubating-SNAPSHOT.jar
[JENKINS] Archiving <https://builds.apache.org/job/beam_PostCommit_MavenVerify/ws/sdks/java/io/google-cloud-platform/target/beam-sdks-java-io-google-cloud-platform-0.2.0-incubating-SNAPSHOT-sources.jar>
to org.apache.beam/beam-sdks-java-io-google-cloud-platform/0.2.0-incubating-SNAPSHOT/beam-sdks-java-io-google-cloud-platform-0.2.0-incubating-SNAPSHOT-sources.jar
[JENKINS] Archiving <https://builds.apache.org/job/beam_PostCommit_MavenVerify/ws/sdks/java/io/google-cloud-platform/target/beam-sdks-java-io-google-cloud-platform-0.2.0-incubating-SNAPSHOT-test-sources.jar>
to org.apache.beam/beam-sdks-java-io-google-cloud-platform/0.2.0-incubating-SNAPSHOT/beam-sdks-java-io-google-cloud-platform-0.2.0-incubating-SNAPSHOT-test-sources.jar
[JENKINS] Archiving <https://builds.apache.org/job/beam_PostCommit_MavenVerify/ws/sdks/java/io/google-cloud-platform/target/beam-sdks-java-io-google-cloud-platform-0.2.0-incubating-SNAPSHOT-tests.jar>
to org.apache.beam/beam-sdks-java-io-google-cloud-platform/0.2.0-incubating-SNAPSHOT/beam-sdks-java-io-google-cloud-platform-0.2.0-incubating-SNAPSHOT-tests.jar
[JENKINS] Archiving <https://builds.apache.org/job/beam_PostCommit_MavenVerify/ws/runners/pom.xml>
to org.apache.beam/beam-runners-parent/0.2.0-incubating-SNAPSHOT/beam-runners-parent-0.2.0-incubating-SNAPSHOT.pom
[JENKINS] Archiving <https://builds.apache.org/job/beam_PostCommit_MavenVerify/ws/runners/google-cloud-dataflow-java/dependency-reduced-pom.xml>
to org.apache.beam/beam-runners-google-cloud-dataflow-java/0.2.0-incubating-SNAPSHOT/beam-runners-google-cloud-dataflow-java-0.2.0-incubating-SNAPSHOT.pom
[JENKINS] Archiving <https://builds.apache.org/job/beam_PostCommit_MavenVerify/ws/runners/google-cloud-dataflow-java/target/beam-runners-google-cloud-dataflow-java-0.2.0-incubating-SNAPSHOT.jar>
to org.apache.beam/beam-runners-google-cloud-dataflow-java/0.2.0-incubating-SNAPSHOT/beam-runners-google-cloud-dataflow-java-0.2.0-incubating-SNAPSHOT.jar
[JENKINS] Archiving <https://builds.apache.org/job/beam_PostCommit_MavenVerify/ws/runners/google-cloud-dataflow-java/target/beam-runners-google-cloud-dataflow-java-0.2.0-incubating-SNAPSHOT-tests.jar>
to org.apache.beam/beam-runners-google-cloud-dataflow-java/0.2.0-incubating-SNAPSHOT/beam-runners-google-cloud-dataflow-java-0.2.0-incubating-SNAPSHOT-tests.jar
[JENKINS] Archiving <https://builds.apache.org/job/beam_PostCommit_MavenVerify/ws/runners/google-cloud-dataflow-java/target/beam-runners-google-cloud-dataflow-java-0.2.0-incubating-SNAPSHOT-sources.jar>
to org.apache.beam/beam-runners-google-cloud-dataflow-java/0.2.0-incubating-SNAPSHOT/beam-runners-google-cloud-dataflow-java-0.2.0-incubating-SNAPSHOT-sources.jar
[JENKINS] Archiving <https://builds.apache.org/job/beam_PostCommit_MavenVerify/ws/runners/google-cloud-dataflow-java/target/beam-runners-google-cloud-dataflow-java-0.2.0-incubating-SNAPSHOT-test-sources.jar>
to org.apache.beam/beam-runners-google-cloud-dataflow-java/0.2.0-incubating-SNAPSHOT/beam-runners-google-cloud-dataflow-java-0.2.0-incubating-SNAPSHOT-test-sources.jar
[JENKINS] Archiving <https://builds.apache.org/job/beam_PostCommit_MavenVerify/ws/runners/google-cloud-dataflow-java/target/beam-runners-google-cloud-dataflow-java-0.2.0-incubating-SNAPSHOT-javadoc.jar>
to org.apache.beam/beam-runners-google-cloud-dataflow-java/0.2.0-incubating-SNAPSHOT/beam-runners-google-cloud-dataflow-java-0.2.0-incubating-SNAPSHOT-javadoc.jar
[JENKINS] Archiving <https://builds.apache.org/job/beam_PostCommit_MavenVerify/ws/sdks/java/io/pom.xml>
to org.apache.beam/beam-sdks-java-io-parent/0.2.0-incubating-SNAPSHOT/beam-sdks-java-io-parent-0.2.0-incubating-SNAPSHOT.pom
[JENKINS] Archiving <https://builds.apache.org/job/beam_PostCommit_MavenVerify/ws/examples/java/pom.xml>
to org.apache.beam/beam-examples-java/0.2.0-incubating-SNAPSHOT/beam-examples-java-0.2.0-incubating-SNAPSHOT.pom
[JENKINS] Archiving <https://builds.apache.org/job/beam_PostCommit_MavenVerify/ws/examples/java/target/beam-examples-java-0.2.0-incubating-SNAPSHOT.jar>
to org.apache.beam/beam-examples-java/0.2.0-incubating-SNAPSHOT/beam-examples-java-0.2.0-incubating-SNAPSHOT.jar
[JENKINS] Archiving <https://builds.apache.org/job/beam_PostCommit_MavenVerify/ws/examples/java/target/beam-examples-java-0.2.0-incubating-SNAPSHOT-sources.jar>
to org.apache.beam/beam-examples-java/0.2.0-incubating-SNAPSHOT/beam-examples-java-0.2.0-incubating-SNAPSHOT-sources.jar
[JENKINS] Archiving <https://builds.apache.org/job/beam_PostCommit_MavenVerify/ws/examples/java/target/beam-examples-java-0.2.0-incubating-SNAPSHOT-test-sources.jar>
to org.apache.beam/beam-examples-java/0.2.0-incubating-SNAPSHOT/beam-examples-java-0.2.0-incubating-SNAPSHOT-test-sources.jar
[JENKINS] Archiving <https://builds.apache.org/job/beam_PostCommit_MavenVerify/ws/examples/java/target/beam-examples-java-0.2.0-incubating-SNAPSHOT-javadoc.jar>
to org.apache.beam/beam-examples-java/0.2.0-incubating-SNAPSHOT/beam-examples-java-0.2.0-incubating-SNAPSHOT-javadoc.jar
[JENKINS] Archiving <https://builds.apache.org/job/beam_PostCommit_MavenVerify/ws/examples/java/target/beam-examples-java-0.2.0-incubating-SNAPSHOT-tests.jar>
to org.apache.beam/beam-examples-java/0.2.0-incubating-SNAPSHOT/beam-examples-java-0.2.0-incubating-SNAPSHOT-tests.jar
[JENKINS] Archiving <https://builds.apache.org/job/beam_PostCommit_MavenVerify/ws/runners/flink/runner/pom.xml>
to org.apache.beam/beam-runners-flink_2.10/0.2.0-incubating-SNAPSHOT/beam-runners-flink_2.10-0.2.0-incubating-SNAPSHOT.pom
[JENKINS] Archiving <https://builds.apache.org/job/beam_PostCommit_MavenVerify/ws/pom.xml>
to org.apache.beam/beam-parent/0.2.0-incubating-SNAPSHOT/beam-parent-0.2.0-incubating-SNAPSHOT.pom
Compressed 33.20 KB of artifacts by 96.4% relative to #599
[JENKINS] Archiving <https://builds.apache.org/job/beam_PostCommit_MavenVerify/ws/sdks/java/core/dependency-reduced-pom.xml>
to org.apache.beam/beam-sdks-java-core/0.2.0-incubating-SNAPSHOT/beam-sdks-java-core-0.2.0-incubating-SNAPSHOT.pom
[JENKINS] Archiving <https://builds.apache.org/job/beam_PostCommit_MavenVerify/ws/sdks/java/core/target/beam-sdks-java-core-0.2.0-incubating-SNAPSHOT.jar>
to org.apache.beam/beam-sdks-java-core/0.2.0-incubating-SNAPSHOT/beam-sdks-java-core-0.2.0-incubating-SNAPSHOT.jar
[JENKINS] Archiving <https://builds.apache.org/job/beam_PostCommit_MavenVerify/ws/sdks/java/core/target/beam-sdks-java-core-0.2.0-incubating-SNAPSHOT-tests.jar>
to org.apache.beam/beam-sdks-java-core/0.2.0-incubating-SNAPSHOT/beam-sdks-java-core-0.2.0-incubating-SNAPSHOT-tests.jar
[JENKINS] Archiving <https://builds.apache.org/job/beam_PostCommit_MavenVerify/ws/sdks/java/core/target/beam-sdks-java-core-0.2.0-incubating-SNAPSHOT-sources.jar>
to org.apache.beam/beam-sdks-java-core/0.2.0-incubating-SNAPSHOT/beam-sdks-java-core-0.2.0-incubating-SNAPSHOT-sources.jar
[JENKINS] Archiving <https://builds.apache.org/job/beam_PostCommit_MavenVerify/ws/sdks/java/core/target/beam-sdks-java-core-0.2.0-incubating-SNAPSHOT-test-sources.jar>
to org.apache.beam/beam-sdks-java-core/0.2.0-incubating-SNAPSHOT/beam-sdks-java-core-0.2.0-incubating-SNAPSHOT-test-sources.jar
[JENKINS] Archiving <https://builds.apache.org/job/beam_PostCommit_MavenVerify/ws/sdks/java/core/target/beam-sdks-java-core-0.2.0-incubating-SNAPSHOT-javadoc.jar>
to org.apache.beam/beam-sdks-java-core/0.2.0-incubating-SNAPSHOT/beam-sdks-java-core-0.2.0-incubating-SNAPSHOT-javadoc.jar
[JENKINS] Archiving <https://builds.apache.org/job/beam_PostCommit_MavenVerify/ws/runners/flink/examples/pom.xml>
to org.apache.beam/beam-runners-flink_2.10-examples/0.2.0-incubating-SNAPSHOT/beam-runners-flink_2.10-examples-0.2.0-incubating-SNAPSHOT.pom
[JENKINS] Archiving <https://builds.apache.org/job/beam_PostCommit_MavenVerify/ws/sdks/java/io/hdfs/pom.xml>
to org.apache.beam/beam-sdks-java-io-hdfs/0.2.0-incubating-SNAPSHOT/beam-sdks-java-io-hdfs-0.2.0-incubating-SNAPSHOT.pom
[JENKINS] Archiving <https://builds.apache.org/job/beam_PostCommit_MavenVerify/ws/sdks/java/io/hdfs/target/beam-sdks-java-io-hdfs-0.2.0-incubating-SNAPSHOT.jar>
to org.apache.beam/beam-sdks-java-io-hdfs/0.2.0-incubating-SNAPSHOT/beam-sdks-java-io-hdfs-0.2.0-incubating-SNAPSHOT.jar
[JENKINS] Archiving <https://builds.apache.org/job/beam_PostCommit_MavenVerify/ws/sdks/java/io/hdfs/target/beam-sdks-java-io-hdfs-0.2.0-incubating-SNAPSHOT-sources.jar>
to org.apache.beam/beam-sdks-java-io-hdfs/0.2.0-incubating-SNAPSHOT/beam-sdks-java-io-hdfs-0.2.0-incubating-SNAPSHOT-sources.jar
[JENKINS] Archiving <https://builds.apache.org/job/beam_PostCommit_MavenVerify/ws/sdks/java/io/hdfs/target/beam-sdks-java-io-hdfs-0.2.0-incubating-SNAPSHOT-test-sources.jar>
to org.apache.beam/beam-sdks-java-io-hdfs/0.2.0-incubating-SNAPSHOT/beam-sdks-java-io-hdfs-0.2.0-incubating-SNAPSHOT-test-sources.jar
[JENKINS] Archiving <https://builds.apache.org/job/beam_PostCommit_MavenVerify/ws/sdks/java/io/hdfs/target/beam-sdks-java-io-hdfs-0.2.0-incubating-SNAPSHOT-tests.jar>
to org.apache.beam/beam-sdks-java-io-hdfs/0.2.0-incubating-SNAPSHOT/beam-sdks-java-io-hdfs-0.2.0-incubating-SNAPSHOT-tests.jar
[JENKINS] Archiving <https://builds.apache.org/job/beam_PostCommit_MavenVerify/ws/sdks/java/io/kafka/pom.xml>
to org.apache.beam/beam-sdks-java-io-kafka/0.2.0-incubating-SNAPSHOT/beam-sdks-java-io-kafka-0.2.0-incubating-SNAPSHOT.pom
[JENKINS] Archiving <https://builds.apache.org/job/beam_PostCommit_MavenVerify/ws/sdks/java/io/kafka/target/beam-sdks-java-io-kafka-0.2.0-incubating-SNAPSHOT.jar>
to org.apache.beam/beam-sdks-java-io-kafka/0.2.0-incubating-SNAPSHOT/beam-sdks-java-io-kafka-0.2.0-incubating-SNAPSHOT.jar
[JENKINS] Archiving <https://builds.apache.org/job/beam_PostCommit_MavenVerify/ws/sdks/java/io/kafka/target/beam-sdks-java-io-kafka-0.2.0-incubating-SNAPSHOT-sources.jar>
to org.apache.beam/beam-sdks-java-io-kafka/0.2.0-incubating-SNAPSHOT/beam-sdks-java-io-kafka-0.2.0-incubating-SNAPSHOT-sources.jar
[JENKINS] Archiving <https://builds.apache.org/job/beam_PostCommit_MavenVerify/ws/sdks/java/io/kafka/target/beam-sdks-java-io-kafka-0.2.0-incubating-SNAPSHOT-test-sources.jar>
to org.apache.beam/beam-sdks-java-io-kafka/0.2.0-incubating-SNAPSHOT/beam-sdks-java-io-kafka-0.2.0-incubating-SNAPSHOT-test-sources.jar
[JENKINS] Archiving <https://builds.apache.org/job/beam_PostCommit_MavenVerify/ws/sdks/java/io/kafka/target/beam-sdks-java-io-kafka-0.2.0-incubating-SNAPSHOT-tests.jar>
to org.apache.beam/beam-sdks-java-io-kafka/0.2.0-incubating-SNAPSHOT/beam-sdks-java-io-kafka-0.2.0-incubating-SNAPSHOT-tests.jar
[JENKINS] Archiving <https://builds.apache.org/job/beam_PostCommit_MavenVerify/ws/sdks/java/io/kafka/target/beam-sdks-java-io-kafka-0.2.0-incubating-SNAPSHOT-javadoc.jar>
to org.apache.beam/beam-sdks-java-io-kafka/0.2.0-incubating-SNAPSHOT/beam-sdks-java-io-kafka-0.2.0-incubating-SNAPSHOT-javadoc.jar
[JENKINS] Archiving <https://builds.apache.org/job/beam_PostCommit_MavenVerify/ws/sdks/java/maven-archetypes/starter/pom.xml>
to org.apache.beam/beam-sdks-java-maven-archetypes-starter/0.2.0-incubating-SNAPSHOT/beam-sdks-java-maven-archetypes-starter-0.2.0-incubating-SNAPSHOT.pom
[JENKINS] Archiving <https://builds.apache.org/job/beam_PostCommit_MavenVerify/ws/sdks/java/build-tools/pom.xml>
to org.apache.beam/beam-sdks-java-build-tools/0.2.0-incubating-SNAPSHOT/beam-sdks-java-build-tools-0.2.0-incubating-SNAPSHOT.pom
[JENKINS] Archiving <https://builds.apache.org/job/beam_PostCommit_MavenVerify/ws/sdks/java/build-tools/target/beam-sdks-java-build-tools-0.2.0-incubating-SNAPSHOT.jar>
to org.apache.beam/beam-sdks-java-build-tools/0.2.0-incubating-SNAPSHOT/beam-sdks-java-build-tools-0.2.0-incubating-SNAPSHOT.jar
[JENKINS] Archiving <https://builds.apache.org/job/beam_PostCommit_MavenVerify/ws/sdks/java/build-tools/target/beam-sdks-java-build-tools-0.2.0-incubating-SNAPSHOT-tests.jar>
to org.apache.beam/beam-sdks-java-build-tools/0.2.0-incubating-SNAPSHOT/beam-sdks-java-build-tools-0.2.0-incubating-SNAPSHOT-tests.jar
[JENKINS] Archiving <https://builds.apache.org/job/beam_PostCommit_MavenVerify/ws/sdks/java/maven-archetypes/pom.xml>
to org.apache.beam/beam-sdks-java-maven-archetypes-parent/0.2.0-incubating-SNAPSHOT/beam-sdks-java-maven-archetypes-parent-0.2.0-incubating-SNAPSHOT.pom
Sending e-mails to: commits@beam.incubator.apache.org
channel stopped

Mime
View raw message