beam-commits mailing list archives

Site index · List index
Message view « Date » · « Thread »
Top « Date » · « Thread »
From Apache Jenkins Server <jenk...@builds.apache.org>
Subject Build failed in Jenkins: beam_PostCommit_MavenVerify #367
Date Sun, 08 May 2016 19:47:39 GMT
See <https://builds.apache.org/job/beam_PostCommit_MavenVerify/367/changes>

Changes:

[davor] Add wildcard to checkstyle ordering

------------------------------------------
[...truncated 3431 lines...]
[WARNING] grpc-protobuf-0.12.0.jar, grpc-all-0.12.0.jar define 4 overlapping classes: 
[WARNING]   - io.grpc.protobuf.ProtoUtils$2
[WARNING]   - io.grpc.protobuf.ProtoUtils
[WARNING]   - io.grpc.protobuf.ProtoUtils$1
[WARNING]   - io.grpc.protobuf.ProtoInputStream
[WARNING] grpc-okhttp-0.12.0.jar, grpc-all-0.12.0.jar define 76 overlapping classes: 
[WARNING]   - io.grpc.okhttp.OkHttpSettingsUtil
[WARNING]   - io.grpc.okhttp.AsyncFrameWriter$12
[WARNING]   - io.grpc.okhttp.NegotiationType
[WARNING]   - io.grpc.okhttp.OkHttpTlsUpgrader
[WARNING]   - io.grpc.okhttp.Utils
[WARNING]   - io.grpc.okhttp.AsyncFrameWriter$WriteRunnable
[WARNING]   - io.grpc.okhttp.OkHttpProtocolNegotiator$AndroidNegotiator
[WARNING]   - io.grpc.okhttp.OkHttpChannelBuilder$2
[WARNING]   - io.grpc.okhttp.internal.framed.Huffman$Node
[WARNING]   - io.grpc.okhttp.AsyncFrameWriter$7
[WARNING]   - 66 more...
[WARNING] grpc-auth-0.12.0.jar, grpc-all-0.12.0.jar define 2 overlapping classes: 
[WARNING]   - io.grpc.auth.ClientAuthInterceptor$1
[WARNING]   - io.grpc.auth.ClientAuthInterceptor
[WARNING] java-sdk-all-0.1.0-incubating-SNAPSHOT.jar, google-cloud-dataflow-java-runner-0.1.0-incubating-SNAPSHOT.jar
define 1717 overlapping classes: 
[WARNING]   - org.apache.beam.sdk.repackaged.com.google.common.collect.TreeRangeSet$ComplementRangesByLowerBound$2
[WARNING]   - org.apache.beam.sdk.repackaged.com.google.common.collect.WellBehavedMap$EntrySet$1$1
[WARNING]   - org.apache.beam.sdk.repackaged.com.google.common.util.concurrent.CycleDetectingLockFactory$Policies$1
[WARNING]   - org.apache.beam.sdk.repackaged.com.google.common.collect.Maps$6
[WARNING]   - org.apache.beam.sdk.repackaged.com.google.common.primitives.UnsignedBytes$LexicographicalComparatorHolder$UnsafeComparator$1
[WARNING]   - org.apache.beam.sdk.repackaged.com.google.common.collect.Range$1
[WARNING]   - org.apache.beam.sdk.repackaged.com.google.common.collect.Collections2$OrderedPermutationCollection
[WARNING]   - org.apache.beam.sdk.repackaged.com.google.common.base.Splitter$2
[WARNING]   - org.apache.beam.sdk.repackaged.com.google.common.base.Equivalence$Identity
[WARNING]   - org.apache.beam.sdk.repackaged.com.google.common.collect.Lists$1
[WARNING]   - 1707 more...
[WARNING] grpc-core-0.12.0.jar, grpc-all-0.12.0.jar define 248 overlapping classes: 
[WARNING]   - io.grpc.ClientInterceptors$1
[WARNING]   - io.grpc.internal.AbstractReferenceCounted
[WARNING]   - io.grpc.inprocess.InProcessTransport
[WARNING]   - io.grpc.internal.ServerImpl
[WARNING]   - io.grpc.internal.MessageFramer$OutputStreamAdapter
[WARNING]   - io.grpc.internal.ReadableBuffers$BufferInputStream
[WARNING]   - io.grpc.internal.SerializingExecutor$TaskRunner
[WARNING]   - io.grpc.internal.SharedResourceHolder$ScheduledExecutorFactory
[WARNING]   - io.grpc.internal.ContextRunnable
[WARNING]   - io.grpc.NameResolver
[WARNING]   - 238 more...
[WARNING] maven-shade-plugin has detected that some class files are
[WARNING] present in two or more JARs. When this happens, only one
[WARNING] single version of the class is copied to the uber jar.
[WARNING] Usually this is not harmful and you can skip these warnings,
[WARNING] otherwise try to manually exclude artifacts based on
[WARNING] mvn dependency:tree -Ddetail=true and the above output.
[WARNING] See http://docs.codehaus.org/display/MAVENUSER/Shade+Plugin
[INFO] Attaching shaded artifact.
[INFO] 
[INFO] --- maven-surefire-plugin:2.19.1:test (runnable-on-service-tests) @ spark-runner ---
[INFO] Tests are skipped.
[INFO] 
[INFO] --- maven-checkstyle-plugin:2.17:check (default) @ spark-runner ---
[INFO] Starting audit...
[ERROR] <https://builds.apache.org/job/beam_PostCommit_MavenVerify/ws/runners/spark/src/main/java/org/apache/beam/runners/spark/io/KafkaIO.java>:31:
Import kafka.serializer.Decoder appears after other imports that it should precede [ImportOrder]
[ERROR] <https://builds.apache.org/job/beam_PostCommit_MavenVerify/ws/runners/spark/src/main/java/org/apache/beam/runners/spark/coders/CoderHelpers.java>:35:
Import scala.Tuple2 appears after other imports that it should precede [ImportOrder]
[ERROR] <https://builds.apache.org/job/beam_PostCommit_MavenVerify/ws/runners/spark/src/main/java/org/apache/beam/runners/spark/translation/MultiDoFnFunction.java>:37:
Import scala.Tuple2 appears after other imports that it should precede [ImportOrder]
[ERROR] <https://builds.apache.org/job/beam_PostCommit_MavenVerify/ws/runners/spark/src/main/java/org/apache/beam/runners/spark/translation/TransformTranslator.java>:87:
Import scala.Tuple2 appears after other imports that it should precede [ImportOrder]
[ERROR] <https://builds.apache.org/job/beam_PostCommit_MavenVerify/ws/runners/spark/src/main/java/org/apache/beam/runners/spark/translation/streaming/StreamingTransformTranslator.java>:73:
Import kafka.serializer.Decoder appears after other imports that it should precede [ImportOrder]
[ERROR] <https://builds.apache.org/job/beam_PostCommit_MavenVerify/ws/runners/spark/src/test/java/org/apache/beam/runners/spark/translation/streaming/KafkaStreamingTest.java>:57:
Import kafka.serializer.StringDecoder appears after other imports that it should precede [ImportOrder]
[ERROR] <https://builds.apache.org/job/beam_PostCommit_MavenVerify/ws/runners/spark/src/test/java/org/apache/beam/runners/spark/translation/streaming/utils/EmbeddedKafkaCluster.java>:37:
Import kafka.server.KafkaConfig appears after other imports that it should precede [ImportOrder]
Audit done.
[INFO] There are 7 errors reported by Checkstyle 6.17 with beam/checkstyle.xml ruleset.
[ERROR] src/main/java/org/apache/beam/runners/spark/io/KafkaIO.java:[31] (imports) ImportOrder:
Import kafka.serializer.Decoder appears after other imports that it should precede
[ERROR] src/main/java/org/apache/beam/runners/spark/coders/CoderHelpers.java:[35] (imports)
ImportOrder: Import scala.Tuple2 appears after other imports that it should precede
[ERROR] src/main/java/org/apache/beam/runners/spark/translation/MultiDoFnFunction.java:[37]
(imports) ImportOrder: Import scala.Tuple2 appears after other imports that it should precede
[ERROR] src/main/java/org/apache/beam/runners/spark/translation/TransformTranslator.java:[87]
(imports) ImportOrder: Import scala.Tuple2 appears after other imports that it should precede
[ERROR] src/main/java/org/apache/beam/runners/spark/translation/streaming/StreamingTransformTranslator.java:[73]
(imports) ImportOrder: Import kafka.serializer.Decoder appears after other imports that it
should precede
[ERROR] src/test/java/org/apache/beam/runners/spark/translation/streaming/KafkaStreamingTest.java:[57]
(imports) ImportOrder: Import kafka.serializer.StringDecoder appears after other imports that
it should precede
[ERROR] src/test/java/org/apache/beam/runners/spark/translation/streaming/utils/EmbeddedKafkaCluster.java:[37]
(imports) ImportOrder: Import kafka.server.KafkaConfig appears after other imports that it
should precede
[INFO]                                                                         
[INFO] ------------------------------------------------------------------------
[INFO] Skipping Apache Beam :: Parent
[INFO] This project has been banned from the build due to previous failures.
[INFO] ------------------------------------------------------------------------
[INFO] ------------------------------------------------------------------------
[INFO] Reactor Summary:
[INFO] 
[INFO] Apache Beam :: Parent .............................. SUCCESS [  3.774 s]
[INFO] Apache Beam :: SDKs ................................ SUCCESS [  0.661 s]
[INFO] Apache Beam :: SDKs :: Java ........................ SUCCESS [  1.415 s]
[INFO] Apache Beam :: SDKs :: Java :: Build Tools ......... SUCCESS [  2.249 s]
[INFO] Apache Beam :: SDKs :: Java :: Core ................ SUCCESS [03:07 min]
[INFO] Apache Beam :: SDKs :: Java :: IO .................. SUCCESS [  0.509 s]
[INFO] Apache Beam :: SDKs :: Java :: IO :: Google Cloud Platform SUCCESS [  8.422 s]
[INFO] Apache Beam :: SDKs :: Java :: IO :: HDFS .......... SUCCESS [ 13.168 s]
[INFO] Apache Beam :: SDKs :: Java :: IO :: Kafka ......... SUCCESS [  9.628 s]
[INFO] Apache Beam :: SDKs :: Java :: Extensions .......... SUCCESS [  2.270 s]
[INFO] Apache Beam :: SDKs :: Java :: Extensions :: Join library SUCCESS [  6.461 s]
[INFO] Apache Beam :: SDKs :: Java :: Tests ............... SUCCESS [  8.792 s]
[INFO] Apache Beam :: Runners ............................. SUCCESS [  0.450 s]
[INFO] Apache Beam :: Runners :: Google Cloud Dataflow .... SUCCESS [ 39.828 s]
[INFO] Apache Beam :: Runners :: Core ..................... SUCCESS [ 11.328 s]
[INFO] Apache Beam :: Runners :: Direct ................... SUCCESS [ 27.795 s]
[INFO] Apache Beam :: Examples :: Java All ................ SUCCESS [03:12 min]
[INFO] Apache Beam :: Runners :: Flink .................... SUCCESS [  0.694 s]
[INFO] Apache Beam :: Runners :: Flink :: Core ............ SUCCESS [ 37.163 s]
[INFO] Apache Beam :: Runners :: Flink :: Examples ........ SUCCESS [  4.151 s]
[INFO] Apache Beam :: Runners :: Spark .................... FAILURE [03:22 min]
[INFO] Apache Beam :: SDKs :: Java :: Maven Archetypes .... SKIPPED
[INFO] Apache Beam :: SDKs :: Java :: Maven Archetypes :: Starter SKIPPED
[INFO] Apache Beam :: SDKs :: Java :: Maven Archetypes :: Examples SKIPPED
[INFO] Apache Beam :: Examples :: Java 8 All .............. SKIPPED
[INFO] Apache Beam :: Examples ............................ SKIPPED
[INFO] ------------------------------------------------------------------------
[INFO] BUILD FAILURE
[INFO] ------------------------------------------------------------------------
[INFO] Total time: 13:12 min
[INFO] Finished at: 2016-05-08T19:47:23+00:00
[INFO] Final Memory: 132M/917M
[INFO] ------------------------------------------------------------------------
Waiting for Jenkins to finish collecting data
[ERROR] Failed to execute goal org.apache.maven.plugins:maven-checkstyle-plugin:2.17:check
(default) on project spark-runner: You have 7 Checkstyle violations. -> [Help 1]
org.apache.maven.lifecycle.LifecycleExecutionException: Failed to execute goal org.apache.maven.plugins:maven-checkstyle-plugin:2.17:check
(default) on project spark-runner: You have 7 Checkstyle violations.
	at org.apache.maven.lifecycle.internal.MojoExecutor.execute(MojoExecutor.java:212)
	at org.apache.maven.lifecycle.internal.MojoExecutor.execute(MojoExecutor.java:153)
	at org.apache.maven.lifecycle.internal.MojoExecutor.execute(MojoExecutor.java:145)
	at org.apache.maven.lifecycle.internal.LifecycleModuleBuilder.buildProject(LifecycleModuleBuilder.java:116)
	at org.apache.maven.lifecycle.internal.LifecycleModuleBuilder.buildProject(LifecycleModuleBuilder.java:80)
	at org.apache.maven.lifecycle.internal.builder.singlethreaded.SingleThreadedBuilder.build(SingleThreadedBuilder.java:51)
	at org.apache.maven.lifecycle.internal.LifecycleStarter.execute(LifecycleStarter.java:128)
	at org.apache.maven.DefaultMaven.doExecute(DefaultMaven.java:307)
	at org.apache.maven.DefaultMaven.doExecute(DefaultMaven.java:193)
	at org.apache.maven.DefaultMaven.execute(DefaultMaven.java:106)
	at org.jvnet.hudson.maven3.launcher.Maven32Launcher.main(Maven32Launcher.java:132)
	at sun.reflect.NativeMethodAccessorImpl.invoke0(Native Method)
	at sun.reflect.NativeMethodAccessorImpl.invoke(NativeMethodAccessorImpl.java:62)
	at sun.reflect.DelegatingMethodAccessorImpl.invoke(DelegatingMethodAccessorImpl.java:43)
	at java.lang.reflect.Method.invoke(Method.java:497)
	at org.codehaus.plexus.classworlds.launcher.Launcher.launchStandard(Launcher.java:330)
	at org.codehaus.plexus.classworlds.launcher.Launcher.launch(Launcher.java:238)
	at jenkins.maven3.agent.Maven32Main.launch(Maven32Main.java:186)
	at sun.reflect.NativeMethodAccessorImpl.invoke0(Native Method)
	at sun.reflect.NativeMethodAccessorImpl.invoke(NativeMethodAccessorImpl.java:62)
	at sun.reflect.DelegatingMethodAccessorImpl.invoke(DelegatingMethodAccessorImpl.java:43)
	at java.lang.reflect.Method.invoke(Method.java:497)
	at hudson.maven.Maven3Builder.call(Maven3Builder.java:136)
	at hudson.maven.Maven3Builder.call(Maven3Builder.java:71)
	at hudson.remoting.UserRequest.perform(UserRequest.java:120)
	at hudson.remoting.UserRequest.perform(UserRequest.java:48)
	at hudson.remoting.Request$2.run(Request.java:326)
	at hudson.remoting.InterceptingExecutorService$1.call(InterceptingExecutorService.java:68)
	at java.util.concurrent.FutureTask.run(FutureTask.java:266)
	at java.util.concurrent.ThreadPoolExecutor.runWorker(ThreadPoolExecutor.java:1142)
	at java.util.concurrent.ThreadPoolExecutor$Worker.run(ThreadPoolExecutor.java:617)
	at java.lang.Thread.run(Thread.java:745)
Caused by: org.apache.maven.plugin.MojoFailureException: You have 7 Checkstyle violations.
	at org.apache.maven.plugin.checkstyle.CheckstyleViolationCheckMojo.execute(CheckstyleViolationCheckMojo.java:588)
	at org.apache.maven.plugin.DefaultBuildPluginManager.executeMojo(DefaultBuildPluginManager.java:134)
	at org.apache.maven.lifecycle.internal.MojoExecutor.execute(MojoExecutor.java:208)
	... 31 more
[ERROR] 
[ERROR] Re-run Maven using the -X switch to enable full debug logging.
[ERROR] 
[ERROR] For more information about the errors and possible solutions, please read the following
articles:
[ERROR] [Help 1] http://cwiki.apache.org/confluence/display/MAVEN/MojoFailureException
[ERROR] 
[ERROR] After correcting the problems, you can resume the build with the command
[ERROR]   mvn <goals> -rf :spark-runner
[JENKINS] Archiving <https://builds.apache.org/job/beam_PostCommit_MavenVerify/ws/runners/spark/pom.xml>
to org.apache.beam/spark-runner/0.1.0-incubating-SNAPSHOT/spark-runner-0.1.0-incubating-SNAPSHOT.pom
[JENKINS] Archiving <https://builds.apache.org/job/beam_PostCommit_MavenVerify/ws/runners/spark/target/spark-runner-0.1.0-incubating-SNAPSHOT.jar>
to org.apache.beam/spark-runner/0.1.0-incubating-SNAPSHOT/spark-runner-0.1.0-incubating-SNAPSHOT.jar
[JENKINS] Archiving <https://builds.apache.org/job/beam_PostCommit_MavenVerify/ws/runners/spark/target/spark-runner-0.1.0-incubating-SNAPSHOT-tests.jar>
to org.apache.beam/spark-runner/0.1.0-incubating-SNAPSHOT/spark-runner-0.1.0-incubating-SNAPSHOT-tests.jar
[JENKINS] Archiving <https://builds.apache.org/job/beam_PostCommit_MavenVerify/ws/runners/spark/target/spark-runner-0.1.0-incubating-SNAPSHOT-sources.jar>
to org.apache.beam/spark-runner/0.1.0-incubating-SNAPSHOT/spark-runner-0.1.0-incubating-SNAPSHOT-sources.jar
[JENKINS] Archiving <https://builds.apache.org/job/beam_PostCommit_MavenVerify/ws/runners/spark/target/spark-runner-0.1.0-incubating-SNAPSHOT-test-sources.jar>
to org.apache.beam/spark-runner/0.1.0-incubating-SNAPSHOT/spark-runner-0.1.0-incubating-SNAPSHOT-test-sources.jar
[JENKINS] Archiving <https://builds.apache.org/job/beam_PostCommit_MavenVerify/ws/runners/spark/target/spark-runner-0.1.0-incubating-SNAPSHOT-javadoc.jar>
to org.apache.beam/spark-runner/0.1.0-incubating-SNAPSHOT/spark-runner-0.1.0-incubating-SNAPSHOT-javadoc.jar
[JENKINS] Archiving <https://builds.apache.org/job/beam_PostCommit_MavenVerify/ws/runners/spark/target/spark-runner-0.1.0-incubating-SNAPSHOT-spark-app.jar>
to org.apache.beam/spark-runner/0.1.0-incubating-SNAPSHOT/spark-runner-0.1.0-incubating-SNAPSHOT-spark-app.jar
[JENKINS] Archiving <https://builds.apache.org/job/beam_PostCommit_MavenVerify/ws/sdks/java/io/kafka/pom.xml>
to org.apache.beam/kafka/0.1.0-incubating-SNAPSHOT/kafka-0.1.0-incubating-SNAPSHOT.pom
[JENKINS] Archiving <https://builds.apache.org/job/beam_PostCommit_MavenVerify/ws/sdks/java/io/kafka/target/kafka-0.1.0-incubating-SNAPSHOT.jar>
to org.apache.beam/kafka/0.1.0-incubating-SNAPSHOT/kafka-0.1.0-incubating-SNAPSHOT.jar
[JENKINS] Archiving <https://builds.apache.org/job/beam_PostCommit_MavenVerify/ws/sdks/java/io/kafka/target/kafka-0.1.0-incubating-SNAPSHOT-sources.jar>
to org.apache.beam/kafka/0.1.0-incubating-SNAPSHOT/kafka-0.1.0-incubating-SNAPSHOT-sources.jar
[JENKINS] Archiving <https://builds.apache.org/job/beam_PostCommit_MavenVerify/ws/sdks/java/io/kafka/target/kafka-0.1.0-incubating-SNAPSHOT-test-sources.jar>
to org.apache.beam/kafka/0.1.0-incubating-SNAPSHOT/kafka-0.1.0-incubating-SNAPSHOT-test-sources.jar
[JENKINS] Archiving <https://builds.apache.org/job/beam_PostCommit_MavenVerify/ws/sdks/java/io/kafka/target/kafka-0.1.0-incubating-SNAPSHOT-tests.jar>
to org.apache.beam/kafka/0.1.0-incubating-SNAPSHOT/kafka-0.1.0-incubating-SNAPSHOT-tests.jar
[JENKINS] Archiving <https://builds.apache.org/job/beam_PostCommit_MavenVerify/ws/examples/java/pom.xml>
to org.apache.beam/java-examples-all/0.1.0-incubating-SNAPSHOT/java-examples-all-0.1.0-incubating-SNAPSHOT.pom
[JENKINS] Archiving <https://builds.apache.org/job/beam_PostCommit_MavenVerify/ws/examples/java/target/java-examples-all-0.1.0-incubating-SNAPSHOT.jar>
to org.apache.beam/java-examples-all/0.1.0-incubating-SNAPSHOT/java-examples-all-0.1.0-incubating-SNAPSHOT.jar
[JENKINS] Archiving <https://builds.apache.org/job/beam_PostCommit_MavenVerify/ws/examples/java/target/java-examples-all-0.1.0-incubating-SNAPSHOT-sources.jar>
to org.apache.beam/java-examples-all/0.1.0-incubating-SNAPSHOT/java-examples-all-0.1.0-incubating-SNAPSHOT-sources.jar
[JENKINS] Archiving <https://builds.apache.org/job/beam_PostCommit_MavenVerify/ws/examples/java/target/java-examples-all-0.1.0-incubating-SNAPSHOT-test-sources.jar>
to org.apache.beam/java-examples-all/0.1.0-incubating-SNAPSHOT/java-examples-all-0.1.0-incubating-SNAPSHOT-test-sources.jar
[JENKINS] Archiving <https://builds.apache.org/job/beam_PostCommit_MavenVerify/ws/examples/java/target/java-examples-all-0.1.0-incubating-SNAPSHOT-javadoc.jar>
to org.apache.beam/java-examples-all/0.1.0-incubating-SNAPSHOT/java-examples-all-0.1.0-incubating-SNAPSHOT-javadoc.jar
[JENKINS] Archiving <https://builds.apache.org/job/beam_PostCommit_MavenVerify/ws/examples/java/target/java-examples-all-0.1.0-incubating-SNAPSHOT-tests.jar>
to org.apache.beam/java-examples-all/0.1.0-incubating-SNAPSHOT/java-examples-all-0.1.0-incubating-SNAPSHOT-tests.jar
[JENKINS] Archiving <https://builds.apache.org/job/beam_PostCommit_MavenVerify/ws/runners/direct-java/dependency-reduced-pom.xml>
to org.apache.beam/direct-runner/0.1.0-incubating-SNAPSHOT/direct-runner-0.1.0-incubating-SNAPSHOT.pom
[JENKINS] Archiving <https://builds.apache.org/job/beam_PostCommit_MavenVerify/ws/runners/direct-java/target/direct-runner-0.1.0-incubating-SNAPSHOT.jar>
to org.apache.beam/direct-runner/0.1.0-incubating-SNAPSHOT/direct-runner-0.1.0-incubating-SNAPSHOT.jar
[JENKINS] Archiving <https://builds.apache.org/job/beam_PostCommit_MavenVerify/ws/runners/direct-java/target/direct-runner-0.1.0-incubating-SNAPSHOT-tests.jar>
to org.apache.beam/direct-runner/0.1.0-incubating-SNAPSHOT/direct-runner-0.1.0-incubating-SNAPSHOT-tests.jar
[JENKINS] Archiving <https://builds.apache.org/job/beam_PostCommit_MavenVerify/ws/runners/direct-java/target/direct-runner-0.1.0-incubating-SNAPSHOT-sources.jar>
to org.apache.beam/direct-runner/0.1.0-incubating-SNAPSHOT/direct-runner-0.1.0-incubating-SNAPSHOT-sources.jar
[JENKINS] Archiving <https://builds.apache.org/job/beam_PostCommit_MavenVerify/ws/runners/direct-java/target/direct-runner-0.1.0-incubating-SNAPSHOT-test-sources.jar>
to org.apache.beam/direct-runner/0.1.0-incubating-SNAPSHOT/direct-runner-0.1.0-incubating-SNAPSHOT-test-sources.jar
[JENKINS] Archiving <https://builds.apache.org/job/beam_PostCommit_MavenVerify/ws/runners/direct-java/target/direct-runner-0.1.0-incubating-SNAPSHOT-javadoc.jar>
to org.apache.beam/direct-runner/0.1.0-incubating-SNAPSHOT/direct-runner-0.1.0-incubating-SNAPSHOT-javadoc.jar
[JENKINS] Archiving <https://builds.apache.org/job/beam_PostCommit_MavenVerify/ws/runners/google-cloud-dataflow-java/dependency-reduced-pom.xml>
to org.apache.beam/google-cloud-dataflow-java-runner/0.1.0-incubating-SNAPSHOT/google-cloud-dataflow-java-runner-0.1.0-incubating-SNAPSHOT.pom
[JENKINS] Archiving <https://builds.apache.org/job/beam_PostCommit_MavenVerify/ws/runners/google-cloud-dataflow-java/target/google-cloud-dataflow-java-runner-0.1.0-incubating-SNAPSHOT.jar>
to org.apache.beam/google-cloud-dataflow-java-runner/0.1.0-incubating-SNAPSHOT/google-cloud-dataflow-java-runner-0.1.0-incubating-SNAPSHOT.jar
[JENKINS] Archiving <https://builds.apache.org/job/beam_PostCommit_MavenVerify/ws/runners/google-cloud-dataflow-java/target/google-cloud-dataflow-java-runner-0.1.0-incubating-SNAPSHOT-tests.jar>
to org.apache.beam/google-cloud-dataflow-java-runner/0.1.0-incubating-SNAPSHOT/google-cloud-dataflow-java-runner-0.1.0-incubating-SNAPSHOT-tests.jar
[JENKINS] Archiving <https://builds.apache.org/job/beam_PostCommit_MavenVerify/ws/runners/google-cloud-dataflow-java/target/google-cloud-dataflow-java-runner-0.1.0-incubating-SNAPSHOT-sources.jar>
to org.apache.beam/google-cloud-dataflow-java-runner/0.1.0-incubating-SNAPSHOT/google-cloud-dataflow-java-runner-0.1.0-incubating-SNAPSHOT-sources.jar
[JENKINS] Archiving <https://builds.apache.org/job/beam_PostCommit_MavenVerify/ws/runners/google-cloud-dataflow-java/target/google-cloud-dataflow-java-runner-0.1.0-incubating-SNAPSHOT-test-sources.jar>
to org.apache.beam/google-cloud-dataflow-java-runner/0.1.0-incubating-SNAPSHOT/google-cloud-dataflow-java-runner-0.1.0-incubating-SNAPSHOT-test-sources.jar
[JENKINS] Archiving <https://builds.apache.org/job/beam_PostCommit_MavenVerify/ws/runners/google-cloud-dataflow-java/target/google-cloud-dataflow-java-runner-0.1.0-incubating-SNAPSHOT-javadoc.jar>
to org.apache.beam/google-cloud-dataflow-java-runner/0.1.0-incubating-SNAPSHOT/google-cloud-dataflow-java-runner-0.1.0-incubating-SNAPSHOT-javadoc.jar
[JENKINS] Archiving <https://builds.apache.org/job/beam_PostCommit_MavenVerify/ws/runners/core-java/pom.xml>
to org.apache.beam/runners-core/0.1.0-incubating-SNAPSHOT/runners-core-0.1.0-incubating-SNAPSHOT.pom
[JENKINS] Archiving <https://builds.apache.org/job/beam_PostCommit_MavenVerify/ws/runners/core-java/target/runners-core-0.1.0-incubating-SNAPSHOT.jar>
to org.apache.beam/runners-core/0.1.0-incubating-SNAPSHOT/runners-core-0.1.0-incubating-SNAPSHOT.jar
[JENKINS] Archiving <https://builds.apache.org/job/beam_PostCommit_MavenVerify/ws/runners/core-java/target/runners-core-0.1.0-incubating-SNAPSHOT-tests.jar>
to org.apache.beam/runners-core/0.1.0-incubating-SNAPSHOT/runners-core-0.1.0-incubating-SNAPSHOT-tests.jar
[JENKINS] Archiving <https://builds.apache.org/job/beam_PostCommit_MavenVerify/ws/runners/core-java/target/runners-core-0.1.0-incubating-SNAPSHOT-sources.jar>
to org.apache.beam/runners-core/0.1.0-incubating-SNAPSHOT/runners-core-0.1.0-incubating-SNAPSHOT-sources.jar
[JENKINS] Archiving <https://builds.apache.org/job/beam_PostCommit_MavenVerify/ws/runners/core-java/target/runners-core-0.1.0-incubating-SNAPSHOT-test-sources.jar>
to org.apache.beam/runners-core/0.1.0-incubating-SNAPSHOT/runners-core-0.1.0-incubating-SNAPSHOT-test-sources.jar
[JENKINS] Archiving <https://builds.apache.org/job/beam_PostCommit_MavenVerify/ws/runners/core-java/target/runners-core-0.1.0-incubating-SNAPSHOT-javadoc.jar>
to org.apache.beam/runners-core/0.1.0-incubating-SNAPSHOT/runners-core-0.1.0-incubating-SNAPSHOT-javadoc.jar
[JENKINS] Archiving <https://builds.apache.org/job/beam_PostCommit_MavenVerify/ws/sdks/java/build-tools/pom.xml>
to org.apache.beam/java-build-tools/0.1.0-incubating-SNAPSHOT/java-build-tools-0.1.0-incubating-SNAPSHOT.pom
[JENKINS] Archiving <https://builds.apache.org/job/beam_PostCommit_MavenVerify/ws/sdks/java/build-tools/target/java-build-tools-0.1.0-incubating-SNAPSHOT.jar>
to org.apache.beam/java-build-tools/0.1.0-incubating-SNAPSHOT/java-build-tools-0.1.0-incubating-SNAPSHOT.jar
[JENKINS] Archiving <https://builds.apache.org/job/beam_PostCommit_MavenVerify/ws/sdks/java/build-tools/target/java-build-tools-0.1.0-incubating-SNAPSHOT-tests.jar>
to org.apache.beam/java-build-tools/0.1.0-incubating-SNAPSHOT/java-build-tools-0.1.0-incubating-SNAPSHOT-tests.jar
[JENKINS] Archiving <https://builds.apache.org/job/beam_PostCommit_MavenVerify/ws/sdks/java/io/pom.xml>
to org.apache.beam/io-parent/0.1.0-incubating-SNAPSHOT/io-parent-0.1.0-incubating-SNAPSHOT.pom
[JENKINS] Archiving <https://builds.apache.org/job/beam_PostCommit_MavenVerify/ws/sdks/java/extensions/join-library/pom.xml>
to org.apache.beam/join-library/0.1.0-incubating-SNAPSHOT/join-library-0.1.0-incubating-SNAPSHOT.pom
[JENKINS] Archiving <https://builds.apache.org/job/beam_PostCommit_MavenVerify/ws/sdks/java/extensions/join-library/target/join-library-0.1.0-incubating-SNAPSHOT.jar>
to org.apache.beam/join-library/0.1.0-incubating-SNAPSHOT/join-library-0.1.0-incubating-SNAPSHOT.jar
[JENKINS] Archiving <https://builds.apache.org/job/beam_PostCommit_MavenVerify/ws/sdks/java/extensions/join-library/target/join-library-0.1.0-incubating-SNAPSHOT-sources.jar>
to org.apache.beam/join-library/0.1.0-incubating-SNAPSHOT/join-library-0.1.0-incubating-SNAPSHOT-sources.jar
[JENKINS] Archiving <https://builds.apache.org/job/beam_PostCommit_MavenVerify/ws/sdks/java/extensions/join-library/target/join-library-0.1.0-incubating-SNAPSHOT-test-sources.jar>
to org.apache.beam/join-library/0.1.0-incubating-SNAPSHOT/join-library-0.1.0-incubating-SNAPSHOT-test-sources.jar
[JENKINS] Archiving <https://builds.apache.org/job/beam_PostCommit_MavenVerify/ws/sdks/java/extensions/join-library/target/join-library-0.1.0-incubating-SNAPSHOT-tests.jar>
to org.apache.beam/join-library/0.1.0-incubating-SNAPSHOT/join-library-0.1.0-incubating-SNAPSHOT-tests.jar
[JENKINS] Archiving <https://builds.apache.org/job/beam_PostCommit_MavenVerify/ws/sdks/java/maven-archetypes/examples/pom.xml>
to org.apache.beam/maven-archetypes-examples/0.1.0-incubating-SNAPSHOT/maven-archetypes-examples-0.1.0-incubating-SNAPSHOT.pom
[JENKINS] Archiving <https://builds.apache.org/job/beam_PostCommit_MavenVerify/ws/sdks/java/pom.xml>
to org.apache.beam/java-sdk-parent/0.1.0-incubating-SNAPSHOT/java-sdk-parent-0.1.0-incubating-SNAPSHOT.pom
[JENKINS] Archiving <https://builds.apache.org/job/beam_PostCommit_MavenVerify/ws/sdks/java/io/google-cloud-platform/pom.xml>
to org.apache.beam/google-cloud-platform/0.1.0-incubating-SNAPSHOT/google-cloud-platform-0.1.0-incubating-SNAPSHOT.pom
[JENKINS] Archiving <https://builds.apache.org/job/beam_PostCommit_MavenVerify/ws/sdks/java/io/google-cloud-platform/target/google-cloud-platform-0.1.0-incubating-SNAPSHOT.jar>
to org.apache.beam/google-cloud-platform/0.1.0-incubating-SNAPSHOT/google-cloud-platform-0.1.0-incubating-SNAPSHOT.jar
[JENKINS] Archiving <https://builds.apache.org/job/beam_PostCommit_MavenVerify/ws/sdks/java/io/google-cloud-platform/target/google-cloud-platform-0.1.0-incubating-SNAPSHOT-sources.jar>
to org.apache.beam/google-cloud-platform/0.1.0-incubating-SNAPSHOT/google-cloud-platform-0.1.0-incubating-SNAPSHOT-sources.jar
[JENKINS] Archiving <https://builds.apache.org/job/beam_PostCommit_MavenVerify/ws/sdks/java/io/google-cloud-platform/target/google-cloud-platform-0.1.0-incubating-SNAPSHOT-test-sources.jar>
to org.apache.beam/google-cloud-platform/0.1.0-incubating-SNAPSHOT/google-cloud-platform-0.1.0-incubating-SNAPSHOT-test-sources.jar
[JENKINS] Archiving <https://builds.apache.org/job/beam_PostCommit_MavenVerify/ws/sdks/java/io/google-cloud-platform/target/google-cloud-platform-0.1.0-incubating-SNAPSHOT-tests.jar>
to org.apache.beam/google-cloud-platform/0.1.0-incubating-SNAPSHOT/google-cloud-platform-0.1.0-incubating-SNAPSHOT-tests.jar
[JENKINS] Archiving <https://builds.apache.org/job/beam_PostCommit_MavenVerify/ws/pom.xml>
to org.apache.beam/parent/0.1.0-incubating-SNAPSHOT/parent-0.1.0-incubating-SNAPSHOT.pom
[JENKINS] Archiving <https://builds.apache.org/job/beam_PostCommit_MavenVerify/ws/sdks/java/maven-archetypes/starter/pom.xml>
to org.apache.beam/maven-archetypes-starter/0.1.0-incubating-SNAPSHOT/maven-archetypes-starter-0.1.0-incubating-SNAPSHOT.pom
[JENKINS] Archiving <https://builds.apache.org/job/beam_PostCommit_MavenVerify/ws/sdks/java/maven-archetypes/pom.xml>
to org.apache.beam/maven-archetypes-parent/0.1.0-incubating-SNAPSHOT/maven-archetypes-parent-0.1.0-incubating-SNAPSHOT.pom
[JENKINS] Archiving <https://builds.apache.org/job/beam_PostCommit_MavenVerify/ws/runners/flink/runner/pom.xml>
to org.apache.beam/flink-runner_2.10/0.1.0-incubating-SNAPSHOT/flink-runner_2.10-0.1.0-incubating-SNAPSHOT.pom
[JENKINS] Archiving <https://builds.apache.org/job/beam_PostCommit_MavenVerify/ws/runners/flink/runner/target/flink-runner_2.10-0.1.0-incubating-SNAPSHOT.jar>
to org.apache.beam/flink-runner_2.10/0.1.0-incubating-SNAPSHOT/flink-runner_2.10-0.1.0-incubating-SNAPSHOT.jar
[JENKINS] Archiving <https://builds.apache.org/job/beam_PostCommit_MavenVerify/ws/runners/flink/runner/target/flink-runner_2.10-0.1.0-incubating-SNAPSHOT-tests.jar>
to org.apache.beam/flink-runner_2.10/0.1.0-incubating-SNAPSHOT/flink-runner_2.10-0.1.0-incubating-SNAPSHOT-tests.jar
[JENKINS] Archiving <https://builds.apache.org/job/beam_PostCommit_MavenVerify/ws/runners/flink/runner/target/flink-runner_2.10-0.1.0-incubating-SNAPSHOT-sources.jar>
to org.apache.beam/flink-runner_2.10/0.1.0-incubating-SNAPSHOT/flink-runner_2.10-0.1.0-incubating-SNAPSHOT-sources.jar
[JENKINS] Archiving <https://builds.apache.org/job/beam_PostCommit_MavenVerify/ws/runners/flink/runner/target/flink-runner_2.10-0.1.0-incubating-SNAPSHOT-test-sources.jar>
to org.apache.beam/flink-runner_2.10/0.1.0-incubating-SNAPSHOT/flink-runner_2.10-0.1.0-incubating-SNAPSHOT-test-sources.jar
Compressed 497.90 KB of artifacts by 12.9% relative to #366
[JENKINS] Archiving <https://builds.apache.org/job/beam_PostCommit_MavenVerify/ws/examples/pom.xml>
to org.apache.beam/examples-parent/0.1.0-incubating-SNAPSHOT/examples-parent-0.1.0-incubating-SNAPSHOT.pom
[JENKINS] Archiving <https://builds.apache.org/job/beam_PostCommit_MavenVerify/ws/runners/flink/examples/pom.xml>
to org.apache.beam/flink-runner-examples_2.10/0.1.0-incubating-SNAPSHOT/flink-runner-examples_2.10-0.1.0-incubating-SNAPSHOT.pom
[JENKINS] Archiving <https://builds.apache.org/job/beam_PostCommit_MavenVerify/ws/runners/flink/examples/target/flink-runner-examples_2.10-0.1.0-incubating-SNAPSHOT.jar>
to org.apache.beam/flink-runner-examples_2.10/0.1.0-incubating-SNAPSHOT/flink-runner-examples_2.10-0.1.0-incubating-SNAPSHOT.jar
[JENKINS] Archiving <https://builds.apache.org/job/beam_PostCommit_MavenVerify/ws/runners/flink/examples/target/flink-runner-examples_2.10-0.1.0-incubating-SNAPSHOT-tests.jar>
to org.apache.beam/flink-runner-examples_2.10/0.1.0-incubating-SNAPSHOT/flink-runner-examples_2.10-0.1.0-incubating-SNAPSHOT-tests.jar
[JENKINS] Archiving <https://builds.apache.org/job/beam_PostCommit_MavenVerify/ws/runners/flink/examples/target/flink-runner-examples_2.10-0.1.0-incubating-SNAPSHOT-sources.jar>
to org.apache.beam/flink-runner-examples_2.10/0.1.0-incubating-SNAPSHOT/flink-runner-examples_2.10-0.1.0-incubating-SNAPSHOT-sources.jar
[JENKINS] Archiving <https://builds.apache.org/job/beam_PostCommit_MavenVerify/ws/runners/flink/examples/target/flink-runner-examples_2.10-0.1.0-incubating-SNAPSHOT-test-sources.jar>
to org.apache.beam/flink-runner-examples_2.10/0.1.0-incubating-SNAPSHOT/flink-runner-examples_2.10-0.1.0-incubating-SNAPSHOT-test-sources.jar
[JENKINS] Archiving <https://builds.apache.org/job/beam_PostCommit_MavenVerify/ws/sdks/pom.xml>
to org.apache.beam/sdks-parent/0.1.0-incubating-SNAPSHOT/sdks-parent-0.1.0-incubating-SNAPSHOT.pom
[JENKINS] Archiving <https://builds.apache.org/job/beam_PostCommit_MavenVerify/ws/sdks/java/extensions/pom.xml>
to org.apache.beam/extensions-parent/0.1.0-incubating-SNAPSHOT/extensions-parent-0.1.0-incubating-SNAPSHOT.pom
[JENKINS] Archiving <https://builds.apache.org/job/beam_PostCommit_MavenVerify/ws/runners/pom.xml>
to org.apache.beam/runners-parent/0.1.0-incubating-SNAPSHOT/runners-parent-0.1.0-incubating-SNAPSHOT.pom
[JENKINS] Archiving <https://builds.apache.org/job/beam_PostCommit_MavenVerify/ws/sdks/java/core/dependency-reduced-pom.xml>
to org.apache.beam/java-sdk-all/0.1.0-incubating-SNAPSHOT/java-sdk-all-0.1.0-incubating-SNAPSHOT.pom
[JENKINS] Archiving <https://builds.apache.org/job/beam_PostCommit_MavenVerify/ws/sdks/java/core/target/java-sdk-all-0.1.0-incubating-SNAPSHOT.jar>
to org.apache.beam/java-sdk-all/0.1.0-incubating-SNAPSHOT/java-sdk-all-0.1.0-incubating-SNAPSHOT.jar
[JENKINS] Archiving <https://builds.apache.org/job/beam_PostCommit_MavenVerify/ws/sdks/java/core/target/java-sdk-all-0.1.0-incubating-SNAPSHOT-tests.jar>
to org.apache.beam/java-sdk-all/0.1.0-incubating-SNAPSHOT/java-sdk-all-0.1.0-incubating-SNAPSHOT-tests.jar
[JENKINS] Archiving <https://builds.apache.org/job/beam_PostCommit_MavenVerify/ws/sdks/java/core/target/java-sdk-all-0.1.0-incubating-SNAPSHOT-sources.jar>
to org.apache.beam/java-sdk-all/0.1.0-incubating-SNAPSHOT/java-sdk-all-0.1.0-incubating-SNAPSHOT-sources.jar
[JENKINS] Archiving <https://builds.apache.org/job/beam_PostCommit_MavenVerify/ws/sdks/java/core/target/java-sdk-all-0.1.0-incubating-SNAPSHOT-test-sources.jar>
to org.apache.beam/java-sdk-all/0.1.0-incubating-SNAPSHOT/java-sdk-all-0.1.0-incubating-SNAPSHOT-test-sources.jar
[JENKINS] Archiving <https://builds.apache.org/job/beam_PostCommit_MavenVerify/ws/sdks/java/core/target/java-sdk-all-0.1.0-incubating-SNAPSHOT-javadoc.jar>
to org.apache.beam/java-sdk-all/0.1.0-incubating-SNAPSHOT/java-sdk-all-0.1.0-incubating-SNAPSHOT-javadoc.jar
Compressed 8.45 MB of artifacts by 14.4% relative to #366
[JENKINS] Archiving <https://builds.apache.org/job/beam_PostCommit_MavenVerify/ws/runners/flink/target/flink-runner-parent-0.1.0-incubating-SNAPSHOT.jar>
to org.apache.beam/flink-runner-parent/0.1.0-incubating-SNAPSHOT/flink-runner-parent-0.1.0-incubating-SNAPSHOT.pom
[JENKINS] Archiving <https://builds.apache.org/job/beam_PostCommit_MavenVerify/ws/runners/flink/target/flink-runner-parent-0.1.0-incubating-SNAPSHOT-tests.jar>
to org.apache.beam/flink-runner-parent/0.1.0-incubating-SNAPSHOT/flink-runner-parent-0.1.0-incubating-SNAPSHOT-tests.jar
[JENKINS] Archiving <https://builds.apache.org/job/beam_PostCommit_MavenVerify/ws/sdks/java/io/hdfs/pom.xml>
to org.apache.beam/hdfs/0.1.0-incubating-SNAPSHOT/hdfs-0.1.0-incubating-SNAPSHOT.pom
[JENKINS] Archiving <https://builds.apache.org/job/beam_PostCommit_MavenVerify/ws/sdks/java/io/hdfs/target/hdfs-0.1.0-incubating-SNAPSHOT.jar>
to org.apache.beam/hdfs/0.1.0-incubating-SNAPSHOT/hdfs-0.1.0-incubating-SNAPSHOT.jar
[JENKINS] Archiving <https://builds.apache.org/job/beam_PostCommit_MavenVerify/ws/sdks/java/io/hdfs/target/hdfs-0.1.0-incubating-SNAPSHOT-sources.jar>
to org.apache.beam/hdfs/0.1.0-incubating-SNAPSHOT/hdfs-0.1.0-incubating-SNAPSHOT-sources.jar
[JENKINS] Archiving <https://builds.apache.org/job/beam_PostCommit_MavenVerify/ws/sdks/java/io/hdfs/target/hdfs-0.1.0-incubating-SNAPSHOT-test-sources.jar>
to org.apache.beam/hdfs/0.1.0-incubating-SNAPSHOT/hdfs-0.1.0-incubating-SNAPSHOT-test-sources.jar
[JENKINS] Archiving <https://builds.apache.org/job/beam_PostCommit_MavenVerify/ws/sdks/java/io/hdfs/target/hdfs-0.1.0-incubating-SNAPSHOT-tests.jar>
to org.apache.beam/hdfs/0.1.0-incubating-SNAPSHOT/hdfs-0.1.0-incubating-SNAPSHOT-tests.jar
Sending e-mails to: commits@beam.incubator.apache.org
channel stopped

Mime
View raw message