beam-commits mailing list archives

Site index · List index
Message view « Date » · « Thread »
Top « Date » · « Thread »
From Apache Jenkins Server <jenk...@builds.apache.org>
Subject Build failed in Jenkins: beam_PostCommit_MavenVerify » Apache Beam :: Runners :: Spark #367
Date Sun, 08 May 2016 19:47:36 GMT
See <https://builds.apache.org/job/beam_PostCommit_MavenVerify/org.apache.beam$spark-runner/367/>

------------------------------------------
[...truncated 219 lines...]
Generating <https://builds.apache.org/job/beam_PostCommit_MavenVerify/org.apache.beam$spark-runner/ws/target/apidocs/org/apache/beam/runners/spark/io/class-use/ConsoleIO.Write.html...>
Generating <https://builds.apache.org/job/beam_PostCommit_MavenVerify/org.apache.beam$spark-runner/ws/target/apidocs/org/apache/beam/runners/spark/io/class-use/ConsoleIO.Write.Unbound.html...>
Generating <https://builds.apache.org/job/beam_PostCommit_MavenVerify/org.apache.beam$spark-runner/ws/target/apidocs/org/apache/beam/runners/spark/io/class-use/CreateStream.html...>
Generating <https://builds.apache.org/job/beam_PostCommit_MavenVerify/org.apache.beam$spark-runner/ws/target/apidocs/org/apache/beam/runners/spark/io/class-use/CreateStream.QueuedValues.html...>
Generating <https://builds.apache.org/job/beam_PostCommit_MavenVerify/org.apache.beam$spark-runner/ws/target/apidocs/org/apache/beam/runners/spark/io/class-use/KafkaIO.html...>
Generating <https://builds.apache.org/job/beam_PostCommit_MavenVerify/org.apache.beam$spark-runner/ws/target/apidocs/org/apache/beam/runners/spark/io/class-use/KafkaIO.Read.html...>
Generating <https://builds.apache.org/job/beam_PostCommit_MavenVerify/org.apache.beam$spark-runner/ws/target/apidocs/org/apache/beam/runners/spark/io/class-use/KafkaIO.Read.Unbound.html...>
Generating <https://builds.apache.org/job/beam_PostCommit_MavenVerify/org.apache.beam$spark-runner/ws/target/apidocs/org/apache/beam/runners/spark/aggregators/class-use/AggAccumParam.html...>
Generating <https://builds.apache.org/job/beam_PostCommit_MavenVerify/org.apache.beam$spark-runner/ws/target/apidocs/org/apache/beam/runners/spark/aggregators/class-use/NamedAggregators.html...>
Generating <https://builds.apache.org/job/beam_PostCommit_MavenVerify/org.apache.beam$spark-runner/ws/target/apidocs/org/apache/beam/runners/spark/aggregators/class-use/NamedAggregators.State.html...>
Generating <https://builds.apache.org/job/beam_PostCommit_MavenVerify/org.apache.beam$spark-runner/ws/target/apidocs/org/apache/beam/runners/spark/aggregators/class-use/NamedAggregators.CombineFunctionState.html...>
Generating <https://builds.apache.org/job/beam_PostCommit_MavenVerify/org.apache.beam$spark-runner/ws/target/apidocs/org/apache/beam/runners/spark/coders/class-use/CoderHelpers.html...>
Generating <https://builds.apache.org/job/beam_PostCommit_MavenVerify/org.apache.beam$spark-runner/ws/target/apidocs/org/apache/beam/runners/spark/coders/class-use/WritableCoder.html...>
Generating <https://builds.apache.org/job/beam_PostCommit_MavenVerify/org.apache.beam$spark-runner/ws/target/apidocs/org/apache/beam/runners/spark/coders/class-use/NullWritableCoder.html...>
Generating <https://builds.apache.org/job/beam_PostCommit_MavenVerify/org.apache.beam$spark-runner/ws/target/apidocs/org/apache/beam/runners/spark/translation/class-use/TransformEvaluator.html...>
Generating <https://builds.apache.org/job/beam_PostCommit_MavenVerify/org.apache.beam$spark-runner/ws/target/apidocs/org/apache/beam/runners/spark/translation/class-use/SparkProcessContext.html...>
Generating <https://builds.apache.org/job/beam_PostCommit_MavenVerify/org.apache.beam$spark-runner/ws/target/apidocs/org/apache/beam/runners/spark/translation/class-use/SparkProcessContext.SparkProcessException.html...>
Generating <https://builds.apache.org/job/beam_PostCommit_MavenVerify/org.apache.beam$spark-runner/ws/target/apidocs/org/apache/beam/runners/spark/translation/class-use/SparkPipelineTranslator.html...>
Generating <https://builds.apache.org/job/beam_PostCommit_MavenVerify/org.apache.beam$spark-runner/ws/target/apidocs/org/apache/beam/runners/spark/translation/class-use/DoFnFunction.html...>
Generating <https://builds.apache.org/job/beam_PostCommit_MavenVerify/org.apache.beam$spark-runner/ws/target/apidocs/org/apache/beam/runners/spark/translation/class-use/SparkRuntimeContext.html...>
Generating <https://builds.apache.org/job/beam_PostCommit_MavenVerify/org.apache.beam$spark-runner/ws/target/apidocs/org/apache/beam/runners/spark/translation/class-use/SparkContextFactory.html...>
Generating <https://builds.apache.org/job/beam_PostCommit_MavenVerify/org.apache.beam$spark-runner/ws/target/apidocs/org/apache/beam/runners/spark/translation/class-use/TransformTranslator.html...>
Generating <https://builds.apache.org/job/beam_PostCommit_MavenVerify/org.apache.beam$spark-runner/ws/target/apidocs/org/apache/beam/runners/spark/translation/class-use/TransformTranslator.FieldGetter.html...>
Generating <https://builds.apache.org/job/beam_PostCommit_MavenVerify/org.apache.beam$spark-runner/ws/target/apidocs/org/apache/beam/runners/spark/translation/class-use/TransformTranslator.Translator.html...>
Generating <https://builds.apache.org/job/beam_PostCommit_MavenVerify/org.apache.beam$spark-runner/ws/target/apidocs/org/apache/beam/runners/spark/translation/class-use/SparkPipelineEvaluator.html...>
Generating <https://builds.apache.org/job/beam_PostCommit_MavenVerify/org.apache.beam$spark-runner/ws/target/apidocs/org/apache/beam/runners/spark/translation/class-use/WindowingHelpers.html...>
Generating <https://builds.apache.org/job/beam_PostCommit_MavenVerify/org.apache.beam$spark-runner/ws/target/apidocs/org/apache/beam/runners/spark/translation/class-use/EvaluationContext.html...>
Generating <https://builds.apache.org/job/beam_PostCommit_MavenVerify/org.apache.beam$spark-runner/ws/target/apidocs/org/apache/beam/runners/spark/translation/streaming/class-use/StreamingWindowPipelineDetector.html...>
Generating <https://builds.apache.org/job/beam_PostCommit_MavenVerify/org.apache.beam$spark-runner/ws/target/apidocs/org/apache/beam/runners/spark/translation/streaming/class-use/StreamingTransformTranslator.html...>
Generating <https://builds.apache.org/job/beam_PostCommit_MavenVerify/org.apache.beam$spark-runner/ws/target/apidocs/org/apache/beam/runners/spark/translation/streaming/class-use/StreamingTransformTranslator.Translator.html...>
Generating <https://builds.apache.org/job/beam_PostCommit_MavenVerify/org.apache.beam$spark-runner/ws/target/apidocs/org/apache/beam/runners/spark/translation/streaming/class-use/StreamingEvaluationContext.html...>
Generating <https://builds.apache.org/job/beam_PostCommit_MavenVerify/org.apache.beam$spark-runner/ws/target/apidocs/org/apache/beam/runners/spark/util/class-use/ByteArray.html...>
Generating <https://builds.apache.org/job/beam_PostCommit_MavenVerify/org.apache.beam$spark-runner/ws/target/apidocs/org/apache/beam/runners/spark/util/class-use/SinglePrimitiveOutputPTransform.html...>
Generating <https://builds.apache.org/job/beam_PostCommit_MavenVerify/org.apache.beam$spark-runner/ws/target/apidocs/org/apache/beam/runners/spark/util/class-use/BroadcastHelper.html...>
Generating <https://builds.apache.org/job/beam_PostCommit_MavenVerify/org.apache.beam$spark-runner/ws/target/apidocs/org/apache/beam/runners/spark/package-use.html...>
Generating <https://builds.apache.org/job/beam_PostCommit_MavenVerify/org.apache.beam$spark-runner/ws/target/apidocs/org/apache/beam/runners/spark/aggregators/package-use.html...>
Generating <https://builds.apache.org/job/beam_PostCommit_MavenVerify/org.apache.beam$spark-runner/ws/target/apidocs/org/apache/beam/runners/spark/coders/package-use.html...>
Generating <https://builds.apache.org/job/beam_PostCommit_MavenVerify/org.apache.beam$spark-runner/ws/target/apidocs/org/apache/beam/runners/spark/io/package-use.html...>
Generating <https://builds.apache.org/job/beam_PostCommit_MavenVerify/org.apache.beam$spark-runner/ws/target/apidocs/org/apache/beam/runners/spark/io/hadoop/package-use.html...>
Generating <https://builds.apache.org/job/beam_PostCommit_MavenVerify/org.apache.beam$spark-runner/ws/target/apidocs/org/apache/beam/runners/spark/translation/package-use.html...>
Generating <https://builds.apache.org/job/beam_PostCommit_MavenVerify/org.apache.beam$spark-runner/ws/target/apidocs/org/apache/beam/runners/spark/translation/streaming/package-use.html...>
Generating <https://builds.apache.org/job/beam_PostCommit_MavenVerify/org.apache.beam$spark-runner/ws/target/apidocs/org/apache/beam/runners/spark/util/package-use.html...>
Building index for all the packages and classes...
Generating <https://builds.apache.org/job/beam_PostCommit_MavenVerify/org.apache.beam$spark-runner/ws/target/apidocs/overview-tree.html...>
Generating <https://builds.apache.org/job/beam_PostCommit_MavenVerify/org.apache.beam$spark-runner/ws/target/apidocs/index-all.html...>
Generating <https://builds.apache.org/job/beam_PostCommit_MavenVerify/org.apache.beam$spark-runner/ws/target/apidocs/deprecated-list.html...>
Building index for all classes...
Generating <https://builds.apache.org/job/beam_PostCommit_MavenVerify/org.apache.beam$spark-runner/ws/target/apidocs/allclasses-frame.html...>
Generating <https://builds.apache.org/job/beam_PostCommit_MavenVerify/org.apache.beam$spark-runner/ws/target/apidocs/allclasses-noframe.html...>
Generating <https://builds.apache.org/job/beam_PostCommit_MavenVerify/org.apache.beam$spark-runner/ws/target/apidocs/index.html...>
Generating <https://builds.apache.org/job/beam_PostCommit_MavenVerify/org.apache.beam$spark-runner/ws/target/apidocs/overview-summary.html...>
Generating <https://builds.apache.org/job/beam_PostCommit_MavenVerify/org.apache.beam$spark-runner/ws/target/apidocs/help-doc.html...>
5 warnings
[WARNING] Javadoc Warnings
[WARNING] <https://builds.apache.org/job/beam_PostCommit_MavenVerify/org.apache.beam$spark-runner/ws/src/main/java/org/apache/beam/runners/spark/io/hadoop/HadoopIO.java>:59:
warning: no description for @param
[WARNING] * @param <K>
[WARNING] ^
[WARNING] <https://builds.apache.org/job/beam_PostCommit_MavenVerify/org.apache.beam$spark-runner/ws/src/main/java/org/apache/beam/runners/spark/io/hadoop/HadoopIO.java>:60:
warning: no description for @param
[WARNING] * @param <V>
[WARNING] ^
[WARNING] <https://builds.apache.org/job/beam_PostCommit_MavenVerify/org.apache.beam$spark-runner/ws/src/main/java/org/apache/beam/runners/spark/io/ConsoleIO.java>:50:
warning: no description for @param
[WARNING] * @param <T>
[WARNING] ^
[WARNING] <https://builds.apache.org/job/beam_PostCommit_MavenVerify/org.apache.beam$spark-runner/ws/src/main/java/org/apache/beam/runners/spark/util/BroadcastHelper.java>:91:
warning: no description for @param
[WARNING] * @param <T>
[WARNING] ^
[WARNING] <https://builds.apache.org/job/beam_PostCommit_MavenVerify/org.apache.beam$spark-runner/ws/src/main/java/org/apache/beam/runners/spark/util/BroadcastHelper.java>:63:
warning: no description for @param
[WARNING] * @param <T>
[WARNING] ^
[INFO] Building jar: <https://builds.apache.org/job/beam_PostCommit_MavenVerify/org.apache.beam$spark-runner/ws/target/spark-runner-0.1.0-incubating-SNAPSHOT-javadoc.jar>
[INFO] 
[INFO] --- maven-shade-plugin:2.4.1:shade (default) @ spark-runner ---
[INFO] Including commons-codec:commons-codec:jar:1.3 in the shaded jar.
[INFO] Including com.google.code.findbugs:jsr305:jar:3.0.1 in the shaded jar.
[INFO] Including org.slf4j:slf4j-api:jar:1.7.14 in the shaded jar.
[INFO] Including org.xerial.snappy:snappy-java:jar:1.1.2 in the shaded jar.
[INFO] Including io.netty:netty:jar:3.8.0.Final in the shaded jar.
[INFO] Including com.fasterxml.jackson.core:jackson-databind:jar:2.7.2 in the shaded jar.
[INFO] Including commons-lang:commons-lang:jar:2.4 in the shaded jar.
[INFO] Including com.google.guava:guava:jar:19.0 in the shaded jar.
[INFO] Including com.google.auto.service:auto-service:jar:1.0-rc2 in the shaded jar.
[INFO] Including com.google.auto:auto-common:jar:0.3 in the shaded jar.
[INFO] Including org.apache.beam:java-sdk-all:jar:0.1.0-incubating-SNAPSHOT in the shaded
jar.
[INFO] Including io.grpc:grpc-all:jar:0.12.0 in the shaded jar.
[INFO] Including io.grpc:grpc-core:jar:0.12.0 in the shaded jar.
[INFO] Including io.grpc:grpc-okhttp:jar:0.12.0 in the shaded jar.
[INFO] Including com.squareup.okio:okio:jar:1.6.0 in the shaded jar.
[INFO] Including com.squareup.okhttp:okhttp:jar:2.5.0 in the shaded jar.
[INFO] Including io.grpc:grpc-protobuf-nano:jar:0.12.0 in the shaded jar.
[INFO] Including com.google.protobuf.nano:protobuf-javanano:jar:3.0.0-alpha-4 in the shaded
jar.
[INFO] Including io.grpc:grpc-netty:jar:0.12.0 in the shaded jar.
[INFO] Including io.netty:netty-codec-http2:jar:4.1.0.Beta8 in the shaded jar.
[INFO] Including io.netty:netty-codec-http:jar:4.1.0.Beta8 in the shaded jar.
[INFO] Including com.twitter:hpack:jar:0.10.1 in the shaded jar.
[INFO] Including io.grpc:grpc-protobuf:jar:0.12.0 in the shaded jar.
[INFO] Including io.grpc:grpc-stub:jar:0.12.0 in the shaded jar.
[INFO] Including io.grpc:grpc-auth:jar:0.12.0 in the shaded jar.
[INFO] Including com.google.auth:google-auth-library-oauth2-http:jar:0.3.1 in the shaded jar.
[INFO] Including com.google.auth:google-auth-library-credentials:jar:0.3.1 in the shaded jar.
[INFO] Including io.netty:netty-handler:jar:4.1.0.Beta8 in the shaded jar.
[INFO] Including io.netty:netty-buffer:jar:4.1.0.Beta8 in the shaded jar.
[INFO] Including io.netty:netty-common:jar:4.1.0.Beta8 in the shaded jar.
[INFO] Including io.netty:netty-transport:jar:4.1.0.Beta8 in the shaded jar.
[INFO] Including io.netty:netty-resolver:jar:4.1.0.Beta8 in the shaded jar.
[INFO] Including io.netty:netty-codec:jar:4.1.0.Beta8 in the shaded jar.
[INFO] Including com.google.api.grpc:grpc-pubsub-v1:jar:0.0.2 in the shaded jar.
[INFO] Including com.google.api.grpc:grpc-core-proto:jar:0.0.3 in the shaded jar.
[INFO] Including com.google.api-client:google-api-client:jar:1.21.0 in the shaded jar.
[INFO] Including com.google.apis:google-api-services-bigquery:jar:v2-rev292-1.21.0 in the
shaded jar.
[INFO] Including com.google.apis:google-api-services-pubsub:jar:v1-rev7-1.21.0 in the shaded
jar.
[INFO] Including com.google.apis:google-api-services-storage:jar:v1-rev53-1.21.0 in the shaded
jar.
[INFO] Including com.google.http-client:google-http-client:jar:1.21.0 in the shaded jar.
[INFO] Including org.apache.httpcomponents:httpclient:jar:4.0.1 in the shaded jar.
[INFO] Including org.apache.httpcomponents:httpcore:jar:4.0.1 in the shaded jar.
[INFO] Including commons-logging:commons-logging:jar:1.1.1 in the shaded jar.
[INFO] Including com.google.http-client:google-http-client-jackson:jar:1.21.0 in the shaded
jar.
[INFO] Including com.google.http-client:google-http-client-jackson2:jar:1.21.0 in the shaded
jar.
[INFO] Including com.google.http-client:google-http-client-protobuf:jar:1.21.0 in the shaded
jar.
[INFO] Including com.google.oauth-client:google-oauth-client-java6:jar:1.21.0 in the shaded
jar.
[INFO] Including com.google.oauth-client:google-oauth-client:jar:1.21.0 in the shaded jar.
[INFO] Including com.google.apis:google-api-services-datastore-protobuf:jar:v1beta2-rev1-4.0.0
in the shaded jar.
[INFO] Including com.google.cloud.bigdataoss:gcsio:jar:1.4.3 in the shaded jar.
[INFO] Including com.google.api-client:google-api-client-java6:jar:1.20.0 in the shaded jar.
[INFO] Including com.google.api-client:google-api-client-jackson2:jar:1.20.0 in the shaded
jar.
[INFO] Including com.google.cloud.bigdataoss:util:jar:1.4.3 in the shaded jar.
[INFO] Including com.google.protobuf:protobuf-java:jar:3.0.0-beta-1 in the shaded jar.
[INFO] Including com.fasterxml.jackson.core:jackson-core:jar:2.7.2 in the shaded jar.
[INFO] Including com.fasterxml.jackson.core:jackson-annotations:jar:2.7.2 in the shaded jar.
[INFO] Including org.apache.avro:avro:jar:1.7.7 in the shaded jar.
[INFO] Including com.thoughtworks.paranamer:paranamer:jar:2.3 in the shaded jar.
[INFO] Including org.apache.commons:commons-compress:jar:1.9 in the shaded jar.
[INFO] Including joda-time:joda-time:jar:2.4 in the shaded jar.
[INFO] Including org.apache.beam:java-examples-all:jar:0.1.0-incubating-SNAPSHOT in the shaded
jar.
[INFO] Including org.apache.beam:google-cloud-dataflow-java-runner:jar:0.1.0-incubating-SNAPSHOT
in the shaded jar.
[INFO] Including com.google.apis:google-api-services-clouddebugger:jar:v2-rev6-1.21.0 in the
shaded jar.
[INFO] Including com.google.apis:google-api-services-dataflow:jar:v1b3-rev22-1.21.0 in the
shaded jar.
[INFO] Including javax.servlet:javax.servlet-api:jar:3.1.0 in the shaded jar.
[INFO] Including org.apache.avro:avro-mapred:jar:hadoop2:1.7.7 in the shaded jar.
[INFO] Including org.apache.avro:avro-ipc:jar:1.7.7 in the shaded jar.
[INFO] Including org.mortbay.jetty:jetty:jar:6.1.26 in the shaded jar.
[INFO] Including org.mortbay.jetty:jetty-util:jar:6.1.26 in the shaded jar.
[INFO] Including org.apache.velocity:velocity:jar:1.7 in the shaded jar.
[INFO] Including commons-collections:commons-collections:jar:3.2.1 in the shaded jar.
[INFO] Including org.apache.avro:avro-ipc:jar:tests:1.7.7 in the shaded jar.
[INFO] Including org.codehaus.jackson:jackson-core-asl:jar:1.9.13 in the shaded jar.
[INFO] Including org.codehaus.jackson:jackson-mapper-asl:jar:1.9.13 in the shaded jar.
[WARNING] grpc-netty-0.12.0.jar, grpc-all-0.12.0.jar define 80 overlapping classes: 
[WARNING]   - io.grpc.netty.AbstractNettyHandler
[WARNING]   - io.grpc.netty.NettyClientTransport
[WARNING]   - io.grpc.netty.NettyClientStream$1
[WARNING]   - io.grpc.netty.SendResponseHeadersCommand
[WARNING]   - io.grpc.netty.NettyServer$2
[WARNING]   - io.grpc.netty.NettyClientHandler$4
[WARNING]   - io.grpc.netty.NettyClientTransport$3
[WARNING]   - io.grpc.netty.ProtocolNegotiators$1$1
[WARNING]   - io.grpc.netty.NettyClientHandler$FrameListener
[WARNING]   - io.grpc.netty.ProtocolNegotiators$1
[WARNING]   - 70 more...
[WARNING] grpc-protobuf-nano-0.12.0.jar, grpc-all-0.12.0.jar define 4 overlapping classes:

[WARNING]   - io.grpc.protobuf.nano.NanoProtoInputStream
[WARNING]   - io.grpc.protobuf.nano.NanoUtils
[WARNING]   - io.grpc.protobuf.nano.NanoUtils$1
[WARNING]   - io.grpc.protobuf.nano.MessageNanoFactory
[WARNING] grpc-all-0.12.0.jar, grpc-stub-0.12.0.jar define 29 overlapping classes: 
[WARNING]   - io.grpc.stub.ServerCalls$UnaryRequestMethod
[WARNING]   - io.grpc.stub.StreamObserver
[WARNING]   - io.grpc.stub.ClientCalls$CallToStreamObserverAdapter
[WARNING]   - io.grpc.stub.ServerCalls$EmptyServerCallListener
[WARNING]   - io.grpc.stub.MetadataUtils$2$1
[WARNING]   - io.grpc.stub.MetadataUtils$1$1
[WARNING]   - io.grpc.stub.MetadataUtils$2$1$1
[WARNING]   - io.grpc.stub.MetadataUtils
[WARNING]   - io.grpc.stub.ServerCalls$1
[WARNING]   - io.grpc.stub.ServerCalls$ClientStreamingMethod
[WARNING]   - 19 more...
[WARNING] grpc-protobuf-0.12.0.jar, grpc-all-0.12.0.jar define 4 overlapping classes: 
[WARNING]   - io.grpc.protobuf.ProtoUtils$2
[WARNING]   - io.grpc.protobuf.ProtoUtils
[WARNING]   - io.grpc.protobuf.ProtoUtils$1
[WARNING]   - io.grpc.protobuf.ProtoInputStream
[WARNING] grpc-okhttp-0.12.0.jar, grpc-all-0.12.0.jar define 76 overlapping classes: 
[WARNING]   - io.grpc.okhttp.OkHttpSettingsUtil
[WARNING]   - io.grpc.okhttp.AsyncFrameWriter$12
[WARNING]   - io.grpc.okhttp.NegotiationType
[WARNING]   - io.grpc.okhttp.OkHttpTlsUpgrader
[WARNING]   - io.grpc.okhttp.Utils
[WARNING]   - io.grpc.okhttp.AsyncFrameWriter$WriteRunnable
[WARNING]   - io.grpc.okhttp.OkHttpProtocolNegotiator$AndroidNegotiator
[WARNING]   - io.grpc.okhttp.OkHttpChannelBuilder$2
[WARNING]   - io.grpc.okhttp.internal.framed.Huffman$Node
[WARNING]   - io.grpc.okhttp.AsyncFrameWriter$7
[WARNING]   - 66 more...
[WARNING] grpc-auth-0.12.0.jar, grpc-all-0.12.0.jar define 2 overlapping classes: 
[WARNING]   - io.grpc.auth.ClientAuthInterceptor$1
[WARNING]   - io.grpc.auth.ClientAuthInterceptor
[WARNING] java-sdk-all-0.1.0-incubating-SNAPSHOT.jar, google-cloud-dataflow-java-runner-0.1.0-incubating-SNAPSHOT.jar
define 1717 overlapping classes: 
[WARNING]   - org.apache.beam.sdk.repackaged.com.google.common.collect.TreeRangeSet$ComplementRangesByLowerBound$2
[WARNING]   - org.apache.beam.sdk.repackaged.com.google.common.collect.WellBehavedMap$EntrySet$1$1
[WARNING]   - org.apache.beam.sdk.repackaged.com.google.common.util.concurrent.CycleDetectingLockFactory$Policies$1
[WARNING]   - org.apache.beam.sdk.repackaged.com.google.common.collect.Maps$6
[WARNING]   - org.apache.beam.sdk.repackaged.com.google.common.primitives.UnsignedBytes$LexicographicalComparatorHolder$UnsafeComparator$1
[WARNING]   - org.apache.beam.sdk.repackaged.com.google.common.collect.Range$1
[WARNING]   - org.apache.beam.sdk.repackaged.com.google.common.collect.Collections2$OrderedPermutationCollection
[WARNING]   - org.apache.beam.sdk.repackaged.com.google.common.base.Splitter$2
[WARNING]   - org.apache.beam.sdk.repackaged.com.google.common.base.Equivalence$Identity
[WARNING]   - org.apache.beam.sdk.repackaged.com.google.common.collect.Lists$1
[WARNING]   - 1707 more...
[WARNING] grpc-core-0.12.0.jar, grpc-all-0.12.0.jar define 248 overlapping classes: 
[WARNING]   - io.grpc.ClientInterceptors$1
[WARNING]   - io.grpc.internal.AbstractReferenceCounted
[WARNING]   - io.grpc.inprocess.InProcessTransport
[WARNING]   - io.grpc.internal.ServerImpl
[WARNING]   - io.grpc.internal.MessageFramer$OutputStreamAdapter
[WARNING]   - io.grpc.internal.ReadableBuffers$BufferInputStream
[WARNING]   - io.grpc.internal.SerializingExecutor$TaskRunner
[WARNING]   - io.grpc.internal.SharedResourceHolder$ScheduledExecutorFactory
[WARNING]   - io.grpc.internal.ContextRunnable
[WARNING]   - io.grpc.NameResolver
[WARNING]   - 238 more...
[WARNING] maven-shade-plugin has detected that some class files are
[WARNING] present in two or more JARs. When this happens, only one
[WARNING] single version of the class is copied to the uber jar.
[WARNING] Usually this is not harmful and you can skip these warnings,
[WARNING] otherwise try to manually exclude artifacts based on
[WARNING] mvn dependency:tree -Ddetail=true and the above output.
[WARNING] See http://docs.codehaus.org/display/MAVENUSER/Shade+Plugin
[INFO] Attaching shaded artifact.
[INFO] 
[INFO] --- maven-surefire-plugin:2.19.1:test (runnable-on-service-tests) @ spark-runner ---
[INFO] Tests are skipped.
[INFO] 
[INFO] --- maven-checkstyle-plugin:2.17:check (default) @ spark-runner ---
[INFO] Starting audit...
[ERROR] <https://builds.apache.org/job/beam_PostCommit_MavenVerify/org.apache.beam$spark-runner/ws/src/main/java/org/apache/beam/runners/spark/io/KafkaIO.java>:31:
Import kafka.serializer.Decoder appears after other imports that it should precede [ImportOrder]
[ERROR] <https://builds.apache.org/job/beam_PostCommit_MavenVerify/org.apache.beam$spark-runner/ws/src/main/java/org/apache/beam/runners/spark/coders/CoderHelpers.java>:35:
Import scala.Tuple2 appears after other imports that it should precede [ImportOrder]
[ERROR] <https://builds.apache.org/job/beam_PostCommit_MavenVerify/org.apache.beam$spark-runner/ws/src/main/java/org/apache/beam/runners/spark/translation/MultiDoFnFunction.java>:37:
Import scala.Tuple2 appears after other imports that it should precede [ImportOrder]
[ERROR] <https://builds.apache.org/job/beam_PostCommit_MavenVerify/org.apache.beam$spark-runner/ws/src/main/java/org/apache/beam/runners/spark/translation/TransformTranslator.java>:87:
Import scala.Tuple2 appears after other imports that it should precede [ImportOrder]
[ERROR] <https://builds.apache.org/job/beam_PostCommit_MavenVerify/org.apache.beam$spark-runner/ws/src/main/java/org/apache/beam/runners/spark/translation/streaming/StreamingTransformTranslator.java>:73:
Import kafka.serializer.Decoder appears after other imports that it should precede [ImportOrder]
[ERROR] <https://builds.apache.org/job/beam_PostCommit_MavenVerify/org.apache.beam$spark-runner/ws/src/test/java/org/apache/beam/runners/spark/translation/streaming/KafkaStreamingTest.java>:57:
Import kafka.serializer.StringDecoder appears after other imports that it should precede [ImportOrder]
[ERROR] <https://builds.apache.org/job/beam_PostCommit_MavenVerify/org.apache.beam$spark-runner/ws/src/test/java/org/apache/beam/runners/spark/translation/streaming/utils/EmbeddedKafkaCluster.java>:37:
Import kafka.server.KafkaConfig appears after other imports that it should precede [ImportOrder]
Audit done.
[INFO] There are 7 errors reported by Checkstyle 6.17 with beam/checkstyle.xml ruleset.
[ERROR] src/main/java/org/apache/beam/runners/spark/io/KafkaIO.java:[31] (imports) ImportOrder:
Import kafka.serializer.Decoder appears after other imports that it should precede
[ERROR] src/main/java/org/apache/beam/runners/spark/coders/CoderHelpers.java:[35] (imports)
ImportOrder: Import scala.Tuple2 appears after other imports that it should precede
[ERROR] src/main/java/org/apache/beam/runners/spark/translation/MultiDoFnFunction.java:[37]
(imports) ImportOrder: Import scala.Tuple2 appears after other imports that it should precede
[ERROR] src/main/java/org/apache/beam/runners/spark/translation/TransformTranslator.java:[87]
(imports) ImportOrder: Import scala.Tuple2 appears after other imports that it should precede
[ERROR] src/main/java/org/apache/beam/runners/spark/translation/streaming/StreamingTransformTranslator.java:[73]
(imports) ImportOrder: Import kafka.serializer.Decoder appears after other imports that it
should precede
[ERROR] src/test/java/org/apache/beam/runners/spark/translation/streaming/KafkaStreamingTest.java:[57]
(imports) ImportOrder: Import kafka.serializer.StringDecoder appears after other imports that
it should precede
[ERROR] src/test/java/org/apache/beam/runners/spark/translation/streaming/utils/EmbeddedKafkaCluster.java:[37]
(imports) ImportOrder: Import kafka.server.KafkaConfig appears after other imports that it
should precede

Mime
View raw message