beam-commits mailing list archives

Site index · List index
Message view « Date » · « Thread »
Top « Date » · « Thread »
From Apache Jenkins Server <jenk...@builds.apache.org>
Subject Build failed in Jenkins: beam_PostCommit_MavenVerify #484
Date Tue, 24 May 2016 02:05:57 GMT
See <https://builds.apache.org/job/beam_PostCommit_MavenVerify/484/changes>

Changes:

[davor] Update Flink runner's pom.xml

[davor] Update Flink runner's pom.xml

[davor] Update Java 8 examples' pom.xml file

------------------------------------------
[...truncated 3564 lines...]
   * <p/>
     ^
<https://builds.apache.org/job/beam_PostCommit_MavenVerify/ws/runners/flink/runner/src/main/java/org/apache/beam/runners/flink/translation/wrappers/streaming/FlinkGroupAlsoByWindowWrapper.java>:149:
warning: no @param for <K>
  public static <K, VIN, VACC, VOUT> DataStream<WindowedValue<KV<K, VOUT>>>
create(
                                                                            ^
<https://builds.apache.org/job/beam_PostCommit_MavenVerify/ws/runners/flink/runner/src/main/java/org/apache/beam/runners/flink/translation/wrappers/streaming/FlinkGroupAlsoByWindowWrapper.java>:149:
warning: no @param for <VIN>
  public static <K, VIN, VACC, VOUT> DataStream<WindowedValue<KV<K, VOUT>>>
create(
                                                                            ^
<https://builds.apache.org/job/beam_PostCommit_MavenVerify/ws/runners/flink/runner/src/main/java/org/apache/beam/runners/flink/translation/wrappers/streaming/FlinkGroupAlsoByWindowWrapper.java>:149:
warning: no @param for <VACC>
  public static <K, VIN, VACC, VOUT> DataStream<WindowedValue<KV<K, VOUT>>>
create(
                                                                            ^
<https://builds.apache.org/job/beam_PostCommit_MavenVerify/ws/runners/flink/runner/src/main/java/org/apache/beam/runners/flink/translation/wrappers/streaming/FlinkGroupAlsoByWindowWrapper.java>:149:
warning: no @param for <VOUT>
  public static <K, VIN, VACC, VOUT> DataStream<WindowedValue<KV<K, VOUT>>>
create(
                                                                            ^
<https://builds.apache.org/job/beam_PostCommit_MavenVerify/ws/runners/flink/runner/src/main/java/org/apache/beam/runners/flink/translation/wrappers/streaming/FlinkGroupAlsoByWindowWrapper.java>:149:
warning: no @return
  public static <K, VIN, VACC, VOUT> DataStream<WindowedValue<KV<K, VOUT>>>
create(
                                                                            ^
<https://builds.apache.org/job/beam_PostCommit_MavenVerify/ws/runners/flink/runner/src/main/java/org/apache/beam/runners/flink/translation/wrappers/streaming/FlinkGroupAlsoByWindowWrapper.java>:180:
error: self-closing element not allowed
   * <p/>
     ^
<https://builds.apache.org/job/beam_PostCommit_MavenVerify/ws/runners/flink/runner/src/main/java/org/apache/beam/runners/flink/translation/wrappers/streaming/FlinkGroupAlsoByWindowWrapper.java>:189:
warning: no @param for <K>
  public static <K, VIN> DataStream<WindowedValue<KV<K, Iterable<VIN>>>>
createForIterable(
                                                                         ^
<https://builds.apache.org/job/beam_PostCommit_MavenVerify/ws/runners/flink/runner/src/main/java/org/apache/beam/runners/flink/translation/wrappers/streaming/FlinkGroupAlsoByWindowWrapper.java>:189:
warning: no @param for <VIN>
  public static <K, VIN> DataStream<WindowedValue<KV<K, Iterable<VIN>>>>
createForIterable(
                                                                         ^
<https://builds.apache.org/job/beam_PostCommit_MavenVerify/ws/runners/flink/runner/src/main/java/org/apache/beam/runners/flink/translation/wrappers/streaming/FlinkGroupAlsoByWindowWrapper.java>:189:
warning: no @return
  public static <K, VIN> DataStream<WindowedValue<KV<K, Iterable<VIN>>>>
createForIterable(
                                                                         ^
<https://builds.apache.org/job/beam_PostCommit_MavenVerify/ws/runners/flink/runner/src/main/java/org/apache/beam/runners/flink/translation/wrappers/streaming/FlinkGroupAlsoByWindowWrapper.java>:86:
error: reference not found
 * ({@link org.apache.beam.runners.core.GroupAlsoByWindowsDoFn}.
           ^
<https://builds.apache.org/job/beam_PostCommit_MavenVerify/ws/runners/flink/runner/src/main/java/org/apache/beam/runners/flink/translation/wrappers/streaming/FlinkGroupAlsoByWindowWrapper.java>:87:
error: self-closing element not allowed
 * <p/>
   ^
<https://builds.apache.org/job/beam_PostCommit_MavenVerify/ws/runners/flink/runner/src/main/java/org/apache/beam/runners/flink/translation/wrappers/streaming/FlinkGroupAlsoByWindowWrapper.java>:94:
error: self-closing element not allowed
 * <p/>
   ^
<https://builds.apache.org/job/beam_PostCommit_MavenVerify/ws/runners/flink/runner/src/main/java/org/apache/beam/runners/flink/translation/wrappers/streaming/FlinkGroupAlsoByWindowWrapper.java>:98:
error: reference not found
 * list, and are fed into the {@link org.apache.beam.runners.core.GroupAlsoByWindowsDoFn}
                                     ^
<https://builds.apache.org/job/beam_PostCommit_MavenVerify/ws/runners/flink/runner/src/main/java/org/apache/beam/runners/flink/translation/wrappers/streaming/io/UnboundedSourceWrapper.java>:375:
warning: no @return
  public List<? extends UnboundedSource<OutputT, CheckpointMarkT>> getSplitSources()
{
                                                                   ^

Command line was: /home/jenkins/jenkins-slave/tools/hudson.model.JDK/jdk1.8.0_66/jre/../bin/javadoc
@options @packages

Refer to the generated Javadoc files in '<https://builds.apache.org/job/beam_PostCommit_MavenVerify/ws/runners/flink/runner/target/apidocs'>
dir.

	at org.apache.maven.plugin.javadoc.AbstractJavadocMojo.failOnError(AbstractJavadocMojo.java:6018)
	at org.apache.maven.plugin.javadoc.JavadocJar.execute(JavadocJar.java:192)
	at org.apache.maven.plugin.DefaultBuildPluginManager.executeMojo(DefaultBuildPluginManager.java:134)
	at org.apache.maven.lifecycle.internal.MojoExecutor.execute(MojoExecutor.java:208)
	... 31 more
Caused by: org.apache.maven.reporting.MavenReportException: 
Exit code: 1 - <https://builds.apache.org/job/beam_PostCommit_MavenVerify/ws/runners/flink/runner/src/main/java/org/apache/beam/runners/flink/FlinkPipelineExecutionEnvironment.java>:124:
warning: no @param for pipeline
  public void translate(Pipeline pipeline) {
              ^
<https://builds.apache.org/job/beam_PostCommit_MavenVerify/ws/runners/flink/runner/src/main/java/org/apache/beam/runners/flink/FlinkPipelineExecutionEnvironment.java>:138:
warning: no @return
  public JobExecutionResult executePipeline() throws Exception {
                            ^
<https://builds.apache.org/job/beam_PostCommit_MavenVerify/ws/runners/flink/runner/src/main/java/org/apache/beam/runners/flink/FlinkPipelineExecutionEnvironment.java>:138:
warning: no @throws for java.lang.Exception
  public JobExecutionResult executePipeline() throws Exception {
                            ^
<https://builds.apache.org/job/beam_PostCommit_MavenVerify/ws/runners/flink/runner/src/main/java/org/apache/beam/runners/flink/FlinkPipelineOptions.java>:51:
warning: no @return
  List<String> getFilesToStage();
               ^
<https://builds.apache.org/job/beam_PostCommit_MavenVerify/ws/runners/flink/runner/src/main/java/org/apache/beam/runners/flink/FlinkPipelineOptions.java>:60:
warning: no @return
  String getJobName();
         ^
<https://builds.apache.org/job/beam_PostCommit_MavenVerify/ws/runners/flink/runner/src/main/java/org/apache/beam/runners/flink/FlinkPipelineOptions.java>:73:
warning: no @return
  String getFlinkMaster();
         ^
<https://builds.apache.org/job/beam_PostCommit_MavenVerify/ws/runners/flink/runner/src/main/java/org/apache/beam/runners/flink/FlinkPipelineRunner.java>:137:
warning: no @return
  public FlinkPipelineOptions getPipelineOptions() {
                              ^
<https://builds.apache.org/job/beam_PostCommit_MavenVerify/ws/runners/flink/runner/src/main/java/org/apache/beam/runners/flink/FlinkPipelineRunner.java>:47:
warning: empty <p> tag
 * <p>
   ^
<https://builds.apache.org/job/beam_PostCommit_MavenVerify/ws/runners/flink/runner/src/main/java/org/apache/beam/runners/flink/translation/FlinkBatchTranslationContext.java>:101:
warning: no description for @param
   * @param currentTransform
     ^
<https://builds.apache.org/job/beam_PostCommit_MavenVerify/ws/runners/flink/runner/src/main/java/org/apache/beam/runners/flink/translation/FlinkStreamingPipelineTranslator.java>:35:
error: reference not found
 * This is based on {@link org.apache.beam.runners.dataflow.DataflowPipelineTranslator}
                           ^
<https://builds.apache.org/job/beam_PostCommit_MavenVerify/ws/runners/flink/runner/src/main/java/org/apache/beam/runners/flink/translation/FlinkStreamingTranslationContext.java>:85:
warning: no description for @param
   * @param currentTransform
     ^
<https://builds.apache.org/job/beam_PostCommit_MavenVerify/ws/runners/flink/runner/src/main/java/org/apache/beam/runners/flink/translation/types/InspectableByteArrayOutputStream.java>:31:
warning: no @return
  public byte[] getBuffer() {
                ^
<https://builds.apache.org/job/beam_PostCommit_MavenVerify/ws/runners/flink/runner/src/main/java/org/apache/beam/runners/flink/translation/wrappers/streaming/FlinkGroupAlsoByWindowWrapper.java>:137:
error: self-closing element not allowed
   * <p/>
     ^
<https://builds.apache.org/job/beam_PostCommit_MavenVerify/ws/runners/flink/runner/src/main/java/org/apache/beam/runners/flink/translation/wrappers/streaming/FlinkGroupAlsoByWindowWrapper.java>:149:
warning: no @param for <K>
  public static <K, VIN, VACC, VOUT> DataStream<WindowedValue<KV<K, VOUT>>>
create(
                                                                            ^
<https://builds.apache.org/job/beam_PostCommit_MavenVerify/ws/runners/flink/runner/src/main/java/org/apache/beam/runners/flink/translation/wrappers/streaming/FlinkGroupAlsoByWindowWrapper.java>:149:
warning: no @param for <VIN>
  public static <K, VIN, VACC, VOUT> DataStream<WindowedValue<KV<K, VOUT>>>
create(
                                                                            ^
<https://builds.apache.org/job/beam_PostCommit_MavenVerify/ws/runners/flink/runner/src/main/java/org/apache/beam/runners/flink/translation/wrappers/streaming/FlinkGroupAlsoByWindowWrapper.java>:149:
warning: no @param for <VACC>
  public static <K, VIN, VACC, VOUT> DataStream<WindowedValue<KV<K, VOUT>>>
create(
                                                                            ^
<https://builds.apache.org/job/beam_PostCommit_MavenVerify/ws/runners/flink/runner/src/main/java/org/apache/beam/runners/flink/translation/wrappers/streaming/FlinkGroupAlsoByWindowWrapper.java>:149:
warning: no @param for <VOUT>
  public static <K, VIN, VACC, VOUT> DataStream<WindowedValue<KV<K, VOUT>>>
create(
                                                                            ^
<https://builds.apache.org/job/beam_PostCommit_MavenVerify/ws/runners/flink/runner/src/main/java/org/apache/beam/runners/flink/translation/wrappers/streaming/FlinkGroupAlsoByWindowWrapper.java>:149:
warning: no @return
  public static <K, VIN, VACC, VOUT> DataStream<WindowedValue<KV<K, VOUT>>>
create(
                                                                            ^
<https://builds.apache.org/job/beam_PostCommit_MavenVerify/ws/runners/flink/runner/src/main/java/org/apache/beam/runners/flink/translation/wrappers/streaming/FlinkGroupAlsoByWindowWrapper.java>:180:
error: self-closing element not allowed
   * <p/>
     ^
<https://builds.apache.org/job/beam_PostCommit_MavenVerify/ws/runners/flink/runner/src/main/java/org/apache/beam/runners/flink/translation/wrappers/streaming/FlinkGroupAlsoByWindowWrapper.java>:189:
warning: no @param for <K>
  public static <K, VIN> DataStream<WindowedValue<KV<K, Iterable<VIN>>>>
createForIterable(
                                                                         ^
<https://builds.apache.org/job/beam_PostCommit_MavenVerify/ws/runners/flink/runner/src/main/java/org/apache/beam/runners/flink/translation/wrappers/streaming/FlinkGroupAlsoByWindowWrapper.java>:189:
warning: no @param for <VIN>
  public static <K, VIN> DataStream<WindowedValue<KV<K, Iterable<VIN>>>>
createForIterable(
                                                                         ^
<https://builds.apache.org/job/beam_PostCommit_MavenVerify/ws/runners/flink/runner/src/main/java/org/apache/beam/runners/flink/translation/wrappers/streaming/FlinkGroupAlsoByWindowWrapper.java>:189:
warning: no @return
  public static <K, VIN> DataStream<WindowedValue<KV<K, Iterable<VIN>>>>
createForIterable(
                                                                         ^
<https://builds.apache.org/job/beam_PostCommit_MavenVerify/ws/runners/flink/runner/src/main/java/org/apache/beam/runners/flink/translation/wrappers/streaming/FlinkGroupAlsoByWindowWrapper.java>:86:
error: reference not found
 * ({@link org.apache.beam.runners.core.GroupAlsoByWindowsDoFn}.
           ^
<https://builds.apache.org/job/beam_PostCommit_MavenVerify/ws/runners/flink/runner/src/main/java/org/apache/beam/runners/flink/translation/wrappers/streaming/FlinkGroupAlsoByWindowWrapper.java>:87:
error: self-closing element not allowed
 * <p/>
   ^
<https://builds.apache.org/job/beam_PostCommit_MavenVerify/ws/runners/flink/runner/src/main/java/org/apache/beam/runners/flink/translation/wrappers/streaming/FlinkGroupAlsoByWindowWrapper.java>:94:
error: self-closing element not allowed
 * <p/>
   ^
<https://builds.apache.org/job/beam_PostCommit_MavenVerify/ws/runners/flink/runner/src/main/java/org/apache/beam/runners/flink/translation/wrappers/streaming/FlinkGroupAlsoByWindowWrapper.java>:98:
error: reference not found
 * list, and are fed into the {@link org.apache.beam.runners.core.GroupAlsoByWindowsDoFn}
                                     ^
<https://builds.apache.org/job/beam_PostCommit_MavenVerify/ws/runners/flink/runner/src/main/java/org/apache/beam/runners/flink/translation/wrappers/streaming/io/UnboundedSourceWrapper.java>:375:
warning: no @return
  public List<? extends UnboundedSource<OutputT, CheckpointMarkT>> getSplitSources()
{
                                                                   ^

Command line was: /home/jenkins/jenkins-slave/tools/hudson.model.JDK/jdk1.8.0_66/jre/../bin/javadoc
@options @packages

Refer to the generated Javadoc files in '<https://builds.apache.org/job/beam_PostCommit_MavenVerify/ws/runners/flink/runner/target/apidocs'>
dir.

	at org.apache.maven.plugin.javadoc.AbstractJavadocMojo.executeJavadocCommandLine(AbstractJavadocMojo.java:5163)
	at org.apache.maven.plugin.javadoc.AbstractJavadocMojo.executeReport(AbstractJavadocMojo.java:2075)
	at org.apache.maven.plugin.javadoc.JavadocJar.execute(JavadocJar.java:188)
	... 33 more
[ERROR] 
[ERROR] Re-run Maven using the -X switch to enable full debug logging.
[ERROR] 
[ERROR] For more information about the errors and possible solutions, please read the following
articles:
[ERROR] [Help 1] http://cwiki.apache.org/confluence/display/MAVEN/MojoExecutionException
[ERROR] 
[ERROR] After correcting the problems, you can resume the build with the command
[ERROR]   mvn <goals> -rf :flink-runner_2.10
[JENKINS] Archiving <https://builds.apache.org/job/beam_PostCommit_MavenVerify/ws/sdks/java/io/kafka/pom.xml>
to org.apache.beam/kafka/0.1.0-incubating-SNAPSHOT/kafka-0.1.0-incubating-SNAPSHOT.pom
[JENKINS] Archiving <https://builds.apache.org/job/beam_PostCommit_MavenVerify/ws/sdks/java/io/kafka/target/kafka-0.1.0-incubating-SNAPSHOT.jar>
to org.apache.beam/kafka/0.1.0-incubating-SNAPSHOT/kafka-0.1.0-incubating-SNAPSHOT.jar
[JENKINS] Archiving <https://builds.apache.org/job/beam_PostCommit_MavenVerify/ws/sdks/java/io/kafka/target/kafka-0.1.0-incubating-SNAPSHOT-sources.jar>
to org.apache.beam/kafka/0.1.0-incubating-SNAPSHOT/kafka-0.1.0-incubating-SNAPSHOT-sources.jar
[JENKINS] Archiving <https://builds.apache.org/job/beam_PostCommit_MavenVerify/ws/sdks/java/io/kafka/target/kafka-0.1.0-incubating-SNAPSHOT-test-sources.jar>
to org.apache.beam/kafka/0.1.0-incubating-SNAPSHOT/kafka-0.1.0-incubating-SNAPSHOT-test-sources.jar
[JENKINS] Archiving <https://builds.apache.org/job/beam_PostCommit_MavenVerify/ws/sdks/java/io/kafka/target/kafka-0.1.0-incubating-SNAPSHOT-tests.jar>
to org.apache.beam/kafka/0.1.0-incubating-SNAPSHOT/kafka-0.1.0-incubating-SNAPSHOT-tests.jar
No artifacts from beam_PostCommit_MavenVerify » Apache Beam :: SDKs :: Java :: IO :: Kafka
#483 to compare, so performing full copy of artifacts
[JENKINS] Archiving <https://builds.apache.org/job/beam_PostCommit_MavenVerify/ws/examples/java/pom.xml>
to org.apache.beam/java-examples-all/0.1.0-incubating-SNAPSHOT/java-examples-all-0.1.0-incubating-SNAPSHOT.pom
[JENKINS] Archiving <https://builds.apache.org/job/beam_PostCommit_MavenVerify/ws/examples/java/target/java-examples-all-0.1.0-incubating-SNAPSHOT.jar>
to org.apache.beam/java-examples-all/0.1.0-incubating-SNAPSHOT/java-examples-all-0.1.0-incubating-SNAPSHOT.jar
[JENKINS] Archiving <https://builds.apache.org/job/beam_PostCommit_MavenVerify/ws/examples/java/target/java-examples-all-0.1.0-incubating-SNAPSHOT-sources.jar>
to org.apache.beam/java-examples-all/0.1.0-incubating-SNAPSHOT/java-examples-all-0.1.0-incubating-SNAPSHOT-sources.jar
[JENKINS] Archiving <https://builds.apache.org/job/beam_PostCommit_MavenVerify/ws/examples/java/target/java-examples-all-0.1.0-incubating-SNAPSHOT-test-sources.jar>
to org.apache.beam/java-examples-all/0.1.0-incubating-SNAPSHOT/java-examples-all-0.1.0-incubating-SNAPSHOT-test-sources.jar
[JENKINS] Archiving <https://builds.apache.org/job/beam_PostCommit_MavenVerify/ws/examples/java/target/java-examples-all-0.1.0-incubating-SNAPSHOT-javadoc.jar>
to org.apache.beam/java-examples-all/0.1.0-incubating-SNAPSHOT/java-examples-all-0.1.0-incubating-SNAPSHOT-javadoc.jar
[JENKINS] Archiving <https://builds.apache.org/job/beam_PostCommit_MavenVerify/ws/examples/java/target/java-examples-all-0.1.0-incubating-SNAPSHOT-tests.jar>
to org.apache.beam/java-examples-all/0.1.0-incubating-SNAPSHOT/java-examples-all-0.1.0-incubating-SNAPSHOT-tests.jar
No artifacts from beam_PostCommit_MavenVerify » Apache Beam :: Examples :: Java All #483
to compare, so performing full copy of artifacts
[JENKINS] Archiving <https://builds.apache.org/job/beam_PostCommit_MavenVerify/ws/runners/direct-java/dependency-reduced-pom.xml>
to org.apache.beam/direct-runner/0.1.0-incubating-SNAPSHOT/direct-runner-0.1.0-incubating-SNAPSHOT.pom
[JENKINS] Archiving <https://builds.apache.org/job/beam_PostCommit_MavenVerify/ws/runners/direct-java/target/direct-runner-0.1.0-incubating-SNAPSHOT.jar>
to org.apache.beam/direct-runner/0.1.0-incubating-SNAPSHOT/direct-runner-0.1.0-incubating-SNAPSHOT.jar
[JENKINS] Archiving <https://builds.apache.org/job/beam_PostCommit_MavenVerify/ws/runners/direct-java/target/direct-runner-0.1.0-incubating-SNAPSHOT-tests.jar>
to org.apache.beam/direct-runner/0.1.0-incubating-SNAPSHOT/direct-runner-0.1.0-incubating-SNAPSHOT-tests.jar
[JENKINS] Archiving <https://builds.apache.org/job/beam_PostCommit_MavenVerify/ws/runners/direct-java/target/direct-runner-0.1.0-incubating-SNAPSHOT-sources.jar>
to org.apache.beam/direct-runner/0.1.0-incubating-SNAPSHOT/direct-runner-0.1.0-incubating-SNAPSHOT-sources.jar
[JENKINS] Archiving <https://builds.apache.org/job/beam_PostCommit_MavenVerify/ws/runners/direct-java/target/direct-runner-0.1.0-incubating-SNAPSHOT-test-sources.jar>
to org.apache.beam/direct-runner/0.1.0-incubating-SNAPSHOT/direct-runner-0.1.0-incubating-SNAPSHOT-test-sources.jar
[JENKINS] Archiving <https://builds.apache.org/job/beam_PostCommit_MavenVerify/ws/runners/direct-java/target/direct-runner-0.1.0-incubating-SNAPSHOT-javadoc.jar>
to org.apache.beam/direct-runner/0.1.0-incubating-SNAPSHOT/direct-runner-0.1.0-incubating-SNAPSHOT-javadoc.jar
No artifacts from beam_PostCommit_MavenVerify » Apache Beam :: Runners :: Direct #483 to
compare, so performing full copy of artifacts
[JENKINS] Archiving <https://builds.apache.org/job/beam_PostCommit_MavenVerify/ws/runners/google-cloud-dataflow-java/dependency-reduced-pom.xml>
to org.apache.beam/google-cloud-dataflow-java-runner/0.1.0-incubating-SNAPSHOT/google-cloud-dataflow-java-runner-0.1.0-incubating-SNAPSHOT.pom
[JENKINS] Archiving <https://builds.apache.org/job/beam_PostCommit_MavenVerify/ws/runners/google-cloud-dataflow-java/target/google-cloud-dataflow-java-runner-0.1.0-incubating-SNAPSHOT.jar>
to org.apache.beam/google-cloud-dataflow-java-runner/0.1.0-incubating-SNAPSHOT/google-cloud-dataflow-java-runner-0.1.0-incubating-SNAPSHOT.jar
[JENKINS] Archiving <https://builds.apache.org/job/beam_PostCommit_MavenVerify/ws/runners/google-cloud-dataflow-java/target/google-cloud-dataflow-java-runner-0.1.0-incubating-SNAPSHOT-tests.jar>
to org.apache.beam/google-cloud-dataflow-java-runner/0.1.0-incubating-SNAPSHOT/google-cloud-dataflow-java-runner-0.1.0-incubating-SNAPSHOT-tests.jar
[JENKINS] Archiving <https://builds.apache.org/job/beam_PostCommit_MavenVerify/ws/runners/google-cloud-dataflow-java/target/google-cloud-dataflow-java-runner-0.1.0-incubating-SNAPSHOT-sources.jar>
to org.apache.beam/google-cloud-dataflow-java-runner/0.1.0-incubating-SNAPSHOT/google-cloud-dataflow-java-runner-0.1.0-incubating-SNAPSHOT-sources.jar
[JENKINS] Archiving <https://builds.apache.org/job/beam_PostCommit_MavenVerify/ws/runners/google-cloud-dataflow-java/target/google-cloud-dataflow-java-runner-0.1.0-incubating-SNAPSHOT-test-sources.jar>
to org.apache.beam/google-cloud-dataflow-java-runner/0.1.0-incubating-SNAPSHOT/google-cloud-dataflow-java-runner-0.1.0-incubating-SNAPSHOT-test-sources.jar
[JENKINS] Archiving <https://builds.apache.org/job/beam_PostCommit_MavenVerify/ws/runners/google-cloud-dataflow-java/target/google-cloud-dataflow-java-runner-0.1.0-incubating-SNAPSHOT-javadoc.jar>
to org.apache.beam/google-cloud-dataflow-java-runner/0.1.0-incubating-SNAPSHOT/google-cloud-dataflow-java-runner-0.1.0-incubating-SNAPSHOT-javadoc.jar
No artifacts from beam_PostCommit_MavenVerify » Apache Beam :: Runners :: Google Cloud Dataflow
#483 to compare, so performing full copy of artifacts
[JENKINS] Archiving <https://builds.apache.org/job/beam_PostCommit_MavenVerify/ws/runners/core-java/pom.xml>
to org.apache.beam/runners-core/0.1.0-incubating-SNAPSHOT/runners-core-0.1.0-incubating-SNAPSHOT.pom
[JENKINS] Archiving <https://builds.apache.org/job/beam_PostCommit_MavenVerify/ws/runners/core-java/target/runners-core-0.1.0-incubating-SNAPSHOT.jar>
to org.apache.beam/runners-core/0.1.0-incubating-SNAPSHOT/runners-core-0.1.0-incubating-SNAPSHOT.jar
[JENKINS] Archiving <https://builds.apache.org/job/beam_PostCommit_MavenVerify/ws/runners/core-java/target/runners-core-0.1.0-incubating-SNAPSHOT-tests.jar>
to org.apache.beam/runners-core/0.1.0-incubating-SNAPSHOT/runners-core-0.1.0-incubating-SNAPSHOT-tests.jar
[JENKINS] Archiving <https://builds.apache.org/job/beam_PostCommit_MavenVerify/ws/runners/core-java/target/runners-core-0.1.0-incubating-SNAPSHOT-sources.jar>
to org.apache.beam/runners-core/0.1.0-incubating-SNAPSHOT/runners-core-0.1.0-incubating-SNAPSHOT-sources.jar
[JENKINS] Archiving <https://builds.apache.org/job/beam_PostCommit_MavenVerify/ws/runners/core-java/target/runners-core-0.1.0-incubating-SNAPSHOT-test-sources.jar>
to org.apache.beam/runners-core/0.1.0-incubating-SNAPSHOT/runners-core-0.1.0-incubating-SNAPSHOT-test-sources.jar
[JENKINS] Archiving <https://builds.apache.org/job/beam_PostCommit_MavenVerify/ws/runners/core-java/target/runners-core-0.1.0-incubating-SNAPSHOT-javadoc.jar>
to org.apache.beam/runners-core/0.1.0-incubating-SNAPSHOT/runners-core-0.1.0-incubating-SNAPSHOT-javadoc.jar
No artifacts from beam_PostCommit_MavenVerify » Apache Beam :: Runners :: Core #483 to compare,
so performing full copy of artifacts
[JENKINS] Archiving <https://builds.apache.org/job/beam_PostCommit_MavenVerify/ws/sdks/java/build-tools/pom.xml>
to org.apache.beam/java-build-tools/0.1.0-incubating-SNAPSHOT/java-build-tools-0.1.0-incubating-SNAPSHOT.pom
[JENKINS] Archiving <https://builds.apache.org/job/beam_PostCommit_MavenVerify/ws/sdks/java/build-tools/target/java-build-tools-0.1.0-incubating-SNAPSHOT.jar>
to org.apache.beam/java-build-tools/0.1.0-incubating-SNAPSHOT/java-build-tools-0.1.0-incubating-SNAPSHOT.jar
[JENKINS] Archiving <https://builds.apache.org/job/beam_PostCommit_MavenVerify/ws/sdks/java/build-tools/target/java-build-tools-0.1.0-incubating-SNAPSHOT-tests.jar>
to org.apache.beam/java-build-tools/0.1.0-incubating-SNAPSHOT/java-build-tools-0.1.0-incubating-SNAPSHOT-tests.jar
No artifacts from beam_PostCommit_MavenVerify » Apache Beam :: SDKs :: Java :: Build Tools
#483 to compare, so performing full copy of artifacts
[JENKINS] Archiving <https://builds.apache.org/job/beam_PostCommit_MavenVerify/ws/sdks/java/io/pom.xml>
to org.apache.beam/io-parent/0.1.0-incubating-SNAPSHOT/io-parent-0.1.0-incubating-SNAPSHOT.pom
No artifacts from beam_PostCommit_MavenVerify » Apache Beam :: SDKs :: Java :: IO #483 to
compare, so performing full copy of artifacts
[JENKINS] Archiving <https://builds.apache.org/job/beam_PostCommit_MavenVerify/ws/sdks/java/extensions/join-library/pom.xml>
to org.apache.beam/join-library/0.1.0-incubating-SNAPSHOT/join-library-0.1.0-incubating-SNAPSHOT.pom
[JENKINS] Archiving <https://builds.apache.org/job/beam_PostCommit_MavenVerify/ws/sdks/java/extensions/join-library/target/join-library-0.1.0-incubating-SNAPSHOT.jar>
to org.apache.beam/join-library/0.1.0-incubating-SNAPSHOT/join-library-0.1.0-incubating-SNAPSHOT.jar
[JENKINS] Archiving <https://builds.apache.org/job/beam_PostCommit_MavenVerify/ws/sdks/java/extensions/join-library/target/join-library-0.1.0-incubating-SNAPSHOT-sources.jar>
to org.apache.beam/join-library/0.1.0-incubating-SNAPSHOT/join-library-0.1.0-incubating-SNAPSHOT-sources.jar
[JENKINS] Archiving <https://builds.apache.org/job/beam_PostCommit_MavenVerify/ws/sdks/java/extensions/join-library/target/join-library-0.1.0-incubating-SNAPSHOT-test-sources.jar>
to org.apache.beam/join-library/0.1.0-incubating-SNAPSHOT/join-library-0.1.0-incubating-SNAPSHOT-test-sources.jar
[JENKINS] Archiving <https://builds.apache.org/job/beam_PostCommit_MavenVerify/ws/sdks/java/extensions/join-library/target/join-library-0.1.0-incubating-SNAPSHOT-tests.jar>
to org.apache.beam/join-library/0.1.0-incubating-SNAPSHOT/join-library-0.1.0-incubating-SNAPSHOT-tests.jar
No artifacts from beam_PostCommit_MavenVerify » Apache Beam :: SDKs :: Java :: Extensions
:: Join library #483 to compare, so performing full copy of artifacts
[JENKINS] Archiving <https://builds.apache.org/job/beam_PostCommit_MavenVerify/ws/sdks/java/maven-archetypes/examples/pom.xml>
to org.apache.beam/maven-archetypes-examples/0.1.0-incubating-SNAPSHOT/maven-archetypes-examples-0.1.0-incubating-SNAPSHOT.pom
No artifacts from beam_PostCommit_MavenVerify » Apache Beam :: SDKs :: Java :: Maven Archetypes
:: Examples #483 to compare, so performing full copy of artifacts
[JENKINS] Archiving <https://builds.apache.org/job/beam_PostCommit_MavenVerify/ws/sdks/java/pom.xml>
to org.apache.beam/java-sdk-parent/0.1.0-incubating-SNAPSHOT/java-sdk-parent-0.1.0-incubating-SNAPSHOT.pom
No artifacts from beam_PostCommit_MavenVerify » Apache Beam :: SDKs :: Java #483 to compare,
so performing full copy of artifacts
[JENKINS] Archiving <https://builds.apache.org/job/beam_PostCommit_MavenVerify/ws/sdks/java/io/google-cloud-platform/pom.xml>
to org.apache.beam/google-cloud-platform/0.1.0-incubating-SNAPSHOT/google-cloud-platform-0.1.0-incubating-SNAPSHOT.pom
[JENKINS] Archiving <https://builds.apache.org/job/beam_PostCommit_MavenVerify/ws/sdks/java/io/google-cloud-platform/target/google-cloud-platform-0.1.0-incubating-SNAPSHOT.jar>
to org.apache.beam/google-cloud-platform/0.1.0-incubating-SNAPSHOT/google-cloud-platform-0.1.0-incubating-SNAPSHOT.jar
[JENKINS] Archiving <https://builds.apache.org/job/beam_PostCommit_MavenVerify/ws/sdks/java/io/google-cloud-platform/target/google-cloud-platform-0.1.0-incubating-SNAPSHOT-sources.jar>
to org.apache.beam/google-cloud-platform/0.1.0-incubating-SNAPSHOT/google-cloud-platform-0.1.0-incubating-SNAPSHOT-sources.jar
[JENKINS] Archiving <https://builds.apache.org/job/beam_PostCommit_MavenVerify/ws/sdks/java/io/google-cloud-platform/target/google-cloud-platform-0.1.0-incubating-SNAPSHOT-test-sources.jar>
to org.apache.beam/google-cloud-platform/0.1.0-incubating-SNAPSHOT/google-cloud-platform-0.1.0-incubating-SNAPSHOT-test-sources.jar
[JENKINS] Archiving <https://builds.apache.org/job/beam_PostCommit_MavenVerify/ws/sdks/java/io/google-cloud-platform/target/google-cloud-platform-0.1.0-incubating-SNAPSHOT-tests.jar>
to org.apache.beam/google-cloud-platform/0.1.0-incubating-SNAPSHOT/google-cloud-platform-0.1.0-incubating-SNAPSHOT-tests.jar
No artifacts from beam_PostCommit_MavenVerify » Apache Beam :: SDKs :: Java :: IO :: Google
Cloud Platform #483 to compare, so performing full copy of artifacts
[JENKINS] Archiving <https://builds.apache.org/job/beam_PostCommit_MavenVerify/ws/pom.xml>
to org.apache.beam/parent/0.1.0-incubating-SNAPSHOT/parent-0.1.0-incubating-SNAPSHOT.pom
No artifacts from beam_PostCommit_MavenVerify » Apache Beam :: Parent #483 to compare, so
performing full copy of artifacts
[JENKINS] Archiving <https://builds.apache.org/job/beam_PostCommit_MavenVerify/ws/sdks/java/maven-archetypes/starter/pom.xml>
to org.apache.beam/maven-archetypes-starter/0.1.0-incubating-SNAPSHOT/maven-archetypes-starter-0.1.0-incubating-SNAPSHOT.pom
No artifacts from beam_PostCommit_MavenVerify » Apache Beam :: SDKs :: Java :: Maven Archetypes
:: Starter #483 to compare, so performing full copy of artifacts
[JENKINS] Archiving <https://builds.apache.org/job/beam_PostCommit_MavenVerify/ws/sdks/java/maven-archetypes/pom.xml>
to org.apache.beam/maven-archetypes-parent/0.1.0-incubating-SNAPSHOT/maven-archetypes-parent-0.1.0-incubating-SNAPSHOT.pom
No artifacts from beam_PostCommit_MavenVerify » Apache Beam :: SDKs :: Java :: Maven Archetypes
#483 to compare, so performing full copy of artifacts
[JENKINS] Archiving <https://builds.apache.org/job/beam_PostCommit_MavenVerify/ws/runners/flink/runner/pom.xml>
to org.apache.beam/flink-runner_2.10/0.1.0-incubating-SNAPSHOT/flink-runner_2.10-0.1.0-incubating-SNAPSHOT.pom
[JENKINS] Archiving <https://builds.apache.org/job/beam_PostCommit_MavenVerify/ws/runners/flink/runner/target/flink-runner_2.10-0.1.0-incubating-SNAPSHOT.jar>
to org.apache.beam/flink-runner_2.10/0.1.0-incubating-SNAPSHOT/flink-runner_2.10-0.1.0-incubating-SNAPSHOT.jar
[JENKINS] Archiving <https://builds.apache.org/job/beam_PostCommit_MavenVerify/ws/runners/flink/runner/target/flink-runner_2.10-0.1.0-incubating-SNAPSHOT-tests.jar>
to org.apache.beam/flink-runner_2.10/0.1.0-incubating-SNAPSHOT/flink-runner_2.10-0.1.0-incubating-SNAPSHOT-tests.jar
[JENKINS] Archiving <https://builds.apache.org/job/beam_PostCommit_MavenVerify/ws/runners/flink/runner/target/flink-runner_2.10-0.1.0-incubating-SNAPSHOT-sources.jar>
to org.apache.beam/flink-runner_2.10/0.1.0-incubating-SNAPSHOT/flink-runner_2.10-0.1.0-incubating-SNAPSHOT-sources.jar
[JENKINS] Archiving <https://builds.apache.org/job/beam_PostCommit_MavenVerify/ws/runners/flink/runner/target/flink-runner_2.10-0.1.0-incubating-SNAPSHOT-test-sources.jar>
to org.apache.beam/flink-runner_2.10/0.1.0-incubating-SNAPSHOT/flink-runner_2.10-0.1.0-incubating-SNAPSHOT-test-sources.jar
No artifacts from beam_PostCommit_MavenVerify » Apache Beam :: Runners :: Flink :: Core #483
to compare, so performing full copy of artifacts
[JENKINS] Archiving <https://builds.apache.org/job/beam_PostCommit_MavenVerify/ws/examples/pom.xml>
to org.apache.beam/examples-parent/0.1.0-incubating-SNAPSHOT/examples-parent-0.1.0-incubating-SNAPSHOT.pom
No artifacts from beam_PostCommit_MavenVerify » Apache Beam :: Examples #483 to compare,
so performing full copy of artifacts
[JENKINS] Archiving <https://builds.apache.org/job/beam_PostCommit_MavenVerify/ws/runners/flink/examples/pom.xml>
to org.apache.beam/flink-runner-examples_2.10/0.1.0-incubating-SNAPSHOT/flink-runner-examples_2.10-0.1.0-incubating-SNAPSHOT.pom
No artifacts from beam_PostCommit_MavenVerify » Apache Beam :: Runners :: Flink :: Examples
#483 to compare, so performing full copy of artifacts
[JENKINS] Archiving <https://builds.apache.org/job/beam_PostCommit_MavenVerify/ws/sdks/pom.xml>
to org.apache.beam/sdks-parent/0.1.0-incubating-SNAPSHOT/sdks-parent-0.1.0-incubating-SNAPSHOT.pom
No artifacts from beam_PostCommit_MavenVerify » Apache Beam :: SDKs #483 to compare, so performing
full copy of artifacts
[JENKINS] Archiving <https://builds.apache.org/job/beam_PostCommit_MavenVerify/ws/sdks/java/extensions/pom.xml>
to org.apache.beam/extensions-parent/0.1.0-incubating-SNAPSHOT/extensions-parent-0.1.0-incubating-SNAPSHOT.pom
No artifacts from beam_PostCommit_MavenVerify » Apache Beam :: SDKs :: Java :: Extensions
#483 to compare, so performing full copy of artifacts
[JENKINS] Archiving <https://builds.apache.org/job/beam_PostCommit_MavenVerify/ws/runners/pom.xml>
to org.apache.beam/runners-parent/0.1.0-incubating-SNAPSHOT/runners-parent-0.1.0-incubating-SNAPSHOT.pom
No artifacts from beam_PostCommit_MavenVerify » Apache Beam :: Runners #483 to compare, so
performing full copy of artifacts
[JENKINS] Archiving <https://builds.apache.org/job/beam_PostCommit_MavenVerify/ws/sdks/java/core/dependency-reduced-pom.xml>
to org.apache.beam/java-sdk-all/0.1.0-incubating-SNAPSHOT/java-sdk-all-0.1.0-incubating-SNAPSHOT.pom
[JENKINS] Archiving <https://builds.apache.org/job/beam_PostCommit_MavenVerify/ws/sdks/java/core/target/java-sdk-all-0.1.0-incubating-SNAPSHOT.jar>
to org.apache.beam/java-sdk-all/0.1.0-incubating-SNAPSHOT/java-sdk-all-0.1.0-incubating-SNAPSHOT.jar
[JENKINS] Archiving <https://builds.apache.org/job/beam_PostCommit_MavenVerify/ws/sdks/java/core/target/java-sdk-all-0.1.0-incubating-SNAPSHOT-tests.jar>
to org.apache.beam/java-sdk-all/0.1.0-incubating-SNAPSHOT/java-sdk-all-0.1.0-incubating-SNAPSHOT-tests.jar
[JENKINS] Archiving <https://builds.apache.org/job/beam_PostCommit_MavenVerify/ws/sdks/java/core/target/java-sdk-all-0.1.0-incubating-SNAPSHOT-sources.jar>
to org.apache.beam/java-sdk-all/0.1.0-incubating-SNAPSHOT/java-sdk-all-0.1.0-incubating-SNAPSHOT-sources.jar
[JENKINS] Archiving <https://builds.apache.org/job/beam_PostCommit_MavenVerify/ws/sdks/java/core/target/java-sdk-all-0.1.0-incubating-SNAPSHOT-test-sources.jar>
to org.apache.beam/java-sdk-all/0.1.0-incubating-SNAPSHOT/java-sdk-all-0.1.0-incubating-SNAPSHOT-test-sources.jar
[JENKINS] Archiving <https://builds.apache.org/job/beam_PostCommit_MavenVerify/ws/sdks/java/core/target/java-sdk-all-0.1.0-incubating-SNAPSHOT-javadoc.jar>
to org.apache.beam/java-sdk-all/0.1.0-incubating-SNAPSHOT/java-sdk-all-0.1.0-incubating-SNAPSHOT-javadoc.jar
No artifacts from beam_PostCommit_MavenVerify » Apache Beam :: SDKs :: Java :: Core #483
to compare, so performing full copy of artifacts
[JENKINS] Archiving <https://builds.apache.org/job/beam_PostCommit_MavenVerify/ws/runners/flink/target/flink-runner-parent-0.1.0-incubating-SNAPSHOT.jar>
to org.apache.beam/flink-runner-parent/0.1.0-incubating-SNAPSHOT/flink-runner-parent-0.1.0-incubating-SNAPSHOT.pom
[JENKINS] Archiving <https://builds.apache.org/job/beam_PostCommit_MavenVerify/ws/runners/flink/target/flink-runner-parent-0.1.0-incubating-SNAPSHOT-tests.jar>
to org.apache.beam/flink-runner-parent/0.1.0-incubating-SNAPSHOT/flink-runner-parent-0.1.0-incubating-SNAPSHOT-tests.jar
No artifacts from beam_PostCommit_MavenVerify » Apache Beam :: Runners :: Flink #483 to compare,
so performing full copy of artifacts
[JENKINS] Archiving <https://builds.apache.org/job/beam_PostCommit_MavenVerify/ws/sdks/java/io/hdfs/pom.xml>
to org.apache.beam/hdfs/0.1.0-incubating-SNAPSHOT/hdfs-0.1.0-incubating-SNAPSHOT.pom
[JENKINS] Archiving <https://builds.apache.org/job/beam_PostCommit_MavenVerify/ws/sdks/java/io/hdfs/target/hdfs-0.1.0-incubating-SNAPSHOT.jar>
to org.apache.beam/hdfs/0.1.0-incubating-SNAPSHOT/hdfs-0.1.0-incubating-SNAPSHOT.jar
[JENKINS] Archiving <https://builds.apache.org/job/beam_PostCommit_MavenVerify/ws/sdks/java/io/hdfs/target/hdfs-0.1.0-incubating-SNAPSHOT-sources.jar>
to org.apache.beam/hdfs/0.1.0-incubating-SNAPSHOT/hdfs-0.1.0-incubating-SNAPSHOT-sources.jar
[JENKINS] Archiving <https://builds.apache.org/job/beam_PostCommit_MavenVerify/ws/sdks/java/io/hdfs/target/hdfs-0.1.0-incubating-SNAPSHOT-test-sources.jar>
to org.apache.beam/hdfs/0.1.0-incubating-SNAPSHOT/hdfs-0.1.0-incubating-SNAPSHOT-test-sources.jar
[JENKINS] Archiving <https://builds.apache.org/job/beam_PostCommit_MavenVerify/ws/sdks/java/io/hdfs/target/hdfs-0.1.0-incubating-SNAPSHOT-tests.jar>
to org.apache.beam/hdfs/0.1.0-incubating-SNAPSHOT/hdfs-0.1.0-incubating-SNAPSHOT-tests.jar
No artifacts from beam_PostCommit_MavenVerify » Apache Beam :: SDKs :: Java :: IO :: HDFS
#483 to compare, so performing full copy of artifacts
Sending e-mails to: commits@beam.incubator.apache.org davor@google.com
channel stopped


Mime
View raw message