beam-commits mailing list archives

Site index · List index
Message view « Date » · « Thread »
Top « Date » · « Thread »
From Apache Jenkins Server <jenk...@builds.apache.org>
Subject Build failed in Jenkins: beam_RunnableOnService_GoogleCloudDataflow #22
Date Mon, 04 Apr 2016 22:48:30 GMT
See <https://builds.apache.org/job/beam_RunnableOnService_GoogleCloudDataflow/22/changes>

Changes:

[lcwik] [BEAM-167] Fix custom source gzip input to read concatenated gzip files

[lcwik] [BEAM-167] Add comment for the test explaining why concatenation of gzip

[dhalperi] IntervalBoundedExponentialBackOff: add deprecated copy of old API

------------------------------------------
Started by an SCM change
[EnvInject] - Loading node environment variables.
Building remotely on beam2 (beam) in workspace <https://builds.apache.org/job/beam_RunnableOnService_GoogleCloudDataflow/ws/>
 > git rev-parse --is-inside-work-tree # timeout=10
Fetching changes from the remote Git repository
 > git config remote.origin.url https://github.com/apache/incubator-beam.git # timeout=10
Fetching upstream changes from https://github.com/apache/incubator-beam.git
 > git --version # timeout=10
 > git -c core.askpass=true fetch --tags --progress https://github.com/apache/incubator-beam.git
+refs/heads/*:refs/remotes/origin/*
 > git rev-parse refs/remotes/origin/master^{commit} # timeout=10
 > git rev-parse refs/remotes/origin/origin/master^{commit} # timeout=10
Checking out Revision ac314eefd15b1e86a29799547d08c0f832377887 (refs/remotes/origin/master)
 > git config core.sparsecheckout # timeout=10
 > git checkout -f ac314eefd15b1e86a29799547d08c0f832377887
 > git rev-list fd049b52e196f1d04500470363cccbb652233610 # timeout=10
Parsing POMs
Established TCP socket on 39814
maven32-agent.jar already up to date
maven32-interceptor.jar already up to date
maven3-interceptor-commons.jar already up to date
[beam_RunnableOnService_GoogleCloudDataflow] $ /home/jenkins/jenkins-slave/tools/hudson.model.JDK/jdk1.8.0_66/bin/java
-Xmx2g -Xms256m -XX:MaxPermSize=512m -cp /home/jenkins/jenkins-slave/maven32-agent.jar:/home/jenkins/jenkins-slave/tools/hudson.tasks.Maven_MavenInstallation/maven-3.3.3/boot/plexus-classworlds-2.5.2.jar:/home/jenkins/jenkins-slave/tools/hudson.tasks.Maven_MavenInstallation/maven-3.3.3/conf/logging
jenkins.maven3.agent.Maven32Main /home/jenkins/jenkins-slave/tools/hudson.tasks.Maven_MavenInstallation/maven-3.3.3
/home/jenkins/jenkins-slave/slave.jar /home/jenkins/jenkins-slave/maven32-interceptor.jar
/home/jenkins/jenkins-slave/maven3-interceptor-commons.jar 39814
Java HotSpot(TM) 64-Bit Server VM warning: ignoring option MaxPermSize=512m; support was removed
in 8.0
<===[JENKINS REMOTING CAPACITY]===>   channel started
Executing Maven:  -B -f <https://builds.apache.org/job/beam_RunnableOnService_GoogleCloudDataflow/ws/pom.xml>
-Dmaven.repo.local=<https://builds.apache.org/job/beam_RunnableOnService_GoogleCloudDataflow/ws/.repository>
-B -e clean verify -pl .,sdks/java/core -P DataflowPipelineTests -DdataflowOptions=[ "--project=apache-beam-testing",
"--stagingLocation=gs://staging-for-runnable-on-service-jenkins-tests/" ]
[INFO] Error stacktraces are turned on.
[INFO] Scanning for projects...
[INFO] ------------------------------------------------------------------------
[INFO] Reactor Build Order:
[INFO] 
[INFO] Apache Beam :: Parent
[INFO] Apache Beam :: SDKs :: Java :: Core
[INFO]                                                                         
[INFO] ------------------------------------------------------------------------
[INFO] Building Apache Beam :: Parent 0.1.0-incubating-SNAPSHOT
[INFO] ------------------------------------------------------------------------
[INFO] 
[INFO] --- maven-clean-plugin:2.5:clean (default-clean) @ parent ---
[INFO] Deleting <https://builds.apache.org/job/beam_RunnableOnService_GoogleCloudDataflow/ws/target>
[INFO] 
[INFO] --- maven-remote-resources-plugin:1.5:process (default) @ parent ---
[INFO] 
[INFO] --- maven-site-plugin:3.4:attach-descriptor (attach-descriptor) @ parent ---
[INFO]                                                                         
[INFO] ------------------------------------------------------------------------
[INFO] Building Apache Beam :: SDKs :: Java :: Core 0.1.0-incubating-SNAPSHOT
[INFO] ------------------------------------------------------------------------
[INFO] 
[INFO] --- maven-clean-plugin:2.5:clean (default-clean) @ java-sdk-all ---
[INFO] Deleting <https://builds.apache.org/job/beam_RunnableOnService_GoogleCloudDataflow/ws/sdks/java/core/target>
[INFO] 
[INFO] --- jacoco-maven-plugin:0.7.5.201505241946:prepare-agent (default) @ java-sdk-all ---
[INFO] argLine set to -javaagent:<https://builds.apache.org/job/beam_RunnableOnService_GoogleCloudDataflow/ws/.repository/org/jacoco/org.jacoco.agent/0.7.5.201505241946/org.jacoco.agent-0.7.5.201505241946-runtime.jar=destfile=/home/jenkins/jenkins-slave/workspace/beam_RunnableOnService_GoogleCloudDataflow/sdks/java/core/target/jacoco.exec,dumponexit=true,output=file>
[INFO] 
[INFO] --- avro-maven-plugin:1.7.7:schema (schemas) @ java-sdk-all ---
[INFO] 
[INFO] --- maven-remote-resources-plugin:1.5:process (default) @ java-sdk-all ---
[INFO] 
[INFO] --- maven-resources-plugin:2.7:resources (default-resources) @ java-sdk-all ---
[INFO] Using 'UTF-8' encoding to copy filtered resources.
[INFO] Copying 1 resource
[INFO] Copying 3 resources
[INFO] 
[INFO] --- maven-compiler-plugin:3.1:compile (default-compile) @ java-sdk-all ---
[INFO] Changes detected - recompiling the module!
[INFO] Compiling 461 source files to <https://builds.apache.org/job/beam_RunnableOnService_GoogleCloudDataflow/ws/sdks/java/core/target/classes>
[WARNING] <https://builds.apache.org/job/beam_RunnableOnService_GoogleCloudDataflow/ws/sdks/java/core/src/main/java/com/google/cloud/dataflow/sdk/util/CoderUtils.java>:
Some input files use or override a deprecated API.
[WARNING] <https://builds.apache.org/job/beam_RunnableOnService_GoogleCloudDataflow/ws/sdks/java/core/src/main/java/com/google/cloud/dataflow/sdk/util/CoderUtils.java>:
Recompile with -Xlint:deprecation for details.
[WARNING] <https://builds.apache.org/job/beam_RunnableOnService_GoogleCloudDataflow/ws/sdks/java/core/src/main/java/com/google/cloud/dataflow/sdk/transforms/View.java>:
Some input files use unchecked or unsafe operations.
[WARNING] <https://builds.apache.org/job/beam_RunnableOnService_GoogleCloudDataflow/ws/sdks/java/core/src/main/java/com/google/cloud/dataflow/sdk/transforms/View.java>:
Recompile with -Xlint:unchecked for details.
[INFO] 
[INFO] >>> maven-source-plugin:2.4:jar (attach-sources) > generate-sources @ java-sdk-all
>>>
[INFO] 
[INFO] --- jacoco-maven-plugin:0.7.5.201505241946:prepare-agent (default) @ java-sdk-all ---
[INFO] argLine set to -javaagent:<https://builds.apache.org/job/beam_RunnableOnService_GoogleCloudDataflow/ws/.repository/org/jacoco/org.jacoco.agent/0.7.5.201505241946/org.jacoco.agent-0.7.5.201505241946-runtime.jar=destfile=/home/jenkins/jenkins-slave/workspace/beam_RunnableOnService_GoogleCloudDataflow/sdks/java/core/target/jacoco.exec,dumponexit=true,output=file>
[INFO] 
[INFO] --- avro-maven-plugin:1.7.7:schema (schemas) @ java-sdk-all ---
[WARNING] Failed to getClass for org.apache.maven.plugin.source.SourceJarMojo
[INFO] 
[INFO] <<< maven-source-plugin:2.4:jar (attach-sources) < generate-sources @ java-sdk-all
<<<
[INFO] 
[INFO] --- maven-source-plugin:2.4:jar (attach-sources) @ java-sdk-all ---
[INFO] Building jar: <https://builds.apache.org/job/beam_RunnableOnService_GoogleCloudDataflow/ws/sdks/java/core/target/java-sdk-all-0.1.0-incubating-SNAPSHOT-sources.jar>
[INFO] 
[INFO] --- build-helper-maven-plugin:1.9.1:add-test-source (add-test-source) @ java-sdk-all
---
[INFO] Test Source directory: <https://builds.apache.org/job/beam_RunnableOnService_GoogleCloudDataflow/ws/sdks/java/core/target/generated-test-sources/java>
added.
[INFO] 
[INFO] --- maven-resources-plugin:2.7:testResources (default-testResources) @ java-sdk-all
---
[INFO] Using 'UTF-8' encoding to copy filtered resources.
[INFO] skip non existing resourceDirectory <https://builds.apache.org/job/beam_RunnableOnService_GoogleCloudDataflow/ws/sdks/java/core/src/test/resources>
[INFO] Copying 3 resources
[INFO] 
[INFO] --- maven-compiler-plugin:3.1:testCompile (default-testCompile) @ java-sdk-all ---
[INFO] Changes detected - recompiling the module!
[INFO] Compiling 266 source files to <https://builds.apache.org/job/beam_RunnableOnService_GoogleCloudDataflow/ws/sdks/java/core/target/test-classes>
[WARNING] <https://builds.apache.org/job/beam_RunnableOnService_GoogleCloudDataflow/ws/sdks/java/core/src/test/java/com/google/cloud/dataflow/sdk/io/CountingSourceTest.java>:
Some input files use or override a deprecated API.
[WARNING] <https://builds.apache.org/job/beam_RunnableOnService_GoogleCloudDataflow/ws/sdks/java/core/src/test/java/com/google/cloud/dataflow/sdk/io/CountingSourceTest.java>:
Recompile with -Xlint:deprecation for details.
[WARNING] <https://builds.apache.org/job/beam_RunnableOnService_GoogleCloudDataflow/ws/sdks/java/core/src/test/java/com/google/cloud/dataflow/sdk/util/ReduceFnRunnerTest.java>:
Some input files use unchecked or unsafe operations.
[WARNING] <https://builds.apache.org/job/beam_RunnableOnService_GoogleCloudDataflow/ws/sdks/java/core/src/test/java/com/google/cloud/dataflow/sdk/util/ReduceFnRunnerTest.java>:
Recompile with -Xlint:unchecked for details.
[INFO] 
[INFO] >>> maven-source-plugin:2.4:test-jar (attach-test-sources) > generate-sources
@ java-sdk-all >>>
[INFO] 
[INFO] --- jacoco-maven-plugin:0.7.5.201505241946:prepare-agent (default) @ java-sdk-all ---
[INFO] argLine set to -javaagent:<https://builds.apache.org/job/beam_RunnableOnService_GoogleCloudDataflow/ws/.repository/org/jacoco/org.jacoco.agent/0.7.5.201505241946/org.jacoco.agent-0.7.5.201505241946-runtime.jar=destfile=/home/jenkins/jenkins-slave/workspace/beam_RunnableOnService_GoogleCloudDataflow/sdks/java/core/target/jacoco.exec,dumponexit=true,output=file>
[INFO] 
[INFO] --- avro-maven-plugin:1.7.7:schema (schemas) @ java-sdk-all ---
[WARNING] Failed to getClass for org.apache.maven.plugin.source.TestSourceJarMojo
[INFO] 
[INFO] <<< maven-source-plugin:2.4:test-jar (attach-test-sources) < generate-sources
@ java-sdk-all <<<
[INFO] 
[INFO] --- maven-source-plugin:2.4:test-jar (attach-test-sources) @ java-sdk-all ---
[INFO] Building jar: <https://builds.apache.org/job/beam_RunnableOnService_GoogleCloudDataflow/ws/sdks/java/core/target/java-sdk-all-0.1.0-incubating-SNAPSHOT-test-sources.jar>
[INFO] 
[INFO] --- maven-surefire-plugin:2.18.1:test (default-test) @ java-sdk-all ---
[INFO] Surefire report directory: <https://builds.apache.org/job/beam_RunnableOnService_GoogleCloudDataflow/ws/sdks/java/core/target/surefire-reports>
[INFO] Using configured provider org.apache.maven.surefire.junitcore.JUnitCoreProvider
[INFO] parallel='both', perCoreThreadCount=true, threadCount=4, useUnlimitedThreads=false,
threadCountSuites=0, threadCountClasses=0, threadCountMethods=0, parallelOptimized=true

-------------------------------------------------------
 T E S T S
-------------------------------------------------------
Running com.google.cloud.dataflow.sdk.PipelineTest
Tests run: 4, Failures: 0, Errors: 0, Skipped: 0, Time elapsed: 605.066 sec - in com.google.cloud.dataflow.sdk.PipelineTest
Running com.google.cloud.dataflow.sdk.io.BigQueryIOTest
Tests run: 4, Failures: 0, Errors: 0, Skipped: 0, Time elapsed: 0.198 sec - in com.google.cloud.dataflow.sdk.io.BigQueryIOTest
Running com.google.cloud.dataflow.sdk.transforms.RemoveDuplicatesTest
Tests run: 3, Failures: 0, Errors: 0, Skipped: 0, Time elapsed: 439.83 sec - in com.google.cloud.dataflow.sdk.transforms.RemoveDuplicatesTest
Running com.google.cloud.dataflow.sdk.transforms.GroupByKeyTest
Tests run: 5, Failures: 0, Errors: 0, Skipped: 0, Time elapsed: 751.544 sec - in com.google.cloud.dataflow.sdk.transforms.GroupByKeyTest

Results :

Tests run: 16, Failures: 0, Errors: 0, Skipped: 0

[JENKINS] Recording test results
[INFO] ------------------------------------------------------------------------
[INFO] Reactor Summary:
[INFO] 
[INFO] Apache Beam :: Parent .............................. SUCCESS [  2.431 s]
[INFO] Apache Beam :: SDKs :: Java :: Core ................ FAILURE [15:51 min]
[INFO] ------------------------------------------------------------------------
[INFO] BUILD FAILURE
[INFO] ------------------------------------------------------------------------
[INFO] Total time: 16:00 min
[INFO] Finished at: 2016-04-04T22:48:29+00:00
[INFO] Final Memory: 55M/828M
[INFO] ------------------------------------------------------------------------
Waiting for Jenkins to finish collecting data[ERROR] Failed to execute goal org.apache.maven.plugins:maven-surefire-plugin:2.18.1:test
(default-test) on project java-sdk-all: Execution default-test of goal org.apache.maven.plugins:maven-surefire-plugin:2.18.1:test
failed: The forked VM terminated without properly saying goodbye. VM crash or System.exit
called?
[ERROR] Command was /bin/sh -c cd <https://builds.apache.org/job/beam_RunnableOnService_GoogleCloudDataflow/ws/sdks/java/core>
&& /home/jenkins/jenkins-slave/tools/hudson.model.JDK/jdk1.8.0_66/jre/bin/java -javaagent:<https://builds.apache.org/job/beam_RunnableOnService_GoogleCloudDataflow/ws/.repository/org/jacoco/org.jacoco.agent/0.7.5.201505241946/org.jacoco.agent-0.7.5.201505241946-runtime.jar=destfile=/home/jenkins/jenkins-slave/workspace/beam_RunnableOnService_GoogleCloudDataflow/sdks/java/core/target/jacoco.exec,dumponexit=true,output=file>
org.apache.maven.surefire.booter.ForkedBooter <https://builds.apache.org/job/beam_RunnableOnService_GoogleCloudDataflow/ws/sdks/java/core/target/surefire/surefire6807377411574750580tmp>
<https://builds.apache.org/job/beam_RunnableOnService_GoogleCloudDataflow/ws/sdks/java/core/target/surefire/surefire_04819993072170188775tmp>
[ERROR] -> [Help 1]
org.apache.maven.lifecycle.LifecycleExecutionException: Failed to execute goal org.apache.maven.plugins:maven-surefire-plugin:2.18.1:test
(default-test) on project java-sdk-all: Execution default-test of goal org.apache.maven.plugins:maven-surefire-plugin:2.18.1:test
failed: The forked VM terminated without properly saying goodbye. VM crash or System.exit
called?
Command was /bin/sh -c cd <https://builds.apache.org/job/beam_RunnableOnService_GoogleCloudDataflow/ws/sdks/java/core>
&& /home/jenkins/jenkins-slave/tools/hudson.model.JDK/jdk1.8.0_66/jre/bin/java -javaagent:<https://builds.apache.org/job/beam_RunnableOnService_GoogleCloudDataflow/ws/.repository/org/jacoco/org.jacoco.agent/0.7.5.201505241946/org.jacoco.agent-0.7.5.201505241946-runtime.jar=destfile=/home/jenkins/jenkins-slave/workspace/beam_RunnableOnService_GoogleCloudDataflow/sdks/java/core/target/jacoco.exec,dumponexit=true,output=file>
org.apache.maven.surefire.booter.ForkedBooter <https://builds.apache.org/job/beam_RunnableOnService_GoogleCloudDataflow/ws/sdks/java/core/target/surefire/surefire6807377411574750580tmp>
<https://builds.apache.org/job/beam_RunnableOnService_GoogleCloudDataflow/ws/sdks/java/core/target/surefire/surefire_04819993072170188775tmp>
	at org.apache.maven.lifecycle.internal.MojoExecutor.execute(MojoExecutor.java:224)
	at org.apache.maven.lifecycle.internal.MojoExecutor.execute(MojoExecutor.java:153)
	at org.apache.maven.lifecycle.internal.MojoExecutor.execute(MojoExecutor.java:145)
	at org.apache.maven.lifecycle.internal.LifecycleModuleBuilder.buildProject(LifecycleModuleBuilder.java:116)
	at org.apache.maven.lifecycle.internal.LifecycleModuleBuilder.buildProject(LifecycleModuleBuilder.java:80)
	at org.apache.maven.lifecycle.internal.builder.singlethreaded.SingleThreadedBuilder.build(SingleThreadedBuilder.java:51)
	at org.apache.maven.lifecycle.internal.LifecycleStarter.execute(LifecycleStarter.java:128)
	at org.apache.maven.DefaultMaven.doExecute(DefaultMaven.java:307)
	at org.apache.maven.DefaultMaven.doExecute(DefaultMaven.java:193)
	at org.apache.maven.DefaultMaven.execute(DefaultMaven.java:106)
	at org.jvnet.hudson.maven3.launcher.Maven32Launcher.main(Maven32Launcher.java:132)
	at sun.reflect.NativeMethodAccessorImpl.invoke0(Native Method)
	at sun.reflect.NativeMethodAccessorImpl.invoke(NativeMethodAccessorImpl.java:62)
	at sun.reflect.DelegatingMethodAccessorImpl.invoke(DelegatingMethodAccessorImpl.java:43)
	at java.lang.reflect.Method.invoke(Method.java:497)
	at org.codehaus.plexus.classworlds.launcher.Launcher.launchStandard(Launcher.java:330)
	at org.codehaus.plexus.classworlds.launcher.Launcher.launch(Launcher.java:238)
	at jenkins.maven3.agent.Maven32Main.launch(Maven32Main.java:186)
	at sun.reflect.NativeMethodAccessorImpl.invoke0(Native Method)
	at sun.reflect.NativeMethodAccessorImpl.invoke(NativeMethodAccessorImpl.java:62)
	at sun.reflect.DelegatingMethodAccessorImpl.invoke(DelegatingMethodAccessorImpl.java:43)
	at java.lang.reflect.Method.invoke(Method.java:497)
	at hudson.maven.Maven3Builder.call(Maven3Builder.java:136)
	at hudson.maven.Maven3Builder.call(Maven3Builder.java:71)
	at hudson.remoting.UserRequest.perform(UserRequest.java:120)
	at hudson.remoting.UserRequest.perform(UserRequest.java:48)
	at hudson.remoting.Request$2.run(Request.java:326)
	at hudson.remoting.InterceptingExecutorService$1.call(InterceptingExecutorService.java:68)
	at java.util.concurrent.FutureTask.run(FutureTask.java:266)
	at java.util.concurrent.ThreadPoolExecutor.runWorker(ThreadPoolExecutor.java:1142)
	at java.util.concurrent.ThreadPoolExecutor$Worker.run(ThreadPoolExecutor.java:617)
	at java.lang.Thread.run(Thread.java:745)
Caused by: org.apache.maven.plugin.PluginExecutionException: Execution default-test of goal
org.apache.maven.plugins:maven-surefire-plugin:2.18.1:test failed: The forked VM terminated
without properly saying goodbye. VM crash or System.exit called?
Command was /bin/sh -c cd <https://builds.apache.org/job/beam_RunnableOnService_GoogleCloudDataflow/ws/sdks/java/core>
&& /home/jenkins/jenkins-slave/tools/hudson.model.JDK/jdk1.8.0_66/jre/bin/java -javaagent:<https://builds.apache.org/job/beam_RunnableOnService_GoogleCloudDataflow/ws/.repository/org/jacoco/org.jacoco.agent/0.7.5.201505241946/org.jacoco.agent-0.7.5.201505241946-runtime.jar=destfile=/home/jenkins/jenkins-slave/workspace/beam_RunnableOnService_GoogleCloudDataflow/sdks/java/core/target/jacoco.exec,dumponexit=true,output=file>
org.apache.maven.surefire.booter.ForkedBooter <https://builds.apache.org/job/beam_RunnableOnService_GoogleCloudDataflow/ws/sdks/java/core/target/surefire/surefire6807377411574750580tmp>
<https://builds.apache.org/job/beam_RunnableOnService_GoogleCloudDataflow/ws/sdks/java/core/target/surefire/surefire_04819993072170188775tmp>
	at org.apache.maven.plugin.DefaultBuildPluginManager.executeMojo(DefaultBuildPluginManager.java:145)
	at org.apache.maven.lifecycle.internal.MojoExecutor.execute(MojoExecutor.java:208)
	... 31 more
Caused by: java.lang.RuntimeException: The forked VM terminated without properly saying goodbye.
VM crash or System.exit called?
Command was /bin/sh -c cd <https://builds.apache.org/job/beam_RunnableOnService_GoogleCloudDataflow/ws/sdks/java/core>
&& /home/jenkins/jenkins-slave/tools/hudson.model.JDK/jdk1.8.0_66/jre/bin/java -javaagent:<https://builds.apache.org/job/beam_RunnableOnService_GoogleCloudDataflow/ws/.repository/org/jacoco/org.jacoco.agent/0.7.5.201505241946/org.jacoco.agent-0.7.5.201505241946-runtime.jar=destfile=/home/jenkins/jenkins-slave/workspace/beam_RunnableOnService_GoogleCloudDataflow/sdks/java/core/target/jacoco.exec,dumponexit=true,output=file>
org.apache.maven.surefire.booter.ForkedBooter <https://builds.apache.org/job/beam_RunnableOnService_GoogleCloudDataflow/ws/sdks/java/core/target/surefire/surefire6807377411574750580tmp>
<https://builds.apache.org/job/beam_RunnableOnService_GoogleCloudDataflow/ws/sdks/java/core/target/surefire/surefire_04819993072170188775tmp>
	at org.apache.maven.plugin.surefire.booterclient.ForkStarter.fork(ForkStarter.java:515)
	at org.apache.maven.plugin.surefire.booterclient.ForkStarter.fork(ForkStarter.java:380)
	at org.apache.maven.plugin.surefire.booterclient.ForkStarter.run(ForkStarter.java:167)
	at org.apache.maven.plugin.surefire.AbstractSurefireMojo.executeProvider(AbstractSurefireMojo.java:990)
	at org.apache.maven.plugin.surefire.AbstractSurefireMojo.executeAfterPreconditionsChecked(AbstractSurefireMojo.java:824)
	at org.apache.maven.plugin.surefire.AbstractSurefireMojo.execute(AbstractSurefireMojo.java:722)
	at org.apache.maven.plugin.DefaultBuildPluginManager.executeMojo(DefaultBuildPluginManager.java:134)
	... 32 more
[ERROR] 
[ERROR] Re-run Maven using the -X switch to enable full debug logging.
[ERROR] 
[ERROR] For more information about the errors and possible solutions, please read the following
articles:
[ERROR] [Help 1] http://cwiki.apache.org/confluence/display/MAVEN/PluginExecutionException
[ERROR] 
[ERROR] After correcting the problems, you can resume the build with the command
[ERROR]   mvn <goals> -rf :java-sdk-all

[JENKINS] Archiving <https://builds.apache.org/job/beam_RunnableOnService_GoogleCloudDataflow/ws/pom.xml>
to org.apache.beam/parent/0.1.0-incubating-SNAPSHOT/parent-0.1.0-incubating-SNAPSHOT.pom
No artifacts from beam_RunnableOnService_GoogleCloudDataflow ยป Apache Beam :: Parent #21
to compare, so performing full copy of artifacts
[JENKINS] Archiving <https://builds.apache.org/job/beam_RunnableOnService_GoogleCloudDataflow/ws/sdks/java/core/pom.xml>
to org.apache.beam/java-sdk-all/0.1.0-incubating-SNAPSHOT/java-sdk-all-0.1.0-incubating-SNAPSHOT.pom
[JENKINS] Archiving <https://builds.apache.org/job/beam_RunnableOnService_GoogleCloudDataflow/ws/sdks/java/core/target/java-sdk-all-0.1.0-incubating-SNAPSHOT-sources.jar>
to org.apache.beam/java-sdk-all/0.1.0-incubating-SNAPSHOT/java-sdk-all-0.1.0-incubating-SNAPSHOT-sources.jar
[JENKINS] Archiving <https://builds.apache.org/job/beam_RunnableOnService_GoogleCloudDataflow/ws/sdks/java/core/target/java-sdk-all-0.1.0-incubating-SNAPSHOT-test-sources.jar>
to org.apache.beam/java-sdk-all/0.1.0-incubating-SNAPSHOT/java-sdk-all-0.1.0-incubating-SNAPSHOT-test-sources.jar
Compressed 1.65 MB of artifacts by 77.8% relative to #20
Sending e-mails to: commits@beam.incubator.apache.org lcwik@google.com dhalperi@google.com
channel stopped

Mime
View raw message