beam-commits mailing list archives

Site index · List index
Message view « Date » · « Thread »
Top « Date » · « Thread »
From Apache Jenkins Server <jenk...@builds.apache.org>
Subject Build failed in Jenkins: beam_PostCommit_MavenVerify #230
Date Thu, 21 Apr 2016 00:15:59 GMT
See <https://builds.apache.org/job/beam_PostCommit_MavenVerify/230/>

------------------------------------------
[...truncated 2952 lines...]
[INFO] 
[INFO] --- maven-clean-plugin:2.5:clean (default-clean) @ java8examples-all ---
[INFO] Deleting <https://builds.apache.org/job/beam_PostCommit_MavenVerify/ws/examples/java8/target>
[INFO] 
[INFO] --- jacoco-maven-plugin:0.7.5.201505241946:prepare-agent (default) @ java8examples-all
---
[INFO] argLine set to -javaagent:<https://builds.apache.org/job/beam_PostCommit_MavenVerify/ws/.repository/org/jacoco/org.jacoco.agent/0.7.5.201505241946/org.jacoco.agent-0.7.5.201505241946-runtime.jar=destfile=/home/jenkins/jenkins-slave/workspace/beam_PostCommit_MavenVerify/examples/java8/target/jacoco.exec,excludes=**/AutoValue_*.java,dumponexit=true,output=file>
[INFO] 
[INFO] --- maven-remote-resources-plugin:1.5:process (default) @ java8examples-all ---
[INFO] 
[INFO] --- maven-resources-plugin:2.7:resources (default-resources) @ java8examples-all ---
[INFO] Using 'UTF-8' encoding to copy filtered resources.
[INFO] skip non existing resourceDirectory <https://builds.apache.org/job/beam_PostCommit_MavenVerify/ws/examples/java8/src/main/resources>
[INFO] Copying 3 resources
[INFO] 
[INFO] --- maven-compiler-plugin:3.1:compile (default-compile) @ java8examples-all ---
[INFO] Changes detected - recompiling the module!
[INFO] Compiling 10 source files to <https://builds.apache.org/job/beam_PostCommit_MavenVerify/ws/examples/java8/target/classes>
[INFO] 
[INFO] >>> maven-source-plugin:2.4:jar (attach-sources) > generate-sources @ java8examples-all
>>>
[INFO] 
[INFO] --- jacoco-maven-plugin:0.7.5.201505241946:prepare-agent (default) @ java8examples-all
---
[INFO] argLine set to -javaagent:<https://builds.apache.org/job/beam_PostCommit_MavenVerify/ws/.repository/org/jacoco/org.jacoco.agent/0.7.5.201505241946/org.jacoco.agent-0.7.5.201505241946-runtime.jar=destfile=/home/jenkins/jenkins-slave/workspace/beam_PostCommit_MavenVerify/examples/java8/target/jacoco.exec,excludes=**/AutoValue_*.java,dumponexit=true,output=file>
[WARNING] Failed to getClass for org.apache.maven.plugin.source.SourceJarMojo
[INFO] 
[INFO] <<< maven-source-plugin:2.4:jar (attach-sources) < generate-sources @ java8examples-all
<<<
[INFO] 
[INFO] --- maven-source-plugin:2.4:jar (attach-sources) @ java8examples-all ---
[INFO] Building jar: <https://builds.apache.org/job/beam_PostCommit_MavenVerify/ws/examples/java8/target/java8examples-all-0.1.0-incubating-SNAPSHOT-sources.jar>
[INFO] 
[INFO] --- maven-resources-plugin:2.7:testResources (default-testResources) @ java8examples-all
---
[INFO] Using 'UTF-8' encoding to copy filtered resources.
[INFO] skip non existing resourceDirectory <https://builds.apache.org/job/beam_PostCommit_MavenVerify/ws/examples/java8/src/test/resources>
[INFO] Copying 3 resources
[INFO] 
[INFO] --- maven-compiler-plugin:3.1:testCompile (default-testCompile) @ java8examples-all
---
[INFO] Changes detected - recompiling the module!
[INFO] Compiling 4 source files to <https://builds.apache.org/job/beam_PostCommit_MavenVerify/ws/examples/java8/target/test-classes>
[WARNING] <https://builds.apache.org/job/beam_PostCommit_MavenVerify/ws/examples/java8/src/test/java/org/apache/beam/examples/complete/game/HourlyTeamScoreTest.java>:
<https://builds.apache.org/job/beam_PostCommit_MavenVerify/ws/examples/java8/src/test/java/org/apache/beam/examples/complete/game/HourlyTeamScoreTest.java>
uses unchecked or unsafe operations.
[WARNING] <https://builds.apache.org/job/beam_PostCommit_MavenVerify/ws/examples/java8/src/test/java/org/apache/beam/examples/complete/game/HourlyTeamScoreTest.java>:
Recompile with -Xlint:unchecked for details.
[INFO] 
[INFO] >>> maven-source-plugin:2.4:test-jar (attach-test-sources) > generate-sources
@ java8examples-all >>>
[INFO] 
[INFO] --- jacoco-maven-plugin:0.7.5.201505241946:prepare-agent (default) @ java8examples-all
---
[INFO] argLine set to -javaagent:<https://builds.apache.org/job/beam_PostCommit_MavenVerify/ws/.repository/org/jacoco/org.jacoco.agent/0.7.5.201505241946/org.jacoco.agent-0.7.5.201505241946-runtime.jar=destfile=/home/jenkins/jenkins-slave/workspace/beam_PostCommit_MavenVerify/examples/java8/target/jacoco.exec,excludes=**/AutoValue_*.java,dumponexit=true,output=file>
[WARNING] Failed to getClass for org.apache.maven.plugin.source.TestSourceJarMojo
[INFO] 
[INFO] <<< maven-source-plugin:2.4:test-jar (attach-test-sources) < generate-sources
@ java8examples-all <<<
[INFO] 
[INFO] --- maven-source-plugin:2.4:test-jar (attach-test-sources) @ java8examples-all ---
[INFO] Building jar: <https://builds.apache.org/job/beam_PostCommit_MavenVerify/ws/examples/java8/target/java8examples-all-0.1.0-incubating-SNAPSHOT-test-sources.jar>
[INFO] 
[INFO] --- maven-surefire-plugin:2.18.1:test (default-test) @ java8examples-all ---
[INFO] Surefire report directory: <https://builds.apache.org/job/beam_PostCommit_MavenVerify/ws/examples/java8/target/surefire-reports>
[INFO] Using configured provider org.apache.maven.surefire.junitcore.JUnitCoreProvider
[INFO] parallel='none', perCoreThreadCount=true, threadCount=0, useUnlimitedThreads=false,
threadCountSuites=0, threadCountClasses=0, threadCountMethods=0, parallelOptimized=true

-------------------------------------------------------
 T E S T S
-------------------------------------------------------
Running org.apache.beam.examples.complete.game.UserScoreTest
Tests run: 4, Failures: 0, Errors: 0, Skipped: 0, Time elapsed: 5.855 sec - in org.apache.beam.examples.complete.game.UserScoreTest
Running org.apache.beam.examples.complete.game.GameStatsTest
Tests run: 1, Failures: 0, Errors: 0, Skipped: 0, Time elapsed: 0.21 sec - in org.apache.beam.examples.complete.game.GameStatsTest
Running org.apache.beam.examples.complete.game.HourlyTeamScoreTest
Tests run: 1, Failures: 0, Errors: 0, Skipped: 0, Time elapsed: 0.185 sec - in org.apache.beam.examples.complete.game.HourlyTeamScoreTest
Running org.apache.beam.examples.MinimalWordCountJava8Test
Tests run: 1, Failures: 0, Errors: 0, Skipped: 0, Time elapsed: 0.581 sec - in org.apache.beam.examples.MinimalWordCountJava8Test

Results :

Tests run: 7, Failures: 0, Errors: 0, Skipped: 0

[INFO] 
[INFO] --- jacoco-maven-plugin:0.7.5.201505241946:report (report) @ java8examples-all ---
[INFO] Analyzed bundle 'Apache Beam :: Examples :: Java 8 All' with 27 classes
[INFO] 
[INFO] --- maven-jar-plugin:2.5:jar (default-jar) @ java8examples-all ---
[INFO] Building jar: <https://builds.apache.org/job/beam_PostCommit_MavenVerify/ws/examples/java8/target/java8examples-all-0.1.0-incubating-SNAPSHOT.jar>
[INFO] 
[INFO] --- maven-site-plugin:3.4:attach-descriptor (attach-descriptor) @ java8examples-all
---
[INFO] 
[INFO] --- maven-jar-plugin:2.5:test-jar (default-test-jar) @ java8examples-all ---
[INFO] Building jar: <https://builds.apache.org/job/beam_PostCommit_MavenVerify/ws/examples/java8/target/java8examples-all-0.1.0-incubating-SNAPSHOT-tests.jar>
[INFO] 
[INFO] --- maven-dependency-plugin:2.10:analyze-only (default) @ java8examples-all ---
[INFO] No dependency problems found
[INFO] 
[INFO] --- maven-checkstyle-plugin:2.12:check (default) @ java8examples-all ---
[INFO] Starting audit...
Audit done.

[INFO] 
[INFO] --- maven-install-plugin:2.5.2:install (default-install) @ java8examples-all ---
[INFO] Installing <https://builds.apache.org/job/beam_PostCommit_MavenVerify/ws/examples/java8/target/java8examples-all-0.1.0-incubating-SNAPSHOT.jar>
to <https://builds.apache.org/job/beam_PostCommit_MavenVerify/ws/.repository/org/apache/beam/java8examples-all/0.1.0-incubating-SNAPSHOT/java8examples-all-0.1.0-incubating-SNAPSHOT.jar>
[INFO] Installing <https://builds.apache.org/job/beam_PostCommit_MavenVerify/ws/examples/java8/pom.xml>
to <https://builds.apache.org/job/beam_PostCommit_MavenVerify/ws/.repository/org/apache/beam/java8examples-all/0.1.0-incubating-SNAPSHOT/java8examples-all-0.1.0-incubating-SNAPSHOT.pom>
[INFO] Installing <https://builds.apache.org/job/beam_PostCommit_MavenVerify/ws/examples/java8/target/java8examples-all-0.1.0-incubating-SNAPSHOT-sources.jar>
to <https://builds.apache.org/job/beam_PostCommit_MavenVerify/ws/.repository/org/apache/beam/java8examples-all/0.1.0-incubating-SNAPSHOT/java8examples-all-0.1.0-incubating-SNAPSHOT-sources.jar>
[INFO] Installing <https://builds.apache.org/job/beam_PostCommit_MavenVerify/ws/examples/java8/target/java8examples-all-0.1.0-incubating-SNAPSHOT-test-sources.jar>
to <https://builds.apache.org/job/beam_PostCommit_MavenVerify/ws/.repository/org/apache/beam/java8examples-all/0.1.0-incubating-SNAPSHOT/java8examples-all-0.1.0-incubating-SNAPSHOT-test-sources.jar>
[INFO] Installing <https://builds.apache.org/job/beam_PostCommit_MavenVerify/ws/examples/java8/target/java8examples-all-0.1.0-incubating-SNAPSHOT-tests.jar>
to <https://builds.apache.org/job/beam_PostCommit_MavenVerify/ws/.repository/org/apache/beam/java8examples-all/0.1.0-incubating-SNAPSHOT/java8examples-all-0.1.0-incubating-SNAPSHOT-tests.jar>
[INFO]                                                                         
[INFO] ------------------------------------------------------------------------
[INFO] Building Apache Beam :: Examples 0.1.0-incubating-SNAPSHOT
[INFO] ------------------------------------------------------------------------
[INFO] 
[INFO] --- maven-clean-plugin:2.5:clean (default-clean) @ examples-parent ---
[INFO] Deleting <https://builds.apache.org/job/beam_PostCommit_MavenVerify/ws/examples/target>
[INFO] 
[INFO] --- maven-remote-resources-plugin:1.5:process (default) @ examples-parent ---
[INFO] 
[INFO] --- maven-site-plugin:3.4:attach-descriptor (attach-descriptor) @ examples-parent ---
[INFO] 
[INFO] --- maven-install-plugin:2.5.2:install (default-install) @ examples-parent ---
[INFO] Installing <https://builds.apache.org/job/beam_PostCommit_MavenVerify/ws/examples/pom.xml>
to <https://builds.apache.org/job/beam_PostCommit_MavenVerify/ws/.repository/org/apache/beam/examples-parent/0.1.0-incubating-SNAPSHOT/examples-parent-0.1.0-incubating-SNAPSHOT.pom>
[INFO]                                                                         
[INFO] ------------------------------------------------------------------------
[INFO] Building Apache Beam :: Parent 0.1.0-incubating-SNAPSHOT
[INFO] ------------------------------------------------------------------------
[WARNING] The POM for org.eclipse.m2e:lifecycle-mapping:jar:1.0.0 is missing, no dependency
information available
[WARNING] Failed to retrieve plugin descriptor for org.eclipse.m2e:lifecycle-mapping:1.0.0:
Plugin org.eclipse.m2e:lifecycle-mapping:1.0.0 or one of its dependencies could not be resolved:
Failure to find org.eclipse.m2e:lifecycle-mapping:jar:1.0.0 in https://repo.maven.apache.org/maven2
was cached in the local repository, resolution will not be reattempted until the update interval
of central has elapsed or updates are forced
[INFO] 
[INFO] --- coveralls-maven-plugin:4.1.0:report (default-cli) @ parent ---
[INFO] Starting Coveralls job for jenkins (230 / https://builds.apache.org/job/beam_PostCommit_MavenVerify/230/)
[INFO] Using repository token <secret>
[INFO] Git commit 506023b in master
[INFO] Writing Coveralls data to <https://builds.apache.org/job/beam_PostCommit_MavenVerify/ws/target/coveralls.json...>
[INFO] Processing coverage report from <https://builds.apache.org/job/beam_PostCommit_MavenVerify/ws/sdks/java/core/target/site/jacoco/jacoco.xml>
[INFO] ------------------------------------------------------------------------
[INFO] Reactor Summary:
[INFO] 
[INFO] Apache Beam :: Parent .............................. FAILURE [  1.383 s]
[INFO] Apache Beam :: SDKs ................................ SUCCESS [  0.390 s]
[INFO] Apache Beam :: SDKs :: Java ........................ SUCCESS [  0.445 s]
[INFO] Apache Beam :: SDKs :: Java :: Core ................ SUCCESS [03:19 min]
[INFO] Apache Beam :: SDKs :: Java :: IO .................. SUCCESS [  0.388 s]
[INFO] Apache Beam :: SDKs :: Java :: IO :: HDFS .......... SUCCESS [ 12.388 s]
[INFO] Apache Beam :: SDKs :: Java :: Tests ............... SUCCESS [  9.365 s]
[INFO] Apache Beam :: Runners ............................. SUCCESS [  0.433 s]
[INFO] Apache Beam :: Runners :: Google Cloud Dataflow .... SUCCESS [ 32.642 s]
[INFO] Apache Beam :: Examples :: Java All ................ SUCCESS [ 24.540 s]
[INFO] Apache Beam :: Runners :: Flink .................... SUCCESS [  0.511 s]
[INFO] Apache Beam :: Runners :: Flink :: Core ............ SUCCESS [ 37.187 s]
[INFO] Apache Beam :: Runners :: Flink :: Examples ........ SUCCESS [  2.659 s]
[INFO] Apache Beam :: Runners :: Spark .................... SUCCESS [03:31 min]
[INFO] Apache Beam :: SDKs :: Java :: Maven Archetypes .... SUCCESS [  0.337 s]
[INFO] Apache Beam :: SDKs :: Java :: Maven Archetypes :: Starter SUCCESS [  9.426 s]
[INFO] Apache Beam :: SDKs :: Java :: Maven Archetypes :: Examples SUCCESS [ 16.721 s]
[INFO] Apache Beam :: Examples :: Java 8 All .............. SUCCESS [ 10.875 s]
[INFO] Apache Beam :: Examples ............................ SUCCESS [  0.373 s]
[INFO] ------------------------------------------------------------------------
[INFO] BUILD FAILURE
[INFO] ------------------------------------------------------------------------
[INFO] Total time: 09:55 min
[INFO] Finished at: 2016-04-21T00:15:46+00:00
[INFO] Final Memory: 135M/877M
[INFO] ------------------------------------------------------------------------
[ERROR] Failed to execute goal org.eluder.coveralls:coveralls-maven-plugin:4.1.0:report (default-cli)
on project parent: I/O operation failed: No source found for org/apache/beam/sdk/runners/worker/AutoValue_IsmFormat_Footer.java
-> [Help 1]
org.apache.maven.lifecycle.LifecycleExecutionException: Failed to execute goal org.eluder.coveralls:coveralls-maven-plugin:4.1.0:report
(default-cli) on project parent: I/O operation failed
	at org.apache.maven.lifecycle.internal.MojoExecutor.execute(MojoExecutor.java:212)
	at org.apache.maven.lifecycle.internal.MojoExecutor.execute(MojoExecutor.java:153)
	at org.apache.maven.lifecycle.internal.MojoExecutor.execute(MojoExecutor.java:145)
	at org.apache.maven.lifecycle.internal.LifecycleModuleBuilder.buildProject(LifecycleModuleBuilder.java:116)
	at org.apache.maven.lifecycle.internal.LifecycleModuleBuilder.buildProject(LifecycleModuleBuilder.java:80)
	at org.apache.maven.lifecycle.internal.builder.singlethreaded.SingleThreadedBuilder.build(SingleThreadedBuilder.java:51)
	at org.apache.maven.lifecycle.internal.LifecycleStarter.execute(LifecycleStarter.java:128)
	at org.apache.maven.DefaultMaven.doExecute(DefaultMaven.java:307)
	at org.apache.maven.DefaultMaven.doExecute(DefaultMaven.java:193)
	at org.apache.maven.DefaultMaven.execute(DefaultMaven.java:106)
	at org.jvnet.hudson.maven3.launcher.Maven32Launcher.main(Maven32Launcher.java:132)
	at sun.reflect.NativeMethodAccessorImpl.invoke0(Native Method)
	at sun.reflect.NativeMethodAccessorImpl.invoke(NativeMethodAccessorImpl.java:62)
	at sun.reflect.DelegatingMethodAccessorImpl.invoke(DelegatingMethodAccessorImpl.java:43)
	at java.lang.reflect.Method.invoke(Method.java:497)
	at org.codehaus.plexus.classworlds.launcher.Launcher.launchStandard(Launcher.java:330)
	at org.codehaus.plexus.classworlds.launcher.Launcher.launch(Launcher.java:238)
	at jenkins.maven3.agent.Maven32Main.launch(Maven32Main.java:186)
	at sun.reflect.NativeMethodAccessorImpl.invoke0(Native Method)
	at sun.reflect.NativeMethodAccessorImpl.invoke(NativeMethodAccessorImpl.java:62)
	at sun.reflect.DelegatingMethodAccessorImpl.invoke(DelegatingMethodAccessorImpl.java:43)
	at java.lang.reflect.Method.invoke(Method.java:497)
	at hudson.maven.Maven3Builder.call(Maven3Builder.java:136)
	at hudson.maven.Maven3Builder.call(Maven3Builder.java:71)
	at hudson.remoting.UserRequest.perform(UserRequest.java:120)
	at hudson.remoting.UserRequest.perform(UserRequest.java:48)
	at hudson.remoting.Request$2.run(Request.java:326)
	at hudson.remoting.InterceptingExecutorService$1.call(InterceptingExecutorService.java:68)
	at java.util.concurrent.FutureTask.run(FutureTask.java:266)
	at java.util.concurrent.ThreadPoolExecutor.runWorker(ThreadPoolExecutor.java:1142)
	at java.util.concurrent.ThreadPoolExecutor$Worker.run(ThreadPoolExecutor.java:617)
	at java.lang.Thread.run(Thread.java:745)
Caused by: org.apache.maven.plugin.MojoFailureException: I/O operation failed
	at org.eluder.coveralls.maven.plugin.CoverallsReportMojo.execute(CoverallsReportMojo.java:249)
	at org.apache.maven.plugin.DefaultBuildPluginManager.executeMojo(DefaultBuildPluginManager.java:134)
	at org.apache.maven.lifecycle.internal.MojoExecutor.execute(MojoExecutor.java:208)
	... 31 more
Caused by: java.io.IOException: No source found for org/apache/beam/sdk/runners/worker/AutoValue_IsmFormat_Footer.java
	at org.eluder.coveralls.maven.plugin.source.MultiSourceLoader.load(MultiSourceLoader.java:52)
	at org.eluder.coveralls.maven.plugin.parser.AbstractXmlEventParser.loadSource(AbstractXmlEventParser.java:106)
	at org.eluder.coveralls.maven.plugin.parser.JaCoCoParser.onEvent(JaCoCoParser.java:56)
	at org.eluder.coveralls.maven.plugin.parser.AbstractXmlEventParser.parse(AbstractXmlEventParser.java:64)
	at org.eluder.coveralls.maven.plugin.CoverallsReportMojo.writeCoveralls(CoverallsReportMojo.java:366)
	at org.eluder.coveralls.maven.plugin.CoverallsReportMojo.execute(CoverallsReportMojo.java:240)
	... 33 more
[ERROR] 
[ERROR] Re-run Maven using the -X switch to enable full debug logging.
[ERROR] 
[ERROR] For more information about the errors and possible solutions, please read the following
articles:
[ERROR] [Help 1] http://cwiki.apache.org/confluence/display/MAVEN/MojoFailureException
[JENKINS] Archiving <https://builds.apache.org/job/beam_PostCommit_MavenVerify/ws/runners/spark/pom.xml>
to org.apache.beam/spark-runner/0.1.0-incubating-SNAPSHOT/spark-runner-0.1.0-incubating-SNAPSHOT.pom
[JENKINS] Archiving <https://builds.apache.org/job/beam_PostCommit_MavenVerify/ws/runners/spark/target/spark-runner-0.1.0-incubating-SNAPSHOT.jar>
to org.apache.beam/spark-runner/0.1.0-incubating-SNAPSHOT/spark-runner-0.1.0-incubating-SNAPSHOT.jar
[JENKINS] Archiving <https://builds.apache.org/job/beam_PostCommit_MavenVerify/ws/runners/spark/target/spark-runner-0.1.0-incubating-SNAPSHOT-sources.jar>
to org.apache.beam/spark-runner/0.1.0-incubating-SNAPSHOT/spark-runner-0.1.0-incubating-SNAPSHOT-sources.jar
[JENKINS] Archiving <https://builds.apache.org/job/beam_PostCommit_MavenVerify/ws/runners/spark/target/spark-runner-0.1.0-incubating-SNAPSHOT-javadoc.jar>
to org.apache.beam/spark-runner/0.1.0-incubating-SNAPSHOT/spark-runner-0.1.0-incubating-SNAPSHOT-javadoc.jar
[JENKINS] Archiving <https://builds.apache.org/job/beam_PostCommit_MavenVerify/ws/runners/spark/target/spark-runner-0.1.0-incubating-SNAPSHOT-spark-app.jar>
to org.apache.beam/spark-runner/0.1.0-incubating-SNAPSHOT/spark-runner-0.1.0-incubating-SNAPSHOT-spark-app.jar
[JENKINS] Archiving <https://builds.apache.org/job/beam_PostCommit_MavenVerify/ws/examples/java/pom.xml>
to org.apache.beam/java-examples-all/0.1.0-incubating-SNAPSHOT/java-examples-all-0.1.0-incubating-SNAPSHOT.pom
[JENKINS] Archiving <https://builds.apache.org/job/beam_PostCommit_MavenVerify/ws/examples/java/target/java-examples-all-0.1.0-incubating-SNAPSHOT.jar>
to org.apache.beam/java-examples-all/0.1.0-incubating-SNAPSHOT/java-examples-all-0.1.0-incubating-SNAPSHOT.jar
[JENKINS] Archiving <https://builds.apache.org/job/beam_PostCommit_MavenVerify/ws/examples/java/target/java-examples-all-0.1.0-incubating-SNAPSHOT-sources.jar>
to org.apache.beam/java-examples-all/0.1.0-incubating-SNAPSHOT/java-examples-all-0.1.0-incubating-SNAPSHOT-sources.jar
[JENKINS] Archiving <https://builds.apache.org/job/beam_PostCommit_MavenVerify/ws/examples/java/target/java-examples-all-0.1.0-incubating-SNAPSHOT-test-sources.jar>
to org.apache.beam/java-examples-all/0.1.0-incubating-SNAPSHOT/java-examples-all-0.1.0-incubating-SNAPSHOT-test-sources.jar
[JENKINS] Archiving <https://builds.apache.org/job/beam_PostCommit_MavenVerify/ws/examples/java/target/java-examples-all-0.1.0-incubating-SNAPSHOT-javadoc.jar>
to org.apache.beam/java-examples-all/0.1.0-incubating-SNAPSHOT/java-examples-all-0.1.0-incubating-SNAPSHOT-javadoc.jar
[JENKINS] Archiving <https://builds.apache.org/job/beam_PostCommit_MavenVerify/ws/examples/java/target/java-examples-all-0.1.0-incubating-SNAPSHOT-tests.jar>
to org.apache.beam/java-examples-all/0.1.0-incubating-SNAPSHOT/java-examples-all-0.1.0-incubating-SNAPSHOT-tests.jar
[JENKINS] Archiving <https://builds.apache.org/job/beam_PostCommit_MavenVerify/ws/runners/google-cloud-dataflow-java/dependency-reduced-pom.xml>
to org.apache.beam/google-cloud-dataflow-java-runner/0.1.0-incubating-SNAPSHOT/google-cloud-dataflow-java-runner-0.1.0-incubating-SNAPSHOT.pom
[JENKINS] Archiving <https://builds.apache.org/job/beam_PostCommit_MavenVerify/ws/runners/google-cloud-dataflow-java/target/google-cloud-dataflow-java-runner-0.1.0-incubating-SNAPSHOT.jar>
to org.apache.beam/google-cloud-dataflow-java-runner/0.1.0-incubating-SNAPSHOT/google-cloud-dataflow-java-runner-0.1.0-incubating-SNAPSHOT.jar
[JENKINS] Archiving <https://builds.apache.org/job/beam_PostCommit_MavenVerify/ws/runners/google-cloud-dataflow-java/target/google-cloud-dataflow-java-runner-0.1.0-incubating-SNAPSHOT-sources.jar>
to org.apache.beam/google-cloud-dataflow-java-runner/0.1.0-incubating-SNAPSHOT/google-cloud-dataflow-java-runner-0.1.0-incubating-SNAPSHOT-sources.jar
[JENKINS] Archiving <https://builds.apache.org/job/beam_PostCommit_MavenVerify/ws/runners/google-cloud-dataflow-java/target/google-cloud-dataflow-java-runner-0.1.0-incubating-SNAPSHOT-test-sources.jar>
to org.apache.beam/google-cloud-dataflow-java-runner/0.1.0-incubating-SNAPSHOT/google-cloud-dataflow-java-runner-0.1.0-incubating-SNAPSHOT-test-sources.jar
[JENKINS] Archiving <https://builds.apache.org/job/beam_PostCommit_MavenVerify/ws/runners/google-cloud-dataflow-java/target/google-cloud-dataflow-java-runner-0.1.0-incubating-SNAPSHOT-tests.jar>
to org.apache.beam/google-cloud-dataflow-java-runner/0.1.0-incubating-SNAPSHOT/google-cloud-dataflow-java-runner-0.1.0-incubating-SNAPSHOT-tests.jar
[JENKINS] Archiving <https://builds.apache.org/job/beam_PostCommit_MavenVerify/ws/runners/google-cloud-dataflow-java/target/google-cloud-dataflow-java-runner-0.1.0-incubating-SNAPSHOT-javadoc.jar>
to org.apache.beam/google-cloud-dataflow-java-runner/0.1.0-incubating-SNAPSHOT/google-cloud-dataflow-java-runner-0.1.0-incubating-SNAPSHOT-javadoc.jar
[JENKINS] Archiving <https://builds.apache.org/job/beam_PostCommit_MavenVerify/ws/sdks/java/io/pom.xml>
to org.apache.beam/io-parent/0.1.0-incubating-SNAPSHOT/io-parent-0.1.0-incubating-SNAPSHOT.pom
[JENKINS] Archiving <https://builds.apache.org/job/beam_PostCommit_MavenVerify/ws/sdks/java/maven-archetypes/examples/pom.xml>
to org.apache.beam/maven-archetypes-examples/0.1.0-incubating-SNAPSHOT/maven-archetypes-examples-0.1.0-incubating-SNAPSHOT.pom
[JENKINS] Archiving <https://builds.apache.org/job/beam_PostCommit_MavenVerify/ws/sdks/java/maven-archetypes/examples/target/maven-archetypes-examples-0.1.0-incubating-SNAPSHOT.jar>
to org.apache.beam/maven-archetypes-examples/0.1.0-incubating-SNAPSHOT/maven-archetypes-examples-0.1.0-incubating-SNAPSHOT.jar
[JENKINS] Archiving <https://builds.apache.org/job/beam_PostCommit_MavenVerify/ws/sdks/java/pom.xml>
to org.apache.beam/java-sdk-parent/0.1.0-incubating-SNAPSHOT/java-sdk-parent-0.1.0-incubating-SNAPSHOT.pom
[JENKINS] Archiving <https://builds.apache.org/job/beam_PostCommit_MavenVerify/ws/pom.xml>
to org.apache.beam/parent/0.1.0-incubating-SNAPSHOT/parent-0.1.0-incubating-SNAPSHOT.pom
[JENKINS] Archiving <https://builds.apache.org/job/beam_PostCommit_MavenVerify/ws/sdks/java/maven-archetypes/starter/pom.xml>
to org.apache.beam/maven-archetypes-starter/0.1.0-incubating-SNAPSHOT/maven-archetypes-starter-0.1.0-incubating-SNAPSHOT.pom
[JENKINS] Archiving <https://builds.apache.org/job/beam_PostCommit_MavenVerify/ws/sdks/java/maven-archetypes/starter/target/maven-archetypes-starter-0.1.0-incubating-SNAPSHOT.jar>
to org.apache.beam/maven-archetypes-starter/0.1.0-incubating-SNAPSHOT/maven-archetypes-starter-0.1.0-incubating-SNAPSHOT.jar
[JENKINS] Archiving <https://builds.apache.org/job/beam_PostCommit_MavenVerify/ws/sdks/java/maven-archetypes/pom.xml>
to org.apache.beam/maven-archetypes-parent/0.1.0-incubating-SNAPSHOT/maven-archetypes-parent-0.1.0-incubating-SNAPSHOT.pom
[JENKINS] Archiving <https://builds.apache.org/job/beam_PostCommit_MavenVerify/ws/runners/flink/runner/pom.xml>
to org.apache.beam/flink-runner_2.10/0.1.0-incubating-SNAPSHOT/flink-runner_2.10-0.1.0-incubating-SNAPSHOT.pom
[JENKINS] Archiving <https://builds.apache.org/job/beam_PostCommit_MavenVerify/ws/runners/flink/runner/target/flink-runner_2.10-0.1.0-incubating-SNAPSHOT.jar>
to org.apache.beam/flink-runner_2.10/0.1.0-incubating-SNAPSHOT/flink-runner_2.10-0.1.0-incubating-SNAPSHOT.jar
[JENKINS] Archiving <https://builds.apache.org/job/beam_PostCommit_MavenVerify/ws/examples/pom.xml>
to org.apache.beam/examples-parent/0.1.0-incubating-SNAPSHOT/examples-parent-0.1.0-incubating-SNAPSHOT.pom
[JENKINS] Archiving <https://builds.apache.org/job/beam_PostCommit_MavenVerify/ws/sdks/pom.xml>
to org.apache.beam/sdks-parent/0.1.0-incubating-SNAPSHOT/sdks-parent-0.1.0-incubating-SNAPSHOT.pom
[JENKINS] Archiving <https://builds.apache.org/job/beam_PostCommit_MavenVerify/ws/runners/flink/examples/pom.xml>
to org.apache.beam/flink-runner-examples_2.10/0.1.0-incubating-SNAPSHOT/flink-runner-examples_2.10-0.1.0-incubating-SNAPSHOT.pom
[JENKINS] Archiving <https://builds.apache.org/job/beam_PostCommit_MavenVerify/ws/runners/flink/examples/target/flink-runner-examples_2.10-0.1.0-incubating-SNAPSHOT.jar>
to org.apache.beam/flink-runner-examples_2.10/0.1.0-incubating-SNAPSHOT/flink-runner-examples_2.10-0.1.0-incubating-SNAPSHOT.jar
[JENKINS] Archiving <https://builds.apache.org/job/beam_PostCommit_MavenVerify/ws/sdks/java/core/dependency-reduced-pom.xml>
to org.apache.beam/java-sdk-all/0.1.0-incubating-SNAPSHOT/java-sdk-all-0.1.0-incubating-SNAPSHOT.pom
[JENKINS] Archiving <https://builds.apache.org/job/beam_PostCommit_MavenVerify/ws/sdks/java/core/target/java-sdk-all-0.1.0-incubating-SNAPSHOT.jar>
to org.apache.beam/java-sdk-all/0.1.0-incubating-SNAPSHOT/java-sdk-all-0.1.0-incubating-SNAPSHOT.jar
[JENKINS] Archiving <https://builds.apache.org/job/beam_PostCommit_MavenVerify/ws/sdks/java/core/target/java-sdk-all-0.1.0-incubating-SNAPSHOT-sources.jar>
to org.apache.beam/java-sdk-all/0.1.0-incubating-SNAPSHOT/java-sdk-all-0.1.0-incubating-SNAPSHOT-sources.jar
[JENKINS] Archiving <https://builds.apache.org/job/beam_PostCommit_MavenVerify/ws/sdks/java/core/target/java-sdk-all-0.1.0-incubating-SNAPSHOT-test-sources.jar>
to org.apache.beam/java-sdk-all/0.1.0-incubating-SNAPSHOT/java-sdk-all-0.1.0-incubating-SNAPSHOT-test-sources.jar
[JENKINS] Archiving <https://builds.apache.org/job/beam_PostCommit_MavenVerify/ws/sdks/java/core/target/java-sdk-all-0.1.0-incubating-SNAPSHOT-tests.jar>
to org.apache.beam/java-sdk-all/0.1.0-incubating-SNAPSHOT/java-sdk-all-0.1.0-incubating-SNAPSHOT-tests.jar
[JENKINS] Archiving <https://builds.apache.org/job/beam_PostCommit_MavenVerify/ws/sdks/java/core/target/java-sdk-all-0.1.0-incubating-SNAPSHOT-javadoc.jar>
to org.apache.beam/java-sdk-all/0.1.0-incubating-SNAPSHOT/java-sdk-all-0.1.0-incubating-SNAPSHOT-javadoc.jar
[JENKINS] Archiving <https://builds.apache.org/job/beam_PostCommit_MavenVerify/ws/runners/pom.xml>
to org.apache.beam/runners-parent/0.1.0-incubating-SNAPSHOT/runners-parent-0.1.0-incubating-SNAPSHOT.pom
[JENKINS] Archiving <https://builds.apache.org/job/beam_PostCommit_MavenVerify/ws/runners/flink/pom.xml>
to org.apache.beam/flink-runner-parent/0.1.0-incubating-SNAPSHOT/flink-runner-parent-0.1.0-incubating-SNAPSHOT.pom
[JENKINS] Archiving <https://builds.apache.org/job/beam_PostCommit_MavenVerify/ws/sdks/java/io/hdfs/pom.xml>
to org.apache.beam/hdfs/0.1.0-incubating-SNAPSHOT/hdfs-0.1.0-incubating-SNAPSHOT.pom
[JENKINS] Archiving <https://builds.apache.org/job/beam_PostCommit_MavenVerify/ws/sdks/java/io/hdfs/target/hdfs-0.1.0-incubating-SNAPSHOT.jar>
to org.apache.beam/hdfs/0.1.0-incubating-SNAPSHOT/hdfs-0.1.0-incubating-SNAPSHOT.jar
Sending e-mails to: commits@beam.incubator.apache.org
channel stopped

Mime
View raw message