beam-commits mailing list archives

Site index · List index
Message view « Date » · « Thread »
Top « Date » · « Thread »
From Apache Jenkins Server <jenk...@builds.apache.org>
Subject Build failed in Jenkins: beam #6
Date Thu, 03 Mar 2016 03:17:39 GMT
See <https://builds.apache.org/job/beam/6/changes>

Changes:

[klk] [BEAM-80] Decide EARLY or ON_TIME based on input watermark

[klk] Fix up checkstyle

------------------------------------------
Started by an SCM change
[EnvInject] - Loading node environment variables.
Building remotely on H11 (docker Ubuntu ubuntu yahoo-not-h2) in workspace <https://builds.apache.org/job/beam/ws/>
 > git rev-parse --is-inside-work-tree # timeout=10
Fetching changes from the remote Git repository
 > git config remote.origin.url https://git-wip-us.apache.org/repos/asf/incubator-beam.git
# timeout=10
Fetching upstream changes from https://git-wip-us.apache.org/repos/asf/incubator-beam.git
 > git --version # timeout=10
 > git -c core.askpass=true fetch --tags --progress https://git-wip-us.apache.org/repos/asf/incubator-beam.git
+refs/heads/*:refs/remotes/origin/*
 > git rev-parse refs/remotes/origin/master^{commit} # timeout=10
 > git rev-parse refs/remotes/origin/origin/master^{commit} # timeout=10
Checking out Revision 7582212f58deb8628dfabfb26b63c9391ee3209a (refs/remotes/origin/master)
 > git config core.sparsecheckout # timeout=10
 > git checkout -f 7582212f58deb8628dfabfb26b63c9391ee3209a
 > git rev-list f87f35b7022b36b8db04c4284df3f4b94dad7700 # timeout=10
Parsing POMs
Established TCP socket on 47214
maven32-agent.jar already up to date
maven32-interceptor.jar already up to date
maven3-interceptor-commons.jar already up to date
[beam] $ /home/jenkins/jenkins-slave/tools/hudson.model.JDK/jdk1.8.0_66/bin/java -Xmx2g -Xms256m
-XX:MaxPermSize=512m -cp /home/jenkins/jenkins-slave/maven32-agent.jar:/home/jenkins/jenkins-slave/tools/hudson.tasks.Maven_MavenInstallation/maven-3.3.3/boot/plexus-classworlds-2.5.2.jar:/home/jenkins/jenkins-slave/tools/hudson.tasks.Maven_MavenInstallation/maven-3.3.3/conf/logging
jenkins.maven3.agent.Maven32Main /home/jenkins/jenkins-slave/tools/hudson.tasks.Maven_MavenInstallation/maven-3.3.3
/home/jenkins/jenkins-slave/slave.jar /home/jenkins/jenkins-slave/maven32-interceptor.jar
/home/jenkins/jenkins-slave/maven3-interceptor-commons.jar 47214
Java HotSpot(TM) 64-Bit Server VM warning: ignoring option MaxPermSize=512m; support was removed
in 8.0
<===[JENKINS REMOTING CAPACITY]===>   channel started
Executing Maven:  -B -f <https://builds.apache.org/job/beam/ws/pom.xml> -Dmaven.repo.local=/home/jenkins/jenkins-slave/maven-repositories/1
-B -e clean deploy
[INFO] Error stacktraces are turned on.
[INFO] Scanning for projects...
[INFO] ------------------------------------------------------------------------
[INFO] Reactor Build Order:
[INFO] 
[INFO] Google Cloud Dataflow Java SDK - Parent
[INFO] Google Cloud Dataflow Java SDK - All
[INFO] Google Cloud Dataflow Java Examples - All
[INFO] Google Cloud Dataflow Java SDK - Starter Archetype
[INFO] Google Cloud Dataflow Java SDK - Examples Archetype
[INFO]                                                                         
[INFO] ------------------------------------------------------------------------
[INFO] Building Google Cloud Dataflow Java SDK - Parent 1.5.0-SNAPSHOT
[INFO] ------------------------------------------------------------------------
[INFO] 
[INFO] --- maven-clean-plugin:2.5:clean (default-clean) @ google-cloud-dataflow-java-sdk-parent
---
[INFO] 
[INFO] --- maven-install-plugin:2.4:install (default-install) @ google-cloud-dataflow-java-sdk-parent
---
[INFO] Installing <https://builds.apache.org/job/beam/ws/pom.xml> to /home/jenkins/jenkins-slave/maven-repositories/1/com/google/cloud/dataflow/google-cloud-dataflow-java-sdk-parent/1.5.0-SNAPSHOT/google-cloud-dataflow-java-sdk-parent-1.5.0-SNAPSHOT.pom
[INFO] 
[INFO] --- maven-deploy-plugin:2.7:deploy (default-deploy) @ google-cloud-dataflow-java-sdk-parent
---
[INFO] Downloading: http://oss.sonatype.org/content/repositories/google-snapshots/com/google/cloud/dataflow/google-cloud-dataflow-java-sdk-parent/1.5.0-SNAPSHOT/maven-metadata.xml
[INFO] Uploading: http://oss.sonatype.org/content/repositories/google-snapshots/com/google/cloud/dataflow/google-cloud-dataflow-java-sdk-parent/1.5.0-SNAPSHOT/google-cloud-dataflow-java-sdk-parent-1.5.0-20160303.031740-1.pom
[INFO] ------------------------------------------------------------------------
[INFO] Reactor Summary:
[INFO] 
[INFO] Google Cloud Dataflow Java SDK - Parent ............ FAILURE [  4.121 s]
[INFO] Google Cloud Dataflow Java SDK - All ............... SKIPPED
[INFO] Google Cloud Dataflow Java Examples - All .......... SKIPPED
[INFO] Google Cloud Dataflow Java SDK - Starter Archetype . SKIPPED
[INFO] Google Cloud Dataflow Java SDK - Examples Archetype  SKIPPED
[INFO] ------------------------------------------------------------------------
[INFO] BUILD FAILURE
[INFO] ------------------------------------------------------------------------
[INFO] Total time: 6.562 s
[INFO] Finished at: 2016-03-03T03:17:42+00:00
[INFO] Final Memory: 15M/269M
[INFO] ------------------------------------------------------------------------
[ERROR] Failed to execute goal org.apache.maven.plugins:maven-deploy-plugin:2.7:deploy (default-deploy)
on project google-cloud-dataflow-java-sdk-parent: Failed to deploy artifacts: Could not transfer
artifact com.google.cloud.dataflow:google-cloud-dataflow-java-sdk-parent:pom:1.5.0-20160303.031740-1
from/to google-snapshots (http://oss.sonatype.org/content/repositories/google-snapshots/):
Failed to transfer file: https://oss.sonatype.org/content/repositories/google-snapshots/com/google/cloud/dataflow/google-cloud-dataflow-java-sdk-parent/1.5.0-SNAPSHOT/google-cloud-dataflow-java-sdk-parent-1.5.0-20160303.031740-1.pom.
Return code is: 401, ReasonPhrase: Unauthorized. -> [Help 1]
org.apache.maven.lifecycle.LifecycleExecutionException: Failed to execute goal org.apache.maven.plugins:maven-deploy-plugin:2.7:deploy
(default-deploy) on project google-cloud-dataflow-java-sdk-parent: Failed to deploy artifacts:
Could not transfer artifact com.google.cloud.dataflow:google-cloud-dataflow-java-sdk-parent:pom:1.5.0-20160303.031740-1
from/to google-snapshots (http://oss.sonatype.org/content/repositories/google-snapshots/):
Failed to transfer file: https://oss.sonatype.org/content/repositories/google-snapshots/com/google/cloud/dataflow/google-cloud-dataflow-java-sdk-parent/1.5.0-SNAPSHOT/google-cloud-dataflow-java-sdk-parent-1.5.0-20160303.031740-1.pom.
Return code is: 401, ReasonPhrase: Unauthorized.
	at org.apache.maven.lifecycle.internal.MojoExecutor.execute(MojoExecutor.java:216)
	at org.apache.maven.lifecycle.internal.MojoExecutor.execute(MojoExecutor.java:153)
	at org.apache.maven.lifecycle.internal.MojoExecutor.execute(MojoExecutor.java:145)
	at org.apache.maven.lifecycle.internal.LifecycleModuleBuilder.buildProject(LifecycleModuleBuilder.java:116)
	at org.apache.maven.lifecycle.internal.LifecycleModuleBuilder.buildProject(LifecycleModuleBuilder.java:80)
	at org.apache.maven.lifecycle.internal.builder.singlethreaded.SingleThreadedBuilder.build(SingleThreadedBuilder.java:51)
	at org.apache.maven.lifecycle.internal.LifecycleStarter.execute(LifecycleStarter.java:128)
	at org.apache.maven.DefaultMaven.doExecute(DefaultMaven.java:307)
	at org.apache.maven.DefaultMaven.doExecute(DefaultMaven.java:193)
	at org.apache.maven.DefaultMaven.execute(DefaultMaven.java:106)
	at org.jvnet.hudson.maven3.launcher.Maven32Launcher.main(Maven32Launcher.java:132)
	at sun.reflect.NativeMethodAccessorImpl.invoke0(Native Method)
	at sun.reflect.NativeMethodAccessorImpl.invoke(NativeMethodAccessorImpl.java:62)
	at sun.reflect.DelegatingMethodAccessorImpl.invoke(DelegatingMethodAccessorImpl.java:43)
	at java.lang.reflect.Method.invoke(Method.java:497)
	at org.codehaus.plexus.classworlds.launcher.Launcher.launchStandard(Launcher.java:330)
	at org.codehaus.plexus.classworlds.launcher.Launcher.launch(Launcher.java:238)
	at jenkins.maven3.agent.Maven32Main.launch(Maven32Main.java:186)
	at sun.reflect.NativeMethodAccessorImpl.invoke0(Native Method)
	at sun.reflect.NativeMethodAccessorImpl.invoke(NativeMethodAccessorImpl.java:62)
	at sun.reflect.DelegatingMethodAccessorImpl.invoke(DelegatingMethodAccessorImpl.java:43)
	at java.lang.reflect.Method.invoke(Method.java:497)
	at hudson.maven.Maven3Builder.call(Maven3Builder.java:136)
	at hudson.maven.Maven3Builder.call(Maven3Builder.java:71)
	at hudson.remoting.UserRequest.perform(UserRequest.java:120)
	at hudson.remoting.UserRequest.perform(UserRequest.java:48)
	at hudson.remoting.Request$2.run(Request.java:326)
	at hudson.remoting.InterceptingExecutorService$1.call(InterceptingExecutorService.java:68)
	at java.util.concurrent.FutureTask.run(FutureTask.java:266)
	at java.util.concurrent.ThreadPoolExecutor.runWorker(ThreadPoolExecutor.java:1142)
	at java.util.concurrent.ThreadPoolExecutor$Worker.run(ThreadPoolExecutor.java:617)
	at java.lang.Thread.run(Thread.java:745)
Caused by: org.apache.maven.plugin.MojoExecutionException: Failed to deploy artifacts: Could
not transfer artifact com.google.cloud.dataflow:google-cloud-dataflow-java-sdk-parent:pom:1.5.0-20160303.031740-1
from/to google-snapshots (http://oss.sonatype.org/content/repositories/google-snapshots/):
Failed to transfer file: https://oss.sonatype.org/content/repositories/google-snapshots/com/google/cloud/dataflow/google-cloud-dataflow-java-sdk-parent/1.5.0-SNAPSHOT/google-cloud-dataflow-java-sdk-parent-1.5.0-20160303.031740-1.pom.
Return code is: 401, ReasonPhrase: Unauthorized.
	at org.apache.maven.plugin.deploy.DeployMojo.execute(DeployMojo.java:193)
	at org.apache.maven.plugin.DefaultBuildPluginManager.executeMojo(DefaultBuildPluginManager.java:134)
	at org.apache.maven.lifecycle.internal.MojoExecutor.execute(MojoExecutor.java:208)
	... 31 more
Caused by: org.apache.maven.artifact.deployer.ArtifactDeploymentException: Failed to deploy
artifacts: Could not transfer artifact com.google.cloud.dataflow:google-cloud-dataflow-java-sdk-parent:pom:1.5.0-20160303.031740-1
from/to google-snapshots (http://oss.sonatype.org/content/repositories/google-snapshots/):
Failed to transfer file: https://oss.sonatype.org/content/repositories/google-snapshots/com/google/cloud/dataflow/google-cloud-dataflow-java-sdk-parent/1.5.0-SNAPSHOT/google-cloud-dataflow-java-sdk-parent-1.5.0-20160303.031740-1.pom.
Return code is: 401, ReasonPhrase: Unauthorized.
	at org.apache.maven.artifact.deployer.DefaultArtifactDeployer.deploy(DefaultArtifactDeployer.java:143)
	at org.apache.maven.plugin.deploy.AbstractDeployMojo.deploy(AbstractDeployMojo.java:167)
	at org.apache.maven.plugin.deploy.DeployMojo.execute(DeployMojo.java:149)
	... 33 more
Caused by: org.eclipse.aether.deployment.DeploymentException: Failed to deploy artifacts:
Could not transfer artifact com.google.cloud.dataflow:google-cloud-dataflow-java-sdk-parent:pom:1.5.0-20160303.031740-1
from/to google-snapshots (http://oss.sonatype.org/content/repositories/google-snapshots/):
Failed to transfer file: https://oss.sonatype.org/content/repositories/google-snapshots/com/google/cloud/dataflow/google-cloud-dataflow-java-sdk-parent/1.5.0-SNAPSHOT/google-cloud-dataflow-java-sdk-parent-1.5.0-20160303.031740-1.pom.
Return code is: 401, ReasonPhrase: Unauthorized.
	at org.eclipse.aether.internal.impl.DefaultDeployer.deploy(DefaultDeployer.java:317)
	at org.eclipse.aether.internal.impl.DefaultDeployer.deploy(DefaultDeployer.java:245)
	at org.eclipse.aether.internal.impl.DefaultRepositorySystem.deploy(DefaultRepositorySystem.java:413)
	at org.apache.maven.artifact.deployer.DefaultArtifactDeployer.deploy(DefaultArtifactDeployer.java:139)
	... 35 more
Caused by: org.eclipse.aether.transfer.ArtifactTransferException: Could not transfer artifact
com.google.cloud.dataflow:google-cloud-dataflow-java-sdk-parent:pom:1.5.0-20160303.031740-1
from/to google-snapshots (http://oss.sonatype.org/content/repositories/google-snapshots/):
Failed to transfer file: https://oss.sonatype.org/content/repositories/google-snapshots/com/google/cloud/dataflow/google-cloud-dataflow-java-sdk-parent/1.5.0-SNAPSHOT/google-cloud-dataflow-java-sdk-parent-1.5.0-20160303.031740-1.pom.
Return code is: 401, ReasonPhrase: Unauthorized.
	at org.eclipse.aether.connector.basic.ArtifactTransportListener.transferFailed(ArtifactTransportListener.java:43)
	at org.eclipse.aether.connector.basic.BasicRepositoryConnector$TaskRunner.run(BasicRepositoryConnector.java:355)
	at org.eclipse.aether.connector.basic.BasicRepositoryConnector.put(BasicRepositoryConnector.java:274)
	at org.eclipse.aether.internal.impl.DefaultDeployer.deploy(DefaultDeployer.java:311)
	... 38 more
Caused by: org.apache.maven.wagon.TransferFailedException: Failed to transfer file: https://oss.sonatype.org/content/repositories/google-snapshots/com/google/cloud/dataflow/google-cloud-dataflow-java-sdk-parent/1.5.0-SNAPSHOT/google-cloud-dataflow-java-sdk-parent-1.5.0-20160303.031740-1.pom.
Return code is: 401, ReasonPhrase: Unauthorized.
	at org.apache.maven.wagon.providers.http.AbstractHttpClientWagon.put(AbstractHttpClientWagon.java:627)
	at org.apache.maven.wagon.providers.http.AbstractHttpClientWagon.put(AbstractHttpClientWagon.java:541)
	at org.apache.maven.wagon.providers.http.AbstractHttpClientWagon.put(AbstractHttpClientWagon.java:613)
	at org.apache.maven.wagon.providers.http.AbstractHttpClientWagon.put(AbstractHttpClientWagon.java:541)
	at org.apache.maven.wagon.providers.http.AbstractHttpClientWagon.put(AbstractHttpClientWagon.java:523)
	at org.apache.maven.wagon.providers.http.AbstractHttpClientWagon.put(AbstractHttpClientWagon.java:517)
	at org.apache.maven.wagon.providers.http.AbstractHttpClientWagon.put(AbstractHttpClientWagon.java:497)
	at org.eclipse.aether.transport.wagon.WagonTransporter$PutTaskRunner.run(WagonTransporter.java:644)
	at org.eclipse.aether.transport.wagon.WagonTransporter.execute(WagonTransporter.java:427)
	at org.eclipse.aether.transport.wagon.WagonTransporter.put(WagonTransporter.java:410)
	at org.eclipse.aether.connector.basic.BasicRepositoryConnector$PutTaskRunner.runTask(BasicRepositoryConnector.java:510)
	at org.eclipse.aether.connector.basic.BasicRepositoryConnector$TaskRunner.run(BasicRepositoryConnector.java:350)
	... 40 more
[ERROR] 
[ERROR] Re-run Maven using the -X switch to enable full debug logging.
[ERROR] 
[ERROR] For more information about the errors and possible solutions, please read the following
articles:
[ERROR] [Help 1] http://cwiki.apache.org/confluence/display/MAVEN/MojoExecutionException
[JENKINS] Archiving <https://builds.apache.org/job/beam/ws/maven-archetypes/starter/pom.xml>
to com.google.cloud.dataflow/google-cloud-dataflow-java-archetypes-starter/1.5.0-SNAPSHOT/google-cloud-dataflow-java-archetypes-starter-1.5.0-SNAPSHOT.pom
No prior successful build to compare, so performing full copy of artifacts
[JENKINS] Archiving <https://builds.apache.org/job/beam/ws/pom.xml> to com.google.cloud.dataflow/google-cloud-dataflow-java-sdk-parent/1.5.0-SNAPSHOT/google-cloud-dataflow-java-sdk-parent-1.5.0-SNAPSHOT.pom
No prior successful build to compare, so performing full copy of artifacts
[JENKINS] Archiving <https://builds.apache.org/job/beam/ws/examples/pom.xml> to com.google.cloud.dataflow/google-cloud-dataflow-java-examples-all/1.5.0-SNAPSHOT/google-cloud-dataflow-java-examples-all-1.5.0-SNAPSHOT.pom
No prior successful build to compare, so performing full copy of artifacts
[JENKINS] Archiving <https://builds.apache.org/job/beam/ws/sdk/pom.xml> to com.google.cloud.dataflow/google-cloud-dataflow-java-sdk-all/1.5.0-SNAPSHOT/google-cloud-dataflow-java-sdk-all-1.5.0-SNAPSHOT.pom
No prior successful build to compare, so performing full copy of artifacts
[JENKINS] Archiving <https://builds.apache.org/job/beam/ws/maven-archetypes/examples/pom.xml>
to com.google.cloud.dataflow/google-cloud-dataflow-java-archetypes-examples/1.5.0-SNAPSHOT/google-cloud-dataflow-java-archetypes-examples-1.5.0-SNAPSHOT.pom
No prior successful build to compare, so performing full copy of artifacts
Sending e-mails to: commits@beam.incubator.apache.org
channel stopped
ERROR: Unable to send to address: alex@mygrid.org.uk@bf327186-88b3-11dd-a302-d386e5130c1c
javax.mail.internet.AddressException: Domain contains illegal character in string ``alex@mygrid.org.uk@bf327186-88b3-11dd-a302-d386e5130c1c''
	at javax.mail.internet.InternetAddress.checkAddress(InternetAddress.java:1269)
	at javax.mail.internet.InternetAddress.parse(InternetAddress.java:1091)
	at javax.mail.internet.InternetAddress.parse(InternetAddress.java:633)
	at javax.mail.internet.InternetAddress.<init>(InternetAddress.java:111)
	at hudson.tasks.Mailer.stringToAddress(Mailer.java:206)
	at jenkins.plugins.mailer.tasks.MimeMessageBuilder.toNormalizedAddress(MimeMessageBuilder.java:262)
	at jenkins.plugins.mailer.tasks.MimeMessageBuilder.addRecipients(MimeMessageBuilder.java:141)
	at jenkins.plugins.mailer.tasks.MimeMessageBuilder.addRecipients(MimeMessageBuilder.java:133)
	at hudson.tasks.MailSender.createEmptyMail(MailSender.java:388)
	at hudson.tasks.MailSender.createFailureMail(MailSender.java:262)
	at hudson.tasks.MailSender.createMail(MailSender.java:180)
	at hudson.tasks.MailSender.run(MailSender.java:109)
	at hudson.tasks.MailSender.execute(MailSender.java:103)
	at hudson.maven.MavenModuleSetBuild$MavenModuleSetBuildExecution.cleanUp(MavenModuleSetBuild.java:1065)
	at hudson.model.Run.execute(Run.java:1785)
	at hudson.maven.MavenModuleSetBuild.run(MavenModuleSetBuild.java:531)
	at hudson.model.ResourceController.execute(ResourceController.java:98)
	at hudson.model.Executor.run(Executor.java:410)

Mime
View raw message