beam-builds mailing list archives

Site index · List index
Message view « Date » · « Thread »
Top « Date » · « Thread »
From Apache Jenkins Server <jenk...@builds.apache.org>
Subject Build failed in Jenkins: beam_PostCommit_XVR_Samza #199
Date Wed, 08 Sep 2021 13:05:02 GMT
See <https://ci-beam.apache.org/job/beam_PostCommit_XVR_Samza/199/display/redirect>

Changes:


------------------------------------------
[...truncated 557.54 KB...]
fasteners==0.16.3
flatbuffers==1.12
freezegun==0.3.15
future==0.18.2
gast==0.4.0
google-api-core==1.22.2
google-api-python-client==2.19.1
google-apitools==0.5.31
google-auth==1.31.0
google-auth-httplib2==0.1.0
google-auth-oauthlib==0.4.6
google-cloud-bigquery==1.26.1
google-cloud-bigtable==1.0.0
google-cloud-core==1.4.1
google-cloud-datastore==1.15.3
google-cloud-dlp==0.13.0
google-cloud-language==1.3.0
google-cloud-profiler==3.0.4
google-cloud-pubsub==1.0.2
google-cloud-recommendations-ai==0.2.0
google-cloud-spanner==1.13.0
google-cloud-videointelligence==1.13.0
google-cloud-vision==0.42.0
google-crc32c==1.1.5
google-pasta==0.2.0
google-python-cloud-debugger==2.15
google-resumable-media==1.3.3
googleapis-common-protos==1.53.0
grpc-google-iam-v1==0.12.3
grpcio==1.34.0
grpcio-gcp==0.2.2
guppy3==3.0.10
h5py==3.1.0
hdfs==2.5.8
httplib2==0.19.1
idna==2.10
joblib==1.0.1
keras-nightly==2.5.0.dev2021032900
Keras-Preprocessing==1.1.2
Markdown==3.3.4
mmh3==2.5.1
more-itertools==8.9.0
nltk==3.5
numpy==1.19.5
oauth2client==4.1.3
oauthlib==3.1.1
opt-einsum==3.3.0
orjson==3.6.1
packaging==21.0
pandas==1.2.4
Pillow==7.2.0
pip==21.2.4
pluggy==0.13.1
proto-plus==1.19.0
protobuf==3.12.2
protorpc==0.12.0
PTable==0.9.2
py==1.10.0
pyarrow==3.0.0
pyasn1==0.4.8
pyasn1-modules==0.2.8
pydot==1.4.1
PyHamcrest==1.10.1
pymongo==3.10.1
pyparsing==2.4.7
pytest==4.6.11
python-dateutil==2.8.1
python-gflags==3.1.2
python-snappy==0.5.4
pytz==2020.1
PyYAML==5.4
regex==2021.8.28
requests==2.24.0
requests-oauthlib==1.3.0
rsa==4.7.2
scikit-learn==0.24.1
scipy==1.4.1
setuptools==57.5.0
six==1.15.0
soupsieve==2.2.1
tenacity==8.0.1
tensorboard==2.6.0
tensorboard-data-server==0.6.1
tensorboard-plugin-wit==1.8.0
tensorflow==2.5.0
tensorflow-estimator==2.5.0
termcolor==1.1.0
threadpoolctl==2.2.0
tqdm==4.62.2
typing-extensions==3.7.4.3
uritemplate==3.0.1
urllib3==1.25.11
wcwidth==0.2.5
Werkzeug==2.0.1
wheel==0.37.0
wrapt==1.12.1
Removing intermediate container a6d79d976881
 ---> b98f4cf7c2f1
Step 22/27 : RUN pip check
 ---> Running in 42a2001cb3bb
No broken requirements found.
Removing intermediate container 42a2001cb3bb
 ---> d64e6a2d772b
Step 23/27 : COPY target/LICENSE /opt/apache/beam/
 ---> 09b2845457ac
Step 24/27 : COPY target/LICENSE.python /opt/apache/beam/
 ---> 7ab30ab2dfbd
Step 25/27 : COPY target/NOTICE /opt/apache/beam/
 ---> ee2b47840363
Step 26/27 : ADD target/launcher/linux_amd64/boot /opt/apache/beam/
 ---> 6d34980ead63
Step 27/27 : ENTRYPOINT ["/opt/apache/beam/boot"]
 ---> Running in c79734e54001
Removing intermediate container c79734e54001
 ---> 21b969da53a7
Successfully built 21b969da53a7
Successfully tagged apache/beam_python3.8_sdk:2.34.0.dev

> Task :runners:samza:job-server:validatesCrossLanguageRunnerSetup
Launching Java expansion service @ 38791
Launching Python expansion service @ 35287

> Task :runners:samza:job-server:validatesCrossLanguageRunnerJavaUsingJava
> Task :runners:samza:job-server:validatesCrossLanguageRunnerJavaUsingPython

org.apache.beam.runners.core.construction.ValidateRunnerXlangTest > combinePerKeyTest FAILED
    org.apache.beam.vendor.guava.v26_0_jre.com.google.common.util.concurrent.UncheckedExecutionException
at ValidateRunnerXlangTest.java:277
        Caused by: org.apache.beam.vendor.guava.v26_0_jre.com.google.common.util.concurrent.UncheckedExecutionException
at ValidateRunnerXlangTest.java:277
            Caused by: org.apache.beam.vendor.guava.v26_0_jre.com.google.common.util.concurrent.UncheckedExecutionException
at ValidateRunnerXlangTest.java:277
                Caused by: java.lang.IllegalArgumentException at ValidateRunnerXlangTest.java:277
    java.lang.NullPointerException at ValidateRunnerXlangTest.java:125

8 tests completed, 1 failed

> Task :runners:samza:job-server:validatesCrossLanguageRunnerJavaUsingPython FAILED
> Task :runners:samza:job-server:validatesCrossLanguageRunnerJavaUsingPythonOnly

> Task :runners:samza:job-server:validatesCrossLanguageRunnerPythonUsingJava
>>> RUNNING integration tests with pipeline options: --runner=PortableRunner --job_endpoint=localhost:35561
--environment_cache_millis=10000 --experiments=beam_fn_api
>>>   pytest options: 
>>>   collect markers: -m=xlang_transforms
============================= test session starts ==============================
platform linux -- Python 3.8.5, pytest-4.6.11, py-1.10.0, pluggy-0.13.1
rootdir: <https://ci-beam.apache.org/job/beam_PostCommit_XVR_Samza/ws/src/sdks/python,>
inifile: pytest.ini
plugins: xdist-1.34.0, timeout-1.4.2, forked-1.3.0, requests-mock-1.9.3
timeout: 600.0s
timeout method: signal
timeout func_only: False
collected 4992 items / 4984 deselected / 8 selected

apache_beam/io/external/generate_sequence_test.py .                      [ 12%]
apache_beam/transforms/validate_runner_xlang_test.py .......             [100%]

=============================== warnings summary ===============================
apache_beam/io/filesystems_test.py:54
  <https://ci-beam.apache.org/job/beam_PostCommit_XVR_Samza/ws/src/sdks/python/apache_beam/io/filesystems_test.py>:54:
DeprecationWarning: invalid escape sequence \c
    self.assertIsNone(FileSystems.get_scheme('c:\\abc\cdf'))  # pylint: disable=anomalous-backslash-in-string

apache_beam/io/filesystems_test.py:62
  <https://ci-beam.apache.org/job/beam_PostCommit_XVR_Samza/ws/src/sdks/python/apache_beam/io/filesystems_test.py>:62:
DeprecationWarning: invalid escape sequence \d
    self.assertTrue(isinstance(FileSystems.get_filesystem('c:\\abc\def'),  # pylint: disable=anomalous-backslash-in-string

<https://ci-beam.apache.org/job/beam_PostCommit_XVR_Samza/ws/src/build/gradleenv/1922375555/lib/python3.8/site-packages/tenacity/_asyncio.py>:42
  <https://ci-beam.apache.org/job/beam_PostCommit_XVR_Samza/ws/src/build/gradleenv/1922375555/lib/python3.8/site-packages/tenacity/_asyncio.py>:42:
DeprecationWarning: "@coroutine" decorator is deprecated since Python 3.8, use "async def"
instead
    def call(self, fn, *args, **kwargs):

-- Docs: https://docs.pytest.org/en/latest/warnings.html
- generated xml file: <https://ci-beam.apache.org/job/beam_PostCommit_XVR_Samza/ws/src/sdks/python/pytest_xlangValidateRunner.xml>
-
============ 8 passed, 4984 deselected, 3 warnings in 94.54 seconds ============

> Task :runners:samza:job-server:validatesCrossLanguageRunnerPythonUsingPython
>>> RUNNING integration tests with pipeline options: --runner=PortableRunner --job_endpoint=localhost:35561
--environment_cache_millis=10000 --experiments=beam_fn_api
>>>   pytest options: 
>>>   collect markers: -m=xlang_transforms
============================= test session starts ==============================
platform linux -- Python 3.8.5, pytest-4.6.11, py-1.10.0, pluggy-0.13.1
rootdir: <https://ci-beam.apache.org/job/beam_PostCommit_XVR_Samza/ws/src/sdks/python,>
inifile: pytest.ini
plugins: xdist-1.34.0, timeout-1.4.2, forked-1.3.0, requests-mock-1.9.3
timeout: 600.0s
timeout method: signal
timeout func_only: False
collected 4992 items / 4984 deselected / 8 selected

apache_beam/io/external/generate_sequence_test.py .                      [ 12%]
apache_beam/transforms/validate_runner_xlang_test.py .......             [100%]

=============================== warnings summary ===============================
<https://ci-beam.apache.org/job/beam_PostCommit_XVR_Samza/ws/src/build/gradleenv/1922375555/lib/python3.8/site-packages/tenacity/_asyncio.py>:42
  <https://ci-beam.apache.org/job/beam_PostCommit_XVR_Samza/ws/src/build/gradleenv/1922375555/lib/python3.8/site-packages/tenacity/_asyncio.py>:42:
DeprecationWarning: "@coroutine" decorator is deprecated since Python 3.8, use "async def"
instead
    def call(self, fn, *args, **kwargs):

-- Docs: https://docs.pytest.org/en/latest/warnings.html
- generated xml file: <https://ci-beam.apache.org/job/beam_PostCommit_XVR_Samza/ws/src/sdks/python/pytest_xlangValidateRunner.xml>
-
============ 8 passed, 4984 deselected, 1 warnings in 53.34 seconds ============

> Task :runners:samza:job-server:validatesCrossLanguageRunnerPythonUsingSql
>>> RUNNING integration tests with pipeline options: --runner=PortableRunner --job_endpoint=localhost:35561
--environment_cache_millis=10000 --experiments=beam_fn_api
>>>   pytest options: 
>>>   collect markers: -m=xlang_sql_expansion_service
============================= test session starts ==============================
platform linux -- Python 3.8.5, pytest-4.6.11, py-1.10.0, pluggy-0.13.1
rootdir: <https://ci-beam.apache.org/job/beam_PostCommit_XVR_Samza/ws/src/sdks/python,>
inifile: pytest.ini
plugins: xdist-1.34.0, timeout-1.4.2, forked-1.3.0, requests-mock-1.9.3
timeout: 600.0s
timeout method: signal
timeout func_only: False
collected 4992 items / 4983 deselected / 9 selected

apache_beam/transforms/sql_test.py .........                             [100%]

=============================== warnings summary ===============================
<https://ci-beam.apache.org/job/beam_PostCommit_XVR_Samza/ws/src/build/gradleenv/1922375555/lib/python3.8/site-packages/tenacity/_asyncio.py>:42
  <https://ci-beam.apache.org/job/beam_PostCommit_XVR_Samza/ws/src/build/gradleenv/1922375555/lib/python3.8/site-packages/tenacity/_asyncio.py>:42:
DeprecationWarning: "@coroutine" decorator is deprecated since Python 3.8, use "async def"
instead
    def call(self, fn, *args, **kwargs):

-- Docs: https://docs.pytest.org/en/latest/warnings.html
- generated xml file: <https://ci-beam.apache.org/job/beam_PostCommit_XVR_Samza/ws/src/sdks/python/pytest_xlangSqlValidateRunner.xml>
-
=========== 9 passed, 4983 deselected, 1 warnings in 192.24 seconds ============

> Task :runners:samza:job-server:validatesCrossLanguageRunnerCleanup
Stopping expansion service pid: 13256.
Stopping expansion service pid: 13259.

> Task :runners:samza:job-server:samzaJobServerCleanup
Stopping job server pid: 5333.

FAILURE: Build failed with an exception.

* What went wrong:
Execution failed for task ':runners:samza:job-server:validatesCrossLanguageRunnerJavaUsingPython'.
> There were failing tests. See the report at: file://<https://ci-beam.apache.org/job/beam_PostCommit_XVR_Samza/ws/src/runners/samza/job-server/build/reports/tests/validatesCrossLanguageRunnerJavaUsingPython/index.html>

* Try:
Run with --stacktrace option to get the stack trace. Run with --info or --debug option to
get more log output. Run with --scan to get full insights.

* Get more help at https://help.gradle.org

Deprecated Gradle features were used in this build, making it incompatible with Gradle 7.0.
Use '--warning-mode all' to show the individual deprecation warnings.
See https://docs.gradle.org/6.8.3/userguide/command_line_interface.html#sec:command_line_warnings

BUILD FAILED in 23m 51s
166 actionable tasks: 29 executed, 137 up-to-date

Publishing build scan...
https://gradle.com/s/72b4hsmnn3kuo

Build step 'Invoke Gradle script' changed build result to FAILURE
Build step 'Invoke Gradle script' marked build as failure

---------------------------------------------------------------------
To unsubscribe, e-mail: builds-unsubscribe@beam.apache.org
For additional commands, e-mail: builds-help@beam.apache.org


Mime
View raw message