beam-builds mailing list archives

Site index · List index
Message view « Date » · « Thread »
Top « Date » · « Thread »
From Apache Jenkins Server <jenk...@builds.apache.org>
Subject Build failed in Jenkins: beam_PostCommit_XVR_Dataflow #786
Date Sun, 30 May 2021 00:12:25 GMT
See <https://ci-beam.apache.org/job/beam_PostCommit_XVR_Dataflow/786/display/redirect>

Changes:


------------------------------------------
[...truncated 670.70 KB...]
    result = p.apply(self, pvalueish, label)
  File "<https://ci-beam.apache.org/job/beam_PostCommit_XVR_Dataflow/ws/src/sdks/python/apache_beam/pipeline.py",>
line 694, in apply
    pvalueish_result = self.runner.apply(transform, pvalueish, self._options)
  File "<https://ci-beam.apache.org/job/beam_PostCommit_XVR_Dataflow/ws/src/sdks/python/apache_beam/runners/dataflow/dataflow_runner.py",>
line 141, in apply
    return super(DataflowRunner, self).apply(transform, input, options)
  File "<https://ci-beam.apache.org/job/beam_PostCommit_XVR_Dataflow/ws/src/sdks/python/apache_beam/runners/runner.py",>
line 185, in apply
    return m(transform, input, options)
  File "<https://ci-beam.apache.org/job/beam_PostCommit_XVR_Dataflow/ws/src/sdks/python/apache_beam/runners/runner.py",>
line 215, in apply_PTransform
    return transform.expand(input)
  File "<https://ci-beam.apache.org/job/beam_PostCommit_XVR_Dataflow/ws/src/sdks/python/apache_beam/transforms/external.py",>
line 295, in expand
    response = service.Expand(request)
  File "<https://ci-beam.apache.org/job/beam_PostCommit_XVR_Dataflow/ws/src/build/gradleenv/1922375555/lib/python3.6/site-packages/grpc/_channel.py",>
line 946, in __call__
    return _end_unary_response_blocking(state, call, False, None)
  File "<https://ci-beam.apache.org/job/beam_PostCommit_XVR_Dataflow/ws/src/build/gradleenv/1922375555/lib/python3.6/site-packages/grpc/_channel.py",>
line 849, in _end_unary_response_blocking
    raise _InactiveRpcError(state)
grpc._channel._InactiveRpcError: <_InactiveRpcError of RPC that terminated with:
	status = StatusCode.UNIMPLEMENTED
	details = "Method not found: org.apache.beam.model.expansion.v1.ExpansionService/Expand"
	debug_error_string = "{"created":"@1622333539.243063025","description":"Error received from
peer ipv4:127.0.0.1:18091","file":"src/core/lib/surface/call.cc","file_line":1066,"grpc_message":"Method
not found: org.apache.beam.model.expansion.v1.ExpansionService/Expand","grpc_status":12}"
>

======================================================================
ERROR: test_combine_globally (apache_beam.transforms.validate_runner_xlang_test.ValidateRunnerXlangTest)
----------------------------------------------------------------------
Traceback (most recent call last):
  File "<https://ci-beam.apache.org/job/beam_PostCommit_XVR_Dataflow/ws/src/sdks/python/apache_beam/transforms/validate_runner_xlang_test.py",>
line 270, in test_combine_globally
    test_pipeline or self.create_pipeline())
  File "<https://ci-beam.apache.org/job/beam_PostCommit_XVR_Dataflow/ws/src/sdks/python/apache_beam/transforms/validate_runner_xlang_test.py",>
line 181, in run_combine_globally
    TEST_COMGL_URN, None, self.expansion_service))
  File "<https://ci-beam.apache.org/job/beam_PostCommit_XVR_Dataflow/ws/src/sdks/python/apache_beam/pvalue.py",>
line 136, in __or__
    return self.pipeline.apply(ptransform, self)
  File "<https://ci-beam.apache.org/job/beam_PostCommit_XVR_Dataflow/ws/src/sdks/python/apache_beam/pipeline.py",>
line 694, in apply
    pvalueish_result = self.runner.apply(transform, pvalueish, self._options)
  File "<https://ci-beam.apache.org/job/beam_PostCommit_XVR_Dataflow/ws/src/sdks/python/apache_beam/runners/dataflow/dataflow_runner.py",>
line 141, in apply
    return super(DataflowRunner, self).apply(transform, input, options)
  File "<https://ci-beam.apache.org/job/beam_PostCommit_XVR_Dataflow/ws/src/sdks/python/apache_beam/runners/runner.py",>
line 185, in apply
    return m(transform, input, options)
  File "<https://ci-beam.apache.org/job/beam_PostCommit_XVR_Dataflow/ws/src/sdks/python/apache_beam/runners/runner.py",>
line 215, in apply_PTransform
    return transform.expand(input)
  File "<https://ci-beam.apache.org/job/beam_PostCommit_XVR_Dataflow/ws/src/sdks/python/apache_beam/transforms/external.py",>
line 295, in expand
    response = service.Expand(request)
  File "<https://ci-beam.apache.org/job/beam_PostCommit_XVR_Dataflow/ws/src/build/gradleenv/1922375555/lib/python3.6/site-packages/grpc/_channel.py",>
line 946, in __call__
    return _end_unary_response_blocking(state, call, False, None)
  File "<https://ci-beam.apache.org/job/beam_PostCommit_XVR_Dataflow/ws/src/build/gradleenv/1922375555/lib/python3.6/site-packages/grpc/_channel.py",>
line 849, in _end_unary_response_blocking
    raise _InactiveRpcError(state)
grpc._channel._InactiveRpcError: <_InactiveRpcError of RPC that terminated with:
	status = StatusCode.UNIMPLEMENTED
	details = "Method not found: org.apache.beam.model.expansion.v1.ExpansionService/Expand"
	debug_error_string = "{"created":"@1622333539.243069248","description":"Error received from
peer ipv4:127.0.0.1:18091","file":"src/core/lib/surface/call.cc","file_line":1066,"grpc_message":"Method
not found: org.apache.beam.model.expansion.v1.ExpansionService/Expand","grpc_status":12}"
>

======================================================================
ERROR: test_multi_input_output_with_sideinput (apache_beam.transforms.validate_runner_xlang_test.ValidateRunnerXlangTest)
----------------------------------------------------------------------
Traceback (most recent call last):
  File "<https://ci-beam.apache.org/job/beam_PostCommit_XVR_Dataflow/ws/src/sdks/python/apache_beam/transforms/validate_runner_xlang_test.py",>
line 258, in test_multi_input_output_with_sideinput
    test_pipeline or self.create_pipeline())
  File "<https://ci-beam.apache.org/job/beam_PostCommit_XVR_Dataflow/ws/src/sdks/python/apache_beam/transforms/validate_runner_xlang_test.py",>
line 119, in run_multi_input_output_with_sideinput
    TEST_MULTI_URN, None, self.expansion_service)
  File "<https://ci-beam.apache.org/job/beam_PostCommit_XVR_Dataflow/ws/src/sdks/python/apache_beam/transforms/ptransform.py",>
line 601, in __ror__
    result = p.apply(self, pvalueish, label)
  File "<https://ci-beam.apache.org/job/beam_PostCommit_XVR_Dataflow/ws/src/sdks/python/apache_beam/pipeline.py",>
line 694, in apply
    pvalueish_result = self.runner.apply(transform, pvalueish, self._options)
  File "<https://ci-beam.apache.org/job/beam_PostCommit_XVR_Dataflow/ws/src/sdks/python/apache_beam/runners/dataflow/dataflow_runner.py",>
line 141, in apply
    return super(DataflowRunner, self).apply(transform, input, options)
  File "<https://ci-beam.apache.org/job/beam_PostCommit_XVR_Dataflow/ws/src/sdks/python/apache_beam/runners/runner.py",>
line 185, in apply
    return m(transform, input, options)
  File "<https://ci-beam.apache.org/job/beam_PostCommit_XVR_Dataflow/ws/src/sdks/python/apache_beam/runners/runner.py",>
line 215, in apply_PTransform
    return transform.expand(input)
  File "<https://ci-beam.apache.org/job/beam_PostCommit_XVR_Dataflow/ws/src/sdks/python/apache_beam/transforms/external.py",>
line 295, in expand
    response = service.Expand(request)
  File "<https://ci-beam.apache.org/job/beam_PostCommit_XVR_Dataflow/ws/src/build/gradleenv/1922375555/lib/python3.6/site-packages/grpc/_channel.py",>
line 946, in __call__
    return _end_unary_response_blocking(state, call, False, None)
  File "<https://ci-beam.apache.org/job/beam_PostCommit_XVR_Dataflow/ws/src/build/gradleenv/1922375555/lib/python3.6/site-packages/grpc/_channel.py",>
line 849, in _end_unary_response_blocking
    raise _InactiveRpcError(state)
grpc._channel._InactiveRpcError: <_InactiveRpcError of RPC that terminated with:
	status = StatusCode.UNIMPLEMENTED
	details = "Method not found: org.apache.beam.model.expansion.v1.ExpansionService/Expand"
	debug_error_string = "{"created":"@1622333539.243421019","description":"Error received from
peer ipv4:127.0.0.1:18091","file":"src/core/lib/surface/call.cc","file_line":1066,"grpc_message":"Method
not found: org.apache.beam.model.expansion.v1.ExpansionService/Expand","grpc_status":12}"
>

======================================================================
ERROR: test_combine_per_key (apache_beam.transforms.validate_runner_xlang_test.ValidateRunnerXlangTest)
----------------------------------------------------------------------
Traceback (most recent call last):
  File "<https://ci-beam.apache.org/job/beam_PostCommit_XVR_Dataflow/ws/src/sdks/python/apache_beam/transforms/validate_runner_xlang_test.py",>
line 274, in test_combine_per_key
    test_pipeline or self.create_pipeline())
  File "<https://ci-beam.apache.org/job/beam_PostCommit_XVR_Dataflow/ws/src/sdks/python/apache_beam/transforms/validate_runner_xlang_test.py",>
line 200, in run_combine_per_key
    TEST_COMPK_URN, None, self.expansion_service))
  File "<https://ci-beam.apache.org/job/beam_PostCommit_XVR_Dataflow/ws/src/sdks/python/apache_beam/pvalue.py",>
line 136, in __or__
    return self.pipeline.apply(ptransform, self)
  File "<https://ci-beam.apache.org/job/beam_PostCommit_XVR_Dataflow/ws/src/sdks/python/apache_beam/pipeline.py",>
line 694, in apply
    pvalueish_result = self.runner.apply(transform, pvalueish, self._options)
  File "<https://ci-beam.apache.org/job/beam_PostCommit_XVR_Dataflow/ws/src/sdks/python/apache_beam/runners/dataflow/dataflow_runner.py",>
line 141, in apply
    return super(DataflowRunner, self).apply(transform, input, options)
  File "<https://ci-beam.apache.org/job/beam_PostCommit_XVR_Dataflow/ws/src/sdks/python/apache_beam/runners/runner.py",>
line 185, in apply
    return m(transform, input, options)
  File "<https://ci-beam.apache.org/job/beam_PostCommit_XVR_Dataflow/ws/src/sdks/python/apache_beam/runners/runner.py",>
line 215, in apply_PTransform
    return transform.expand(input)
  File "<https://ci-beam.apache.org/job/beam_PostCommit_XVR_Dataflow/ws/src/sdks/python/apache_beam/transforms/external.py",>
line 295, in expand
    response = service.Expand(request)
  File "<https://ci-beam.apache.org/job/beam_PostCommit_XVR_Dataflow/ws/src/build/gradleenv/1922375555/lib/python3.6/site-packages/grpc/_channel.py",>
line 946, in __call__
    return _end_unary_response_blocking(state, call, False, None)
  File "<https://ci-beam.apache.org/job/beam_PostCommit_XVR_Dataflow/ws/src/build/gradleenv/1922375555/lib/python3.6/site-packages/grpc/_channel.py",>
line 849, in _end_unary_response_blocking
    raise _InactiveRpcError(state)
grpc._channel._InactiveRpcError: <_InactiveRpcError of RPC that terminated with:
	status = StatusCode.UNIMPLEMENTED
	details = "Method not found: org.apache.beam.model.expansion.v1.ExpansionService/Expand"
	debug_error_string = "{"created":"@1622333539.243803901","description":"Error received from
peer ipv4:127.0.0.1:18091","file":"src/core/lib/surface/call.cc","file_line":1066,"grpc_message":"Method
not found: org.apache.beam.model.expansion.v1.ExpansionService/Expand","grpc_status":12}"
>

======================================================================
ERROR: test_partition (apache_beam.transforms.validate_runner_xlang_test.ValidateRunnerXlangTest)
----------------------------------------------------------------------
Traceback (most recent call last):
  File "<https://ci-beam.apache.org/job/beam_PostCommit_XVR_Dataflow/ws/src/sdks/python/apache_beam/transforms/validate_runner_xlang_test.py",>
line 282, in test_partition
    test_pipeline or self.create_pipeline())
  File "<https://ci-beam.apache.org/job/beam_PostCommit_XVR_Dataflow/ws/src/sdks/python/apache_beam/transforms/validate_runner_xlang_test.py",>
line 235, in run_partition
    TEST_PARTITION_URN, None, self.expansion_service))
  File "<https://ci-beam.apache.org/job/beam_PostCommit_XVR_Dataflow/ws/src/sdks/python/apache_beam/pvalue.py",>
line 136, in __or__
    return self.pipeline.apply(ptransform, self)
  File "<https://ci-beam.apache.org/job/beam_PostCommit_XVR_Dataflow/ws/src/sdks/python/apache_beam/pipeline.py",>
line 694, in apply
    pvalueish_result = self.runner.apply(transform, pvalueish, self._options)
  File "<https://ci-beam.apache.org/job/beam_PostCommit_XVR_Dataflow/ws/src/sdks/python/apache_beam/runners/dataflow/dataflow_runner.py",>
line 141, in apply
    return super(DataflowRunner, self).apply(transform, input, options)
  File "<https://ci-beam.apache.org/job/beam_PostCommit_XVR_Dataflow/ws/src/sdks/python/apache_beam/runners/runner.py",>
line 185, in apply
    return m(transform, input, options)
  File "<https://ci-beam.apache.org/job/beam_PostCommit_XVR_Dataflow/ws/src/sdks/python/apache_beam/runners/runner.py",>
line 215, in apply_PTransform
    return transform.expand(input)
  File "<https://ci-beam.apache.org/job/beam_PostCommit_XVR_Dataflow/ws/src/sdks/python/apache_beam/transforms/external.py",>
line 295, in expand
    response = service.Expand(request)
  File "<https://ci-beam.apache.org/job/beam_PostCommit_XVR_Dataflow/ws/src/build/gradleenv/1922375555/lib/python3.6/site-packages/grpc/_channel.py",>
line 946, in __call__
    return _end_unary_response_blocking(state, call, False, None)
  File "<https://ci-beam.apache.org/job/beam_PostCommit_XVR_Dataflow/ws/src/build/gradleenv/1922375555/lib/python3.6/site-packages/grpc/_channel.py",>
line 849, in _end_unary_response_blocking
    raise _InactiveRpcError(state)
grpc._channel._InactiveRpcError: <_InactiveRpcError of RPC that terminated with:
	status = StatusCode.UNIMPLEMENTED
	details = "Method not found: org.apache.beam.model.expansion.v1.ExpansionService/Expand"
	debug_error_string = "{"created":"@1622333539.260187533","description":"Error received from
peer ipv4:127.0.0.1:18091","file":"src/core/lib/surface/call.cc","file_line":1066,"grpc_message":"Method
not found: org.apache.beam.model.expansion.v1.ExpansionService/Expand","grpc_status":12}"
>

======================================================================
ERROR: test_prefix (apache_beam.transforms.validate_runner_xlang_test.ValidateRunnerXlangTest)
----------------------------------------------------------------------
Traceback (most recent call last):
  File "<https://ci-beam.apache.org/job/beam_PostCommit_XVR_Dataflow/ws/src/sdks/python/apache_beam/transforms/validate_runner_xlang_test.py",>
line 254, in test_prefix
    test_pipeline or self.create_pipeline())
  File "<https://ci-beam.apache.org/job/beam_PostCommit_XVR_Dataflow/ws/src/sdks/python/apache_beam/transforms/validate_runner_xlang_test.py",>
line 98, in run_prefix
    self.expansion_service))
  File "<https://ci-beam.apache.org/job/beam_PostCommit_XVR_Dataflow/ws/src/sdks/python/apache_beam/pvalue.py",>
line 136, in __or__
    return self.pipeline.apply(ptransform, self)
  File "<https://ci-beam.apache.org/job/beam_PostCommit_XVR_Dataflow/ws/src/sdks/python/apache_beam/pipeline.py",>
line 694, in apply
    pvalueish_result = self.runner.apply(transform, pvalueish, self._options)
  File "<https://ci-beam.apache.org/job/beam_PostCommit_XVR_Dataflow/ws/src/sdks/python/apache_beam/runners/dataflow/dataflow_runner.py",>
line 141, in apply
    return super(DataflowRunner, self).apply(transform, input, options)
  File "<https://ci-beam.apache.org/job/beam_PostCommit_XVR_Dataflow/ws/src/sdks/python/apache_beam/runners/runner.py",>
line 185, in apply
    return m(transform, input, options)
  File "<https://ci-beam.apache.org/job/beam_PostCommit_XVR_Dataflow/ws/src/sdks/python/apache_beam/runners/runner.py",>
line 215, in apply_PTransform
    return transform.expand(input)
  File "<https://ci-beam.apache.org/job/beam_PostCommit_XVR_Dataflow/ws/src/sdks/python/apache_beam/transforms/external.py",>
line 295, in expand
    response = service.Expand(request)
  File "<https://ci-beam.apache.org/job/beam_PostCommit_XVR_Dataflow/ws/src/build/gradleenv/1922375555/lib/python3.6/site-packages/grpc/_channel.py",>
line 946, in __call__
    return _end_unary_response_blocking(state, call, False, None)
  File "<https://ci-beam.apache.org/job/beam_PostCommit_XVR_Dataflow/ws/src/build/gradleenv/1922375555/lib/python3.6/site-packages/grpc/_channel.py",>
line 849, in _end_unary_response_blocking
    raise _InactiveRpcError(state)
grpc._channel._InactiveRpcError: <_InactiveRpcError of RPC that terminated with:
	status = StatusCode.UNIMPLEMENTED
	details = "Method not found: org.apache.beam.model.expansion.v1.ExpansionService/Expand"
	debug_error_string = "{"created":"@1622333539.284517415","description":"Error received from
peer ipv4:127.0.0.1:18091","file":"src/core/lib/surface/call.cc","file_line":1066,"grpc_message":"Method
not found: org.apache.beam.model.expansion.v1.ExpansionService/Expand","grpc_status":12}"
>

----------------------------------------------------------------------
XML: nosetests-xlangValidateRunner.xml
----------------------------------------------------------------------
XML: <https://ci-beam.apache.org/job/beam_PostCommit_XVR_Dataflow/ws/src/sdks/python/nosetests.xml>
----------------------------------------------------------------------
Ran 8 tests in 5.764s

FAILED (errors=8)

> Task :runners:google-cloud-dataflow-java:validatesCrossLanguageRunnerPythonUsingJava
FAILED

> Task :runners:google-cloud-dataflow-java:validatesCrossLanguageRunnerCleanup
Skipping invalid pid: 31719.
Stopping expansion service pid: 31722.

> Task :runners:google-cloud-dataflow-java:cleanUpDockerImages
Untagged: us.gcr.io/apache-beam-testing/java-postcommit-it/java:20210530000043
Untagged: us.gcr.io/apache-beam-testing/java-postcommit-it/java@sha256:01a7d431fc9bbfa0dc839be47572317d476170164e5f40ddc7ca6e37de43a555
Deleted: sha256:ef5dc96c2b549ea3aadee853932ab99af40d6f2294e0a68a483e473a1bd7c130
Deleted: sha256:b3b94f93b1fc129a5bce82dd950d556cbd10f9b04bd410ccbc751319f4285a93
Deleted: sha256:1774b3084e6a10ac86df1e7a2d71c28c1196a76125fe29279feb00359028ff83
Deleted: sha256:760598c5ecd463f433c4248eb2b1fbc1c7180bf90a0e88762a4d3b208434a2f9
Deleted: sha256:7b68396dd0911e0bbdeb923b4e5054f5084af6452dcfcff0ff8209451795ed43
Deleted: sha256:a583bcb54976ebf109c2783fcf2d851d0b6d7a31433b2ad504da3ee6f5e7b541
Deleted: sha256:f6df94c75fb70743f7abe493c28b8765cdb529fcb026be308364768929773c13
Deleted: sha256:34505bb418af69d59251b1553ecafc6c818b81d00ffa5d1243616aa6f0757331
Deleted: sha256:257a1fc0cc6f9d4774a187d8932c79f1d7043267dc7b17768029fc777032da52
Deleted: sha256:4b84a77977922ddb4fffe56bb331347e8e6ed7e1d9d0cf90c01fb4e58512bf06
Deleted: sha256:02c4555a90dc8785361f4609a95bb68eec8d6827e58f5bab5599f9ca2c3a2419
Deleted: sha256:b43d09823cede4503cc2b2960dae8857cae89db5194105d6b785689431c8dd29
Deleted: sha256:a70031811de79c84d7fe66196f03ca4a7545d59459f059615e79922f992ba927
Deleted: sha256:3e0d5540be452f3983f6e1d9a82ae0cfe4464e950e87c8ba6f19907197475286
Deleted: sha256:e941afcb15bd4a3e3295d145f11e3d3bd301b5657000611ade86263a72c79d92
Deleted: sha256:ea0437a767c4431882775e229fd6daa5512262beb60e706025b1ab27685b141c
Deleted: sha256:5f7c613e5fdae66ceb6c7a894048b4be68bb071ae7b623b24c9c001e943f1f49
Deleted: sha256:f1f2964489e7e30d374060e47af967a148d7053639a041239722ec5f22af0b36
Deleted: sha256:295155afd90af42d83a0227a41691948b5bce1febab1c719594e488c8b7f4181
Deleted: sha256:f32c72987e7f2bcca23801fa149051b4a1dc23a7734ca81fcfe4c68e82660708
Deleted: sha256:c76625677228ee4e946213df962d31bf0d4efa3e87a2404658035ea26a909fa9
Deleted: sha256:7f95ce8691a67f466e599ef9d9d2dfabb50b85449bf891845a5263e40907e6fd
Deleted: sha256:30c303151c1f3764cadd14de5043bc84e011cc57594089b6c8c0897fd5753000
Deleted: sha256:505f6a20f9677e7bc704d7f679cab8a218d83f642134fe391dbceeca1369043c
Deleted: sha256:addd9d7c56411fc56bfed360c74e236137ba7d05fadb9ea19cc2ce9a21c86728
Deleted: sha256:10240fef630727cee6cc24b35a874d236939c85291c1011a674fc0cdb0f40c25
Deleted: sha256:5b1948d43cfefc596ebf4855d10c8e0976ebf748ba131ee22c2a5492ae833a9a
Deleted: sha256:be6e61e28fa3347cb510a9f6429e62e7062ad217b7eb4bc46aad8a00b1e82b66
Digests:
- us.gcr.io/apache-beam-testing/java-postcommit-it/java@sha256:01a7d431fc9bbfa0dc839be47572317d476170164e5f40ddc7ca6e37de43a555
  Associated tags:
 - 20210530000043
Tags:
- us.gcr.io/apache-beam-testing/java-postcommit-it/java:20210530000043
Deleted [us.gcr.io/apache-beam-testing/java-postcommit-it/java:20210530000043].
Deleted [us.gcr.io/apache-beam-testing/java-postcommit-it/java@sha256:01a7d431fc9bbfa0dc839be47572317d476170164e5f40ddc7ca6e37de43a555].

FAILURE: Build failed with an exception.

* What went wrong:
Execution failed for task ':runners:google-cloud-dataflow-java:validatesCrossLanguageRunnerPythonUsingJava'.
> Process 'command 'sh'' finished with non-zero exit value 1

* Try:
Run with --stacktrace option to get the stack trace. Run with --info or --debug option to
get more log output. Run with --scan to get full insights.

* Get more help at https://help.gradle.org

Deprecated Gradle features were used in this build, making it incompatible with Gradle 7.0.
Use '--warning-mode all' to show the individual deprecation warnings.
See https://docs.gradle.org/6.8.3/userguide/command_line_interface.html#sec:command_line_warnings

BUILD FAILED in 11m 59s
113 actionable tasks: 84 executed, 25 from cache, 4 up-to-date

Publishing build scan...
https://gradle.com/s/6yd2nt3qw3fzi

Build step 'Invoke Gradle script' changed build result to FAILURE
Build step 'Invoke Gradle script' marked build as failure

---------------------------------------------------------------------
To unsubscribe, e-mail: builds-unsubscribe@beam.apache.org
For additional commands, e-mail: builds-help@beam.apache.org


Mime
View raw message