beam-builds mailing list archives

Site index · List index
Message view « Date » · « Thread »
Top « Date » · « Thread »
From Apache Jenkins Server <jenk...@builds.apache.org>
Subject Build failed in Jenkins: beam_PostCommit_Java_ValidatesRunner_Flink_Java11 #1544
Date Thu, 29 Apr 2021 18:57:40 GMT
See <https://ci-beam.apache.org/job/beam_PostCommit_Java_ValidatesRunner_Flink_Java11/1544/display/redirect?page=changes>

Changes:

[Kenneth Knowles] Fix kenn at apache email address in blog author list

[randomstep] [BEAM-8706] Bump antlr4 to 4.9.2

[kwu] [BEAM-12227] Update ExternalWorkerServiceTest

[noreply] [BEAM-12238] Make StateBackedIterable Serializable. (#14660)

[noreply] [BEAM-9615] Use UUIDs in Go SDK Schemas (#14665)

[noreply] [BEAM-12174] Propertly close ExecutableStageContext in DoFnOp#close

[noreply] [BEAM-12118] Fix race introduced in QueeuingBeamFnDataClient triggering

[noreply] [BEAM-9547] WontImplement a few more DeferredGroupBy operations (#14675)

[Kenneth Knowles] Add Beam 2.29.0 release blog post


------------------------------------------
[...truncated 21.26 KB...]
> Task :model:pipeline:shadowJar FROM-CACHE
> Task :model:job-management:extractIncludeProto
> Task :model:fn-execution:extractIncludeProto
> Task :model:job-management:generateProto FROM-CACHE
> Task :model:fn-execution:generateProto FROM-CACHE
> Task :model:fn-execution:compileJava FROM-CACHE
> Task :model:fn-execution:classes
> Task :model:fn-execution:shadowJar
> Task :model:job-management:compileJava
> Task :model:job-management:classes
> Task :model:job-management:shadowJar FROM-CACHE
> Task :sdks:java:core:compileJava
Note: Some input files use or override a deprecated API.
Note: Recompile with -Xlint:deprecation for details.
Note: Some input files use unchecked or unsafe operations.
Note: Recompile with -Xlint:unchecked for details.

> Task :sdks:java:core:classes
> Task :sdks:java:core:shadowJar
> Task :sdks:java:extensions:protobuf:extractIncludeProto
> Task :sdks:java:extensions:protobuf:generateProto NO-SOURCE
> Task :sdks:java:fn-execution:compileJava
> Task :sdks:java:core:compileTestJava
> Task :sdks:java:extensions:protobuf:compileJava

> Task :sdks:java:fn-execution:compileJava
Note: <https://ci-beam.apache.org/job/beam_PostCommit_Java_ValidatesRunner_Flink_Java11/ws/src/sdks/java/fn-execution/src/main/java/org/apache/beam/sdk/fn/data/BeamFnDataSizeBasedBufferingOutboundObserver.java>
uses or overrides a deprecated API.
Note: Recompile with -Xlint:deprecation for details.
Note: Some input files use unchecked or unsafe operations.
Note: Recompile with -Xlint:unchecked for details.

> Task :sdks:java:fn-execution:classes
> Task :sdks:java:fn-execution:jar

> Task :sdks:java:extensions:protobuf:compileJava
Note: Some input files use or override a deprecated API.
Note: Recompile with -Xlint:deprecation for details.
Note: Some input files use unchecked or unsafe operations.
Note: Recompile with -Xlint:unchecked for details.

> Task :sdks:java:extensions:protobuf:classes
> Task :sdks:java:extensions:protobuf:jar
> Task :runners:core-construction-java:compileJava

> Task :sdks:java:core:compileTestJava
Note: Some input files use or override a deprecated API.
Note: Recompile with -Xlint:deprecation for details.
Note: Some input files use unchecked or unsafe operations.
Note: Recompile with -Xlint:unchecked for details.

> Task :sdks:java:core:testClasses
> Task :sdks:java:core:shadowTestJar FROM-CACHE

> Task :runners:core-construction-java:compileJava
Note: Some input files use or override a deprecated API.
Note: Recompile with -Xlint:deprecation for details.
Note: Some input files use unchecked or unsafe operations.
Note: Recompile with -Xlint:unchecked for details.

> Task :runners:core-construction-java:classes
> Task :runners:core-construction-java:jar
> Task :runners:core-java:compileJava
Note: Some input files use or override a deprecated API.
Note: Recompile with -Xlint:deprecation for details.
Note: Some input files use unchecked or unsafe operations.
Note: Recompile with -Xlint:unchecked for details.

> Task :runners:core-java:classes
> Task :runners:core-java:jar

> Task :runners:core-java:compileTestJava
Note: Some input files use or override a deprecated API.
Note: Recompile with -Xlint:deprecation for details.
Note: Some input files use unchecked or unsafe operations.
Note: Recompile with -Xlint:unchecked for details.

> Task :runners:core-java:testClasses
> Task :runners:core-java:testJar

> Task :sdks:java:extensions:google-cloud-platform-core:compileJava
Note: Some input files use or override a deprecated API.
Note: Recompile with -Xlint:deprecation for details.
Unable to watch the file system for changes. The inotify watches limit is too low.

> Task :sdks:java:extensions:google-cloud-platform-core:classes
> Task :sdks:java:extensions:google-cloud-platform-core:jar
> Task :sdks:java:harness:compileJava
Note: Some input files use or override a deprecated API.
Note: Recompile with -Xlint:deprecation for details.
Note: Some input files use unchecked or unsafe operations.
Note: Recompile with -Xlint:unchecked for details.

> Task :sdks:java:harness:classes
> Task :sdks:java:harness:jar
> Task :sdks:java:harness:shadowJar
> Task :runners:java-fn-execution:compileJava
Note: Some input files use or override a deprecated API.
Note: Recompile with -Xlint:deprecation for details.
Note: Some input files use unchecked or unsafe operations.
Note: Recompile with -Xlint:unchecked for details.

> Task :runners:java-fn-execution:classes
> Task :runners:java-fn-execution:jar

> Task :sdks:java:expansion-service:compileJava
Note: <https://ci-beam.apache.org/job/beam_PostCommit_Java_ValidatesRunner_Flink_Java11/ws/src/sdks/java/expansion-service/src/main/java/org/apache/beam/sdk/expansion/service/ExpansionService.java>
uses unchecked or unsafe operations.
Note: Recompile with -Xlint:unchecked for details.

> Task :sdks:java:expansion-service:classes
> Task :sdks:java:expansion-service:jar

> Task :runners:java-job-service:compileJava
Note: <https://ci-beam.apache.org/job/beam_PostCommit_Java_ValidatesRunner_Flink_Java11/ws/src/runners/java-job-service/src/main/java/org/apache/beam/runners/jobsubmission/PortablePipelineJarCreator.java>
uses unchecked or unsafe operations.
Note: Recompile with -Xlint:unchecked for details.

> Task :runners:java-job-service:classes
> Task :runners:java-job-service:jar
> Task :sdks:java:io:google-cloud-platform:compileJava
> Task :runners:flink:1.12:compileJava
Note: Some input files use or override a deprecated API.
Note: Recompile with -Xlint:deprecation for details.
Note: Some input files use unchecked or unsafe operations.
Note: Recompile with -Xlint:unchecked for details.

> Task :runners:flink:1.12:classes
> Task :runners:flink:1.12:jar

> Task :sdks:java:io:google-cloud-platform:compileJava
Note: Some input files use or override a deprecated API.
Note: Recompile with -Xlint:deprecation for details.
Note: Some input files use unchecked or unsafe operations.
Note: Recompile with -Xlint:unchecked for details.

> Task :sdks:java:io:google-cloud-platform:classes
> Task :sdks:java:io:google-cloud-platform:jar

> Task :runners:flink:1.12:compileTestJava
Note: Some input files use or override a deprecated API.
Note: Recompile with -Xlint:deprecation for details.
Note: Some input files use unchecked or unsafe operations.
Note: Recompile with -Xlint:unchecked for details.

> Task :runners:flink:1.12:testClasses
> Task :runners:flink:1.12:testJar

Deprecated Gradle features were used in this build, making it incompatible with Gradle 7.0.
Use '--warning-mode all' to show the individual deprecation warnings.
See https://docs.gradle.org/6.8.3/userguide/command_line_interface.html#sec:command_line_warnings

BUILD SUCCESSFUL in 15m 52s
79 actionable tasks: 71 executed, 8 from cache
Gradle was unable to watch the file system for changes. The inotify watches limit is too low.

Publishing build scan...
https://gradle.com/s/fou4fhph2fw3y

Build step 'Invoke Gradle script' changed build result to SUCCESS
[Gradle] - Launching build.
[src] $ <https://ci-beam.apache.org/job/beam_PostCommit_Java_ValidatesRunner_Flink_Java11/ws/src/gradlew>
-x shadowJar -x shadowTestJar -x compileJava -x compileTestJava -x jar -x testJar -x classes
-x testClasses -Dorg.gradle.java.home=/usr/lib/jvm/java-11-openjdk-amd64 --continue --max-workers=6
-Dorg.gradle.jvmargs=-Xms2g -Dorg.gradle.jvmargs=-Xmx4g -Pdocker-pull-licenses :runners:flink:1.12:validatesRunner
Starting a Gradle Daemon, 3 busy and 1 incompatible Daemons could not be reused, use --status
for details
> Task :buildSrc:compileJava NO-SOURCE
> Task :buildSrc:compileGroovy FROM-CACHE
> Task :buildSrc:pluginDescriptors UP-TO-DATE
> Task :buildSrc:processResources UP-TO-DATE
> Task :buildSrc:classes UP-TO-DATE
> Task :buildSrc:jar
> Task :buildSrc:assemble
> Task :buildSrc:spotlessGroovy UP-TO-DATE
> Task :buildSrc:spotlessGroovyCheck UP-TO-DATE
> Task :buildSrc:spotlessGroovyGradle UP-TO-DATE
> Task :buildSrc:spotlessGroovyGradleCheck UP-TO-DATE
> Task :buildSrc:spotlessCheck UP-TO-DATE
> Task :buildSrc:pluginUnderTestMetadata
> Task :buildSrc:compileTestJava NO-SOURCE
> Task :buildSrc:compileTestGroovy NO-SOURCE
> Task :buildSrc:processTestResources NO-SOURCE
> Task :buildSrc:testClasses UP-TO-DATE
> Task :buildSrc:test NO-SOURCE
> Task :buildSrc:validatePlugins FROM-CACHE
> Task :buildSrc:check UP-TO-DATE
> Task :buildSrc:build
Configuration on demand is an incubating feature.

> Task :runners:flink:1.12:validatesRunnerBatch
WARNING: An illegal reflective access operation has occurred
WARNING: Illegal reflective access by org.apache.flink.util.JavaGcCleanerWrapper$PendingCleanersRunnerProvider
(file:/home/jenkins/.gradle/caches/modules-2/files-2.1/org.apache.flink/flink-core/1.12.2/3ef37ee3aa5a030f24e4809a0c32f6caa0dbda6c/flink-core-1.12.2.jar)
to method java.lang.ref.Reference.waitForReferenceProcessing()
WARNING: Please consider reporting this to the maintainers of org.apache.flink.util.JavaGcCleanerWrapper$PendingCleanersRunnerProvider
WARNING: Use --illegal-access=warn to enable warnings of further illegal reflective access
operations
WARNING: All illegal access operations will be denied in a future release
WARNING: An illegal reflective access operation has occurred
WARNING: Illegal reflective access by org.apache.flink.util.JavaGcCleanerWrapper$PendingCleanersRunnerProvider
(file:/home/jenkins/.gradle/caches/modules-2/files-2.1/org.apache.flink/flink-core/1.12.2/3ef37ee3aa5a030f24e4809a0c32f6caa0dbda6c/flink-core-1.12.2.jar)
to method java.lang.ref.Reference.waitForReferenceProcessing()
WARNING: Please consider reporting this to the maintainers of org.apache.flink.util.JavaGcCleanerWrapper$PendingCleanersRunnerProvider
WARNING: Use --illegal-access=warn to enable warnings of further illegal reflective access
operations
WARNING: All illegal access operations will be denied in a future release

> Task :runners:flink:1.12:validatesRunnerStreaming
> Task :runners:flink:1.12:validatesRunnerStreamingCheckpointing

> Task :runners:flink:1.12:validatesRunnerBatch

org.apache.beam.sdk.transforms.ParDoLifecycleTest > testTeardownCalledAfterExceptionInStartBundleStateful
FAILED
    java.lang.AssertionError at ParDoLifecycleTest.java:300

273 tests completed, 1 failed, 2 skipped

> Task :runners:flink:1.12:validatesRunnerBatch FAILED

> Task :runners:flink:1.12:validatesRunnerStreaming
WARNING: An illegal reflective access operation has occurred
WARNING: Illegal reflective access by org.apache.flink.api.java.ClosureCleaner (file:/home/jenkins/.gradle/caches/modules-2/files-2.1/org.apache.flink/flink-core/1.12.2/3ef37ee3aa5a030f24e4809a0c32f6caa0dbda6c/flink-core-1.12.2.jar)
to field java.lang.String.value
WARNING: Please consider reporting this to the maintainers of org.apache.flink.api.java.ClosureCleaner
WARNING: Use --illegal-access=warn to enable warnings of further illegal reflective access
operations
WARNING: All illegal access operations will be denied in a future release
WARNING: An illegal reflective access operation has occurred
WARNING: Illegal reflective access by org.apache.flink.api.java.ClosureCleaner (file:/home/jenkins/.gradle/caches/modules-2/files-2.1/org.apache.flink/flink-core/1.12.2/3ef37ee3aa5a030f24e4809a0c32f6caa0dbda6c/flink-core-1.12.2.jar)
to field java.lang.String.value
WARNING: Please consider reporting this to the maintainers of org.apache.flink.api.java.ClosureCleaner
WARNING: Use --illegal-access=warn to enable warnings of further illegal reflective access
operations
WARNING: All illegal access operations will be denied in a future release

> Task :runners:flink:1.12:validatesRunnerStreamingCheckpointing
WARNING: An illegal reflective access operation has occurred
WARNING: Illegal reflective access by org.apache.flink.api.java.ClosureCleaner (file:/home/jenkins/.gradle/caches/modules-2/files-2.1/org.apache.flink/flink-core/1.12.2/3ef37ee3aa5a030f24e4809a0c32f6caa0dbda6c/flink-core-1.12.2.jar)
to field java.lang.String.value
WARNING: Please consider reporting this to the maintainers of org.apache.flink.api.java.ClosureCleaner
WARNING: Use --illegal-access=warn to enable warnings of further illegal reflective access
operations
WARNING: All illegal access operations will be denied in a future release

FAILURE: Build failed with an exception.

* What went wrong:
Execution failed for task ':runners:flink:1.12:validatesRunnerBatch'.
> There were failing tests. See the report at: file://<https://ci-beam.apache.org/job/beam_PostCommit_Java_ValidatesRunner_Flink_Java11/ws/src/runners/flink/1.12/build/reports/tests/validatesRunnerBatch/index.html>

* Try:
Run with --stacktrace option to get the stack trace. Run with --info or --debug option to
get more log output. Run with --scan to get full insights.

* Get more help at https://help.gradle.org

Deprecated Gradle features were used in this build, making it incompatible with Gradle 7.0.
Use '--warning-mode all' to show the individual deprecation warnings.
See https://docs.gradle.org/6.8.3/userguide/command_line_interface.html#sec:command_line_warnings

BUILD FAILED in 41m 10s
3 actionable tasks: 3 executed

Publishing build scan...
https://gradle.com/s/43cxjv4fnnmeq

Build step 'Invoke Gradle script' changed build result to FAILURE
Build step 'Invoke Gradle script' marked build as failure

---------------------------------------------------------------------
To unsubscribe, e-mail: builds-unsubscribe@beam.apache.org
For additional commands, e-mail: builds-help@beam.apache.org


Mime
View raw message