beam-builds mailing list archives

Site index · List index
Message view « Date » · « Thread »
Top « Date » · « Thread »
From Apache Jenkins Server <jenk...@builds.apache.org>
Subject Build failed in Jenkins: beam_python_mongoio_load_test #1438
Date Sun, 06 Dec 2020 12:44:55 GMT
See <https://ci-beam.apache.org/job/beam_python_mongoio_load_test/1438/display/redirect>

Changes:


------------------------------------------
[...truncated 33.88 KB...]
Requirement already satisfied: six>=1.6 in <https://ci-beam.apache.org/job/beam_python_mongoio_load_test/ws/src/build/gradleenv/-1734967053/lib/python3.6/site-packages>
(from azure-core>=1.7.0->apache-beam==2.27.0.dev0) (1.15.0)
Requirement already satisfied: protobuf<4,>=3.12.2 in <https://ci-beam.apache.org/job/beam_python_mongoio_load_test/ws/src/build/gradleenv/-1734967053/lib/python3.6/site-packages>
(from apache-beam==2.27.0.dev0) (3.14.0)
Requirement already satisfied: setuptools>=40.3.0 in <https://ci-beam.apache.org/job/beam_python_mongoio_load_test/ws/src/build/gradleenv/-1734967053/lib/python3.6/site-packages>
(from google-auth<2,>=1.18.0->apache-beam==2.27.0.dev0) (50.3.2)
Collecting google-cloud-bigtable<2,>=0.31.1
  Using cached google_cloud_bigtable-1.6.1-py2.py3-none-any.whl (267 kB)
Requirement already satisfied: six>=1.6 in <https://ci-beam.apache.org/job/beam_python_mongoio_load_test/ws/src/build/gradleenv/-1734967053/lib/python3.6/site-packages>
(from azure-core>=1.7.0->apache-beam==2.27.0.dev0) (1.15.0)
Requirement already satisfied: protobuf<4,>=3.12.2 in <https://ci-beam.apache.org/job/beam_python_mongoio_load_test/ws/src/build/gradleenv/-1734967053/lib/python3.6/site-packages>
(from apache-beam==2.27.0.dev0) (3.14.0)
Requirement already satisfied: setuptools>=40.3.0 in <https://ci-beam.apache.org/job/beam_python_mongoio_load_test/ws/src/build/gradleenv/-1734967053/lib/python3.6/site-packages>
(from google-auth<2,>=1.18.0->apache-beam==2.27.0.dev0) (50.3.2)
Requirement already satisfied: grpcio<2,>=1.29.0 in <https://ci-beam.apache.org/job/beam_python_mongoio_load_test/ws/src/build/gradleenv/-1734967053/lib/python3.6/site-packages>
(from apache-beam==2.27.0.dev0) (1.34.0)
Collecting google-cloud-build<3,>=2.0.0
  Using cached google_cloud_build-2.0.0-py2.py3-none-any.whl (67 kB)
Collecting google-cloud-core<2,>=0.28.1
  Using cached google_cloud_core-1.4.4-py2.py3-none-any.whl (27 kB)
Requirement already satisfied: six>=1.6 in <https://ci-beam.apache.org/job/beam_python_mongoio_load_test/ws/src/build/gradleenv/-1734967053/lib/python3.6/site-packages>
(from azure-core>=1.7.0->apache-beam==2.27.0.dev0) (1.15.0)
Collecting google-cloud-datastore<2,>=1.7.1
  Using cached google_cloud_datastore-1.15.3-py2.py3-none-any.whl (134 kB)
Collecting google-cloud-dlp<2,>=0.12.0
  Using cached google_cloud_dlp-1.0.0-py2.py3-none-any.whl (169 kB)
Collecting google-cloud-language<2,>=1.3.0
  Using cached google_cloud_language-1.3.0-py2.py3-none-any.whl (83 kB)
Collecting google-cloud-pubsub<2,>=0.39.0
  Using cached google_cloud_pubsub-1.7.0-py2.py3-none-any.whl (144 kB)
Collecting google-cloud-spanner<2,>=1.13.0
  Using cached google_cloud_spanner-1.19.1-py2.py3-none-any.whl (255 kB)
Requirement already satisfied: six>=1.6 in <https://ci-beam.apache.org/job/beam_python_mongoio_load_test/ws/src/build/gradleenv/-1734967053/lib/python3.6/site-packages>
(from azure-core>=1.7.0->apache-beam==2.27.0.dev0) (1.15.0)
Requirement already satisfied: protobuf<4,>=3.12.2 in <https://ci-beam.apache.org/job/beam_python_mongoio_load_test/ws/src/build/gradleenv/-1734967053/lib/python3.6/site-packages>
(from apache-beam==2.27.0.dev0) (3.14.0)
Requirement already satisfied: setuptools>=40.3.0 in <https://ci-beam.apache.org/job/beam_python_mongoio_load_test/ws/src/build/gradleenv/-1734967053/lib/python3.6/site-packages>
(from google-auth<2,>=1.18.0->apache-beam==2.27.0.dev0) (50.3.2)
Requirement already satisfied: grpcio<2,>=1.29.0 in <https://ci-beam.apache.org/job/beam_python_mongoio_load_test/ws/src/build/gradleenv/-1734967053/lib/python3.6/site-packages>
(from apache-beam==2.27.0.dev0) (1.34.0)
Collecting google-cloud-videointelligence<2,>=1.8.0
  Using cached google_cloud_videointelligence-1.16.1-py2.py3-none-any.whl (183 kB)
Collecting google-cloud-vision<2,>=0.38.0
  Using cached google_cloud_vision-1.0.0-py2.py3-none-any.whl (435 kB)
Collecting google-resumable-media<2.0dev,>=0.6.0
  Using cached google_resumable_media-1.1.0-py2.py3-none-any.whl (75 kB)
Requirement already satisfied: six>=1.6 in <https://ci-beam.apache.org/job/beam_python_mongoio_load_test/ws/src/build/gradleenv/-1734967053/lib/python3.6/site-packages>
(from azure-core>=1.7.0->apache-beam==2.27.0.dev0) (1.15.0)
Collecting google-crc32c<2.0dev,>=1.0
  Using cached google_crc32c-1.0.0-cp36-cp36m-manylinux2010_x86_64.whl (39 kB)
Collecting googleapis-common-protos<2.0dev,>=1.6.0
  Using cached googleapis_common_protos-1.52.0-py2.py3-none-any.whl (100 kB)
Requirement already satisfied: protobuf<4,>=3.12.2 in <https://ci-beam.apache.org/job/beam_python_mongoio_load_test/ws/src/build/gradleenv/-1734967053/lib/python3.6/site-packages>
(from apache-beam==2.27.0.dev0) (3.14.0)
Collecting grpc-google-iam-v1<0.13dev,>=0.12.3
  Using cached grpc_google_iam_v1-0.12.3-py3-none-any.whl
Requirement already satisfied: grpcio<2,>=1.29.0 in <https://ci-beam.apache.org/job/beam_python_mongoio_load_test/ws/src/build/gradleenv/-1734967053/lib/python3.6/site-packages>
(from apache-beam==2.27.0.dev0) (1.34.0)
Requirement already satisfied: protobuf<4,>=3.12.2 in <https://ci-beam.apache.org/job/beam_python_mongoio_load_test/ws/src/build/gradleenv/-1734967053/lib/python3.6/site-packages>
(from apache-beam==2.27.0.dev0) (3.14.0)
Requirement already satisfied: grpcio<2,>=1.29.0 in <https://ci-beam.apache.org/job/beam_python_mongoio_load_test/ws/src/build/gradleenv/-1734967053/lib/python3.6/site-packages>
(from apache-beam==2.27.0.dev0) (1.34.0)
Requirement already satisfied: six>=1.6 in <https://ci-beam.apache.org/job/beam_python_mongoio_load_test/ws/src/build/gradleenv/-1734967053/lib/python3.6/site-packages>
(from azure-core>=1.7.0->apache-beam==2.27.0.dev0) (1.15.0)
Collecting grpcio-gcp<1,>=0.2.2
  Using cached grpcio_gcp-0.2.2-py2.py3-none-any.whl (9.4 kB)
Requirement already satisfied: grpcio<2,>=1.29.0 in <https://ci-beam.apache.org/job/beam_python_mongoio_load_test/ws/src/build/gradleenv/-1734967053/lib/python3.6/site-packages>
(from apache-beam==2.27.0.dev0) (1.34.0)
Collecting hdfs<3.0.0,>=2.1.0
  Using cached hdfs-2.5.8-py3-none-any.whl
Requirement already satisfied: six>=1.6 in <https://ci-beam.apache.org/job/beam_python_mongoio_load_test/ws/src/build/gradleenv/-1734967053/lib/python3.6/site-packages>
(from azure-core>=1.7.0->apache-beam==2.27.0.dev0) (1.15.0)
Collecting docopt
  Using cached docopt-0.6.2-py2.py3-none-any.whl
Collecting httplib2<0.18.0,>=0.8
  Using cached httplib2-0.17.4-py3-none-any.whl (95 kB)
Collecting jmespath<1.0.0,>=0.7.1
  Using cached jmespath-0.10.0-py2.py3-none-any.whl (24 kB)
Collecting libcst>=0.2.5
  Using cached libcst-0.3.15-py3-none-any.whl (504 kB)
Collecting dataclasses>=0.6.0
  Using cached dataclasses-0.8-py3-none-any.whl (19 kB)
Collecting mock<3.0.0,>=1.0.1
  Using cached mock-2.0.0-py2.py3-none-any.whl (56 kB)
Requirement already satisfied: six>=1.6 in <https://ci-beam.apache.org/job/beam_python_mongoio_load_test/ws/src/build/gradleenv/-1734967053/lib/python3.6/site-packages>
(from azure-core>=1.7.0->apache-beam==2.27.0.dev0) (1.15.0)
Collecting monotonic>=0.1
  Using cached monotonic-1.5-py2.py3-none-any.whl (5.3 kB)
Collecting msrest>=0.6.10
  Using cached msrest-0.6.19-py2.py3-none-any.whl (84 kB)
Collecting certifi>=2017.4.17
  Using cached certifi-2020.12.5-py2.py3-none-any.whl (147 kB)
Collecting isodate>=0.6.0
  Using cached isodate-0.6.0-py2.py3-none-any.whl (45 kB)
Requirement already satisfied: six>=1.6 in <https://ci-beam.apache.org/job/beam_python_mongoio_load_test/ws/src/build/gradleenv/-1734967053/lib/python3.6/site-packages>
(from azure-core>=1.7.0->apache-beam==2.27.0.dev0) (1.15.0)
Collecting nose>=1.3.7
  Using cached nose-1.3.7-py3-none-any.whl (154 kB)
Collecting nose_xunitmp>=0.4.1
  Using cached nose_xunitmp-0.4.1-py3-none-any.whl
Collecting numpy<2,>=1.14.3
  Using cached numpy-1.19.4-cp36-cp36m-manylinux2010_x86_64.whl (14.5 MB)
Collecting oauth2client<5,>=2.0.1
  Using cached oauth2client-4.1.3-py2.py3-none-any.whl (98 kB)
Requirement already satisfied: six>=1.6 in <https://ci-beam.apache.org/job/beam_python_mongoio_load_test/ws/src/build/gradleenv/-1734967053/lib/python3.6/site-packages>
(from azure-core>=1.7.0->apache-beam==2.27.0.dev0) (1.15.0)
Collecting pandas<2,>=1.0
  Using cached pandas-1.1.4-cp36-cp36m-manylinux1_x86_64.whl (9.5 MB)
Collecting parameterized<0.8.0,>=0.7.1
  Using cached parameterized-0.7.4-py2.py3-none-any.whl (25 kB)
Collecting pbr>=0.11
  Using cached pbr-5.5.1-py2.py3-none-any.whl (106 kB)
Collecting proto-plus>=0.4.0
  Using cached proto_plus-1.11.0-py3-none-any.whl
Requirement already satisfied: protobuf<4,>=3.12.2 in <https://ci-beam.apache.org/job/beam_python_mongoio_load_test/ws/src/build/gradleenv/-1734967053/lib/python3.6/site-packages>
(from apache-beam==2.27.0.dev0) (3.14.0)
Requirement already satisfied: six>=1.6 in <https://ci-beam.apache.org/job/beam_python_mongoio_load_test/ws/src/build/gradleenv/-1734967053/lib/python3.6/site-packages>
(from azure-core>=1.7.0->apache-beam==2.27.0.dev0) (1.15.0)
Collecting psycopg2-binary<3.0.0,>=2.8.5
  Using cached psycopg2_binary-2.8.6-cp36-cp36m-manylinux1_x86_64.whl (3.0 MB)
Collecting pyarrow<3.0.0,>=0.15.1
  Using cached pyarrow-2.0.0-cp36-cp36m-manylinux2014_x86_64.whl (17.7 MB)
Collecting pyasn1>=0.1.7
  Using cached pyasn1-0.4.8-py2.py3-none-any.whl (77 kB)
Collecting pyasn1-modules>=0.2.1
  Using cached pyasn1_modules-0.2.8-py2.py3-none-any.whl (155 kB)
Collecting pycparser
  Using cached pycparser-2.20-py2.py3-none-any.whl (112 kB)
Collecting pydot<2,>=1.2.0
  Using cached pydot-1.4.1-py2.py3-none-any.whl (19 kB)
Collecting pyhamcrest!=1.10.0,<2.0.0,>=1.9
  Using cached PyHamcrest-1.10.1-py3-none-any.whl (48 kB)
Requirement already satisfied: six>=1.6 in <https://ci-beam.apache.org/job/beam_python_mongoio_load_test/ws/src/build/gradleenv/-1734967053/lib/python3.6/site-packages>
(from azure-core>=1.7.0->apache-beam==2.27.0.dev0) (1.15.0)
Collecting pymongo<4.0.0,>=3.8.0
  Using cached pymongo-3.11.2-cp36-cp36m-manylinux2014_x86_64.whl (509 kB)
Collecting pyparsing>=2.1.4
  Using cached pyparsing-2.4.7-py2.py3-none-any.whl (67 kB)
Collecting pytest<5.0,>=4.4.0
  Using cached pytest-4.6.11-py2.py3-none-any.whl (231 kB)
Requirement already satisfied: six>=1.6 in <https://ci-beam.apache.org/job/beam_python_mongoio_load_test/ws/src/build/gradleenv/-1734967053/lib/python3.6/site-packages>
(from azure-core>=1.7.0->apache-beam==2.27.0.dev0) (1.15.0)
Requirement already satisfied: py>=1.5.0 in <https://ci-beam.apache.org/job/beam_python_mongoio_load_test/ws/src/build/gradleenv/-1734967053/lib/python3.6/site-packages>
(from pytest<5.0,>=4.4.0->apache-beam==2.27.0.dev0) (1.9.0)
Requirement already satisfied: importlib-metadata>=0.12 in <https://ci-beam.apache.org/job/beam_python_mongoio_load_test/ws/src/build/gradleenv/-1734967053/lib/python3.6/site-packages>
(from pytest<5.0,>=4.4.0->apache-beam==2.27.0.dev0) (3.1.1)
Requirement already satisfied: pluggy<1.0,>=0.12 in <https://ci-beam.apache.org/job/beam_python_mongoio_load_test/ws/src/build/gradleenv/-1734967053/lib/python3.6/site-packages>
(from pytest<5.0,>=4.4.0->apache-beam==2.27.0.dev0) (0.13.1)
Collecting atomicwrites>=1.0
  Using cached atomicwrites-1.4.0-py2.py3-none-any.whl (6.8 kB)
Collecting attrs>=17.4.0
  Using cached attrs-20.3.0-py2.py3-none-any.whl (49 kB)
Requirement already satisfied: zipp>=0.5 in <https://ci-beam.apache.org/job/beam_python_mongoio_load_test/ws/src/build/gradleenv/-1734967053/lib/python3.6/site-packages>
(from importlib-metadata>=0.12->pytest<5.0,>=4.4.0->apache-beam==2.27.0.dev0)
(3.4.0)
Collecting more-itertools>=4.0.0
  Using cached more_itertools-8.6.0-py3-none-any.whl (45 kB)
Collecting packaging
  Using cached packaging-20.7-py2.py3-none-any.whl (35 kB)
Requirement already satisfied: importlib-metadata>=0.12 in <https://ci-beam.apache.org/job/beam_python_mongoio_load_test/ws/src/build/gradleenv/-1734967053/lib/python3.6/site-packages>
(from pytest<5.0,>=4.4.0->apache-beam==2.27.0.dev0) (3.1.1)
Collecting pytest-timeout<2,>=1.3.3
  Using cached pytest_timeout-1.4.2-py2.py3-none-any.whl (10 kB)
Collecting pytest-xdist<2,>=1.29.0
  Using cached pytest_xdist-1.34.0-py2.py3-none-any.whl (36 kB)
Requirement already satisfied: six>=1.6 in <https://ci-beam.apache.org/job/beam_python_mongoio_load_test/ws/src/build/gradleenv/-1734967053/lib/python3.6/site-packages>
(from azure-core>=1.7.0->apache-beam==2.27.0.dev0) (1.15.0)
Collecting execnet>=1.1
  Using cached execnet-1.7.1-py2.py3-none-any.whl (39 kB)
Collecting apipkg>=1.4
  Using cached apipkg-1.5-py2.py3-none-any.whl (4.9 kB)
Collecting pytest-forked
  Using cached pytest_forked-1.3.0-py2.py3-none-any.whl (4.7 kB)
Requirement already satisfied: py>=1.5.0 in <https://ci-beam.apache.org/job/beam_python_mongoio_load_test/ws/src/build/gradleenv/-1734967053/lib/python3.6/site-packages>
(from pytest<5.0,>=4.4.0->apache-beam==2.27.0.dev0) (1.9.0)
Collecting python-dateutil<3,>=2.8.0
  Using cached python_dateutil-2.8.1-py2.py3-none-any.whl (227 kB)
Requirement already satisfied: six>=1.6 in <https://ci-beam.apache.org/job/beam_python_mongoio_load_test/ws/src/build/gradleenv/-1734967053/lib/python3.6/site-packages>
(from azure-core>=1.7.0->apache-beam==2.27.0.dev0) (1.15.0)
Collecting pytz>=2018.3
  Using cached pytz-2020.4-py2.py3-none-any.whl (509 kB)
Collecting pyyaml<6.0.0,>=3.12
  Using cached PyYAML-5.3.1-cp36-cp36m-linux_x86_64.whl
Collecting requests<3.0.0,>=2.24.0
  Using cached requests-2.25.0-py2.py3-none-any.whl (61 kB)
Collecting chardet<4,>=3.0.2
  Using cached chardet-3.0.4-py2.py3-none-any.whl (133 kB)
Collecting idna<3,>=2.5
  Using cached idna-2.10-py2.py3-none-any.whl (58 kB)
Collecting requests_mock<2.0,>=1.7
  Using cached requests_mock-1.8.0-py2.py3-none-any.whl (23 kB)
Requirement already satisfied: six>=1.6 in <https://ci-beam.apache.org/job/beam_python_mongoio_load_test/ws/src/build/gradleenv/-1734967053/lib/python3.6/site-packages>
(from azure-core>=1.7.0->apache-beam==2.27.0.dev0) (1.15.0)
Collecting requests-oauthlib>=0.5.0
  Using cached requests_oauthlib-1.3.0-py2.py3-none-any.whl (23 kB)
Collecting oauthlib>=3.0.0
  Using cached oauthlib-3.1.0-py2.py3-none-any.whl (147 kB)
Collecting rsa<5,>=3.1.4
  Using cached rsa-4.6-py3-none-any.whl (47 kB)
Collecting s3transfer<0.4.0,>=0.3.0
  Using cached s3transfer-0.3.3-py2.py3-none-any.whl (69 kB)
Collecting sqlalchemy<2.0,>=1.3
  Using cached SQLAlchemy-1.3.20-cp36-cp36m-manylinux2010_x86_64.whl (1.3 MB)
Collecting tenacity<6.0,>=5.0.2
  Using cached tenacity-5.1.5-py2.py3-none-any.whl (34 kB)
Requirement already satisfied: six>=1.6 in <https://ci-beam.apache.org/job/beam_python_mongoio_load_test/ws/src/build/gradleenv/-1734967053/lib/python3.6/site-packages>
(from azure-core>=1.7.0->apache-beam==2.27.0.dev0) (1.15.0)
Collecting testcontainers<4.0.0,>=3.0.3
  Using cached testcontainers-3.1.0-py2.py3-none-any.whl
Collecting blindspin
  Using cached blindspin-2.0.1-py3-none-any.whl
Collecting crayons
  Using cached crayons-0.4.0-py2.py3-none-any.whl (4.6 kB)
Collecting colorama
  Using cached colorama-0.4.4-py2.py3-none-any.whl (16 kB)
Collecting deprecation
  Using cached deprecation-2.1.0-py2.py3-none-any.whl (11 kB)
Collecting docker
  Using cached docker-4.4.0-py2.py3-none-any.whl (146 kB)
Requirement already satisfied: six>=1.6 in <https://ci-beam.apache.org/job/beam_python_mongoio_load_test/ws/src/build/gradleenv/-1734967053/lib/python3.6/site-packages>
(from azure-core>=1.7.0->apache-beam==2.27.0.dev0) (1.15.0)
Collecting typing-extensions<3.8.0,>=3.7.0
  Using cached typing_extensions-3.7.4.3-py3-none-any.whl (22 kB)
Collecting typing-inspect>=0.4.0
  Using cached typing_inspect-0.6.0-py3-none-any.whl (8.1 kB)
Collecting mypy-extensions>=0.3.0
  Using cached mypy_extensions-0.4.3-py2.py3-none-any.whl (4.5 kB)
Collecting urllib3<1.27,>=1.25.4
  Using cached urllib3-1.26.2-py2.py3-none-any.whl (136 kB)
Collecting wcwidth
  Using cached wcwidth-0.2.5-py2.py3-none-any.whl (30 kB)
Collecting websocket-client>=0.32.0
  Using cached websocket_client-0.57.0-py2.py3-none-any.whl (200 kB)
Requirement already satisfied: six>=1.6 in <https://ci-beam.apache.org/job/beam_python_mongoio_load_test/ws/src/build/gradleenv/-1734967053/lib/python3.6/site-packages>
(from azure-core>=1.7.0->apache-beam==2.27.0.dev0) (1.15.0)
Collecting wrapt
  Using cached wrapt-1.12.1-cp36-cp36m-linux_x86_64.whl
Building wheels for collected packages: apache-beam
  Building wheel for apache-beam (setup.py): started
  Building wheel for apache-beam (setup.py): finished with status 'done'
  Created wheel for apache-beam: filename=apache_beam-2.27.0.dev0-py3-none-any.whl size=2375617
sha256=71d108fe0da230dcadd6ed70e78110c7f7262b8167201648228ba76c792b2940
  Stored in directory: /home/jenkins/.cache/pip/wheels/84/1e/e9/ee5e7224f16ba01ef34d3345aac43abb3e3f731295e5c52cb7
Successfully built apache-beam
Installing collected packages: pyasn1, urllib3, rsa, pyparsing, pycparser, pyasn1-modules,
idna, chardet, certifi, cachetools, wcwidth, typing-extensions, requests, pytz, python-dateutil,
packaging, oauthlib, mypy-extensions, more-itertools, jmespath, googleapis-common-protos,
google-auth, cffi, attrs, atomicwrites, websocket-client, typing-inspect, requests-oauthlib,
pyyaml, pytest, pbr, numpy, monotonic, isodate, httplib2, grpcio-gcp, google-crc32c, google-api-core,
docopt, dataclasses, colorama, botocore, apipkg, wrapt, s3transfer, pytest-forked, pymongo,
pydot, pyarrow, proto-plus, oauth2client, nose, msrest, mock, libcst, hdfs, grpc-google-iam-v1,
google-resumable-media, google-cloud-core, fasteners, fastavro, execnet, docker, dill, deprecation,
cryptography, crcmod, crayons, blindspin, azure-core, avro-python3, testcontainers, tenacity,
sqlalchemy, requests-mock, pytest-xdist, pytest-timeout, pyhamcrest, psycopg2-binary, parameterized,
pandas, nose-xunitmp, google-cloud-vision, google-cloud-videointelligence, google-cloud-spanner,
google-cloud-pubsub, google-cloud-language, google-cloud-dlp, google-cloud-datastore, google-cloud-build,
google-cloud-bigtable, google-cloud-bigquery, google-apitools, freezegun, boto3, azure-storage-blob,
apache-beam
Successfully installed apache-beam-2.27.0.dev0 apipkg-1.5 atomicwrites-1.4.0 attrs-20.3.0
avro-python3-1.9.2.1 azure-core-1.9.0 azure-storage-blob-12.6.0 blindspin-2.0.1 boto3-1.16.30
botocore-1.19.30 cachetools-4.1.1 certifi-2020.12.5 cffi-1.14.4 chardet-3.0.4 colorama-0.4.4
crayons-0.4.0 crcmod-1.7 cryptography-3.2.1 dataclasses-0.8 deprecation-2.1.0 dill-0.3.1.1
docker-4.4.0 docopt-0.6.2 execnet-1.7.1 fastavro-1.2.1 fasteners-0.15 freezegun-1.0.0 google-api-core-1.23.0
google-apitools-0.5.31 google-auth-1.23.0 google-cloud-bigquery-1.28.0 google-cloud-bigtable-1.6.1
google-cloud-build-2.0.0 google-cloud-core-1.4.4 google-cloud-datastore-1.15.3 google-cloud-dlp-1.0.0
google-cloud-language-1.3.0 google-cloud-pubsub-1.7.0 google-cloud-spanner-1.19.1 google-cloud-videointelligence-1.16.1
google-cloud-vision-1.0.0 google-crc32c-1.0.0 google-resumable-media-1.1.0 googleapis-common-protos-1.52.0
grpc-google-iam-v1-0.12.3 grpcio-gcp-0.2.2 hdfs-2.5.8 httplib2-0.17.4 idna-2.10 isodate-0.6.0
jmespath-0.10.0 libcst-0.3.15 mock-2.0.0 monotonic-1.5 more-itertools-8.6.0 msrest-0.6.19
mypy-extensions-0.4.3 nose-1.3.7 nose-xunitmp-0.4.1 numpy-1.19.4 oauth2client-4.1.3 oauthlib-3.1.0
packaging-20.7 pandas-1.1.4 parameterized-0.7.4 pbr-5.5.1 proto-plus-1.11.0 psycopg2-binary-2.8.6
pyarrow-2.0.0 pyasn1-0.4.8 pyasn1-modules-0.2.8 pycparser-2.20 pydot-1.4.1 pyhamcrest-1.10.1
pymongo-3.11.2 pyparsing-2.4.7 pytest-4.6.11 pytest-forked-1.3.0 pytest-timeout-1.4.2 pytest-xdist-1.34.0
python-dateutil-2.8.1 pytz-2020.4 pyyaml-5.3.1 requests-2.25.0 requests-mock-1.8.0 requests-oauthlib-1.3.0
rsa-4.6 s3transfer-0.3.3 sqlalchemy-1.3.20 tenacity-5.1.5 testcontainers-3.1.0 typing-extensions-3.7.4.3
typing-inspect-0.6.0 urllib3-1.26.2 wcwidth-0.2.5 websocket-client-0.57.0 wrapt-1.12.1

> Task :sdks:python:test-suites:dataflow:py36:mongodbioIT FAILED
Traceback (most recent call last):
  File "/usr/lib/python3.6/runpy.py", line 193, in _run_module_as_main
    "__main__", mod_spec)
  File "/usr/lib/python3.6/runpy.py", line 85, in _run_code
    exec(code, run_globals)
  File "<https://ci-beam.apache.org/job/beam_python_mongoio_load_test/ws/src/build/gradleenv/-1734967053/lib/python3.6/site-packages/apache_beam/io/mongodbio_it_test.py",>
line 172, in <module>
    run()
  File "<https://ci-beam.apache.org/job/beam_python_mongoio_load_test/ws/src/build/gradleenv/-1734967053/lib/python3.6/site-packages/apache_beam/io/mongodbio_it_test.py",>
line 71, in run
    with TestPipeline(options=PipelineOptions(pipeline_args)) as p:
  File "<https://ci-beam.apache.org/job/beam_python_mongoio_load_test/ws/src/build/gradleenv/-1734967053/lib/python3.6/site-packages/apache_beam/testing/test_pipeline.py",>
line 107, in __init__
    super(TestPipeline, self).__init__(runner, options)
  File "<https://ci-beam.apache.org/job/beam_python_mongoio_load_test/ws/src/build/gradleenv/-1734967053/lib/python3.6/site-packages/apache_beam/pipeline.py",>
line 203, in __init__
    'Pipeline has validations errors: \n' + '\n'.join(errors))
ValueError: Pipeline has validations errors: 
Missing required option: region.

FAILURE: Build failed with an exception.

* Where:
Script '<https://ci-beam.apache.org/job/beam_python_mongoio_load_test/ws/src/sdks/python/test-suites/dataflow/common.gradle'>
line: 205

* What went wrong:
Execution failed for task ':sdks:python:test-suites:dataflow:py36:mongodbioIT'.
> Process 'command 'sh'' finished with non-zero exit value 1

* Try:
Run with --stacktrace option to get the stack trace. Run with --info or --debug option to
get more log output. Run with --scan to get full insights.

* Get more help at https://help.gradle.org

Deprecated Gradle features were used in this build, making it incompatible with Gradle 7.0.
Use '--warning-mode all' to show the individual deprecation warnings.
See https://docs.gradle.org/6.7/userguide/command_line_interface.html#sec:command_line_warnings

BUILD FAILED in 1m 3s
5 actionable tasks: 5 executed

Publishing build scan...
https://gradle.com/s/mvbhxv5shmn2g

Build step 'Invoke Gradle script' changed build result to FAILURE
Build step 'Invoke Gradle script' marked build as failure

---------------------------------------------------------------------
To unsubscribe, e-mail: builds-unsubscribe@beam.apache.org
For additional commands, e-mail: builds-help@beam.apache.org


Mime
View raw message