beam-builds mailing list archives

Site index · List index
Message view « Date » · « Thread »
Top « Date » · « Thread »
From Apache Jenkins Server <jenk...@builds.apache.org>
Subject Build failed in Jenkins: beam_PostCommit_Python35_Pytest #108
Date Fri, 07 Aug 2020 00:00:45 GMT
See <https://ci-beam.apache.org/job/beam_PostCommit_Python35_Pytest/108/display/redirect?page=changes>

Changes:

[piotr.szuberski] [BEAM-10135][BEAM-10136] Refactor jdbc external transform registrar

[douglas.damon] Add Additional Parameters lesson to Go SDK Katas

[douglas.damon] Edit lesson name and task description

[Rui Wang] [BEAM-10633] UdfImpl should be able to return java.util.List.

[piotr.szuberski] [BEAM-10543] Add new parameters to Kafka Read cross language

[piotr.szuberski] [BEAM-10543] Add new parameters to python wrapper of Kafka Read

[piotr.szuberski] [BEAM-10543] Modify Kafka python cross-language integration test to use

[piotr.szuberski] [BEAM-10543] Run Kafka cross-language integration test in python

[Robert Burke] [BEAM-9615] Add initial Schema to Go conversions.

[douglas.damon] Additional edits to task description

[douglas.damon] Update stepik course

[noreply] [BEAM-10240] Support ZetaSQL DATETIME functions in BeamSQL (#12348)

[Robert Burke] [BEAM-9615] Improve error handling on schema conv

[noreply] Updating changes.md (#12424)

[noreply] [BEAM-10645] Create context for allowing non-parallel dataframe


------------------------------------------
Started by timer
Running as SYSTEM
[EnvInject] - Loading node environment variables.
Building remotely on apache-beam-jenkins-4 (beam) in workspace <https://ci-beam.apache.org/job/beam_PostCommit_Python35_Pytest/ws/>
No credentials specified
Wiping out workspace first.
Cloning the remote Git repository
Cloning repository https://github.com/apache/beam.git
 > git init <https://ci-beam.apache.org/job/beam_PostCommit_Python35_Pytest/ws/src>
# timeout=10
Fetching upstream changes from https://github.com/apache/beam.git
 > git --version # timeout=10
 > git fetch --tags --progress https://github.com/apache/beam.git +refs/heads/*:refs/remotes/origin/*
# timeout=10
 > git config remote.origin.url https://github.com/apache/beam.git # timeout=10
 > git config --add remote.origin.fetch +refs/heads/*:refs/remotes/origin/* # timeout=10
 > git config remote.origin.url https://github.com/apache/beam.git # timeout=10
Fetching upstream changes from https://github.com/apache/beam.git
 > git fetch --tags --progress https://github.com/apache/beam.git +refs/heads/*:refs/remotes/origin/*
+refs/pull/${ghprbPullId}/*:refs/remotes/origin/pr/${ghprbPullId}/* # timeout=10
 > git rev-parse origin/master^{commit} # timeout=10
Checking out Revision 1671ce5d7802d2b771bac20dab0c3eb3fdb9f5f0 (origin/master)
 > git config core.sparsecheckout # timeout=10
 > git checkout -f 1671ce5d7802d2b771bac20dab0c3eb3fdb9f5f0 # timeout=10
Commit message: "[BEAM-10645] Create context for allowing non-parallel dataframe operations.
(#12476)"
 > git rev-list --no-walk 41359688fb44a1785e460b4b09e5667859f5d205 # timeout=10
No emails were triggered.
[EnvInject] - Executing scripts and injecting environment variables after the SCM step.
[EnvInject] - Injecting as environment variables the properties content 
SPARK_LOCAL_IP=127.0.0.1

[EnvInject] - Variables injected successfully.
[Gradle] - Launching build.
[src] $ <https://ci-beam.apache.org/job/beam_PostCommit_Python35_Pytest/ws/src/gradlew>
--continue --max-workers=12 -Dorg.gradle.jvmargs=-Xms2g -Dorg.gradle.jvmargs=-Xmx4g :python35PostCommitPytest
Starting a Gradle Daemon, 2 busy Daemons could not be reused, use --status for details
> Task :buildSrc:compileJava NO-SOURCE
> Task :buildSrc:compileGroovy FROM-CACHE
> Task :buildSrc:pluginDescriptors
> Task :buildSrc:processResources
> Task :buildSrc:classes
> Task :buildSrc:jar
> Task :buildSrc:assemble
> Task :buildSrc:spotlessGroovy
> Task :buildSrc:spotlessGroovyCheck
> Task :buildSrc:spotlessGroovyGradle
> Task :buildSrc:spotlessGroovyGradleCheck
> Task :buildSrc:spotlessCheck
> Task :buildSrc:pluginUnderTestMetadata
> Task :buildSrc:compileTestJava NO-SOURCE
> Task :buildSrc:compileTestGroovy NO-SOURCE
> Task :buildSrc:processTestResources NO-SOURCE
> Task :buildSrc:testClasses UP-TO-DATE
> Task :buildSrc:test NO-SOURCE
> Task :buildSrc:validateTaskProperties FROM-CACHE
> Task :buildSrc:check
> Task :buildSrc:build
Configuration on demand is an incubating feature.

FAILURE: Build failed with an exception.

* What went wrong:
Task 'python35PostCommitPytest' not found in root project 'beam'.

* Try:
Run gradlew tasks to get a list of available tasks. Run with --stacktrace option to get the
stack trace. Run with --info or --debug option to get more log output. Run with --scan to
get full insights.

* Get more help at https://help.gradle.org

Deprecated Gradle features were used in this build, making it incompatible with Gradle 6.0.
Use '--warning-mode all' to show the individual deprecation warnings.
See https://docs.gradle.org/5.2.1/userguide/command_line_interface.html#sec:command_line_warnings

BUILD FAILED in 17s

Publishing build scan...
https://gradle.com/s/hf4wi3cajxu2g

Build step 'Invoke Gradle script' changed build result to FAILURE
Build step 'Invoke Gradle script' marked build as failure

---------------------------------------------------------------------
To unsubscribe, e-mail: builds-unsubscribe@beam.apache.org
For additional commands, e-mail: builds-help@beam.apache.org


Mime
View raw message