beam-builds mailing list archives

Site index · List index
Message view « Date » · « Thread »
Top « Date » · « Thread »
From Apache Jenkins Server <jenk...@builds.apache.org>
Subject Build failed in Jenkins: beam_PostCommit_Java_PortabilityApi #36
Date Mon, 20 Jul 2020 00:00:46 GMT
See <https://ci-beam.apache.org/job/beam_PostCommit_Java_PortabilityApi/36/display/redirect>

Changes:


------------------------------------------
Started by timer
Running as SYSTEM
[EnvInject] - Loading node environment variables.
Building remotely on apache-beam-jenkins-11 (beam) in workspace <https://ci-beam.apache.org/job/beam_PostCommit_Java_PortabilityApi/ws/>
No credentials specified
Wiping out workspace first.
Cloning the remote Git repository
Cloning repository https://github.com/apache/beam.git
 > git init <https://ci-beam.apache.org/job/beam_PostCommit_Java_PortabilityApi/ws/src>
# timeout=10
Fetching upstream changes from https://github.com/apache/beam.git
 > git --version # timeout=10
 > git fetch --tags --progress https://github.com/apache/beam.git +refs/heads/*:refs/remotes/origin/*
# timeout=10
 > git config remote.origin.url https://github.com/apache/beam.git # timeout=10
 > git config --add remote.origin.fetch +refs/heads/*:refs/remotes/origin/* # timeout=10
 > git config remote.origin.url https://github.com/apache/beam.git # timeout=10
Fetching upstream changes from https://github.com/apache/beam.git
 > git fetch --tags --progress https://github.com/apache/beam.git +refs/heads/*:refs/remotes/origin/*
+refs/pull/${ghprbPullId}/*:refs/remotes/origin/pr/${ghprbPullId}/* # timeout=10
 > git rev-parse origin/master^{commit} # timeout=10
Checking out Revision 630432e632e2cf10fc0ba4b66c8c5aa6efb5cea9 (origin/master)
 > git config core.sparsecheckout # timeout=10
 > git checkout -f 630432e632e2cf10fc0ba4b66c8c5aa6efb5cea9 # timeout=10
Commit message: "Merge pull request #12268: [BEAM-10090] Update JAXB dependencies for Java
11."
 > git rev-list --no-walk 630432e632e2cf10fc0ba4b66c8c5aa6efb5cea9 # timeout=10
No emails were triggered.
[EnvInject] - Executing scripts and injecting environment variables after the SCM step.
[EnvInject] - Injecting as environment variables the properties content 
SPARK_LOCAL_IP=127.0.0.1

[EnvInject] - Variables injected successfully.
[Gradle] - Launching build.
[src] $ <https://ci-beam.apache.org/job/beam_PostCommit_Java_PortabilityApi/ws/src/gradlew>
--continue --max-workers=12 -Dorg.gradle.jvmargs=-Xms2g -Dorg.gradle.jvmargs=-Xmx4g -Pmaven_home=/home/jenkins/tools/maven/apache-maven-3.5.4
--continue :javaPostCommitPortabilityApi
Starting a Gradle Daemon (subsequent builds will be faster)
> Task :buildSrc:compileJava NO-SOURCE
> Task :buildSrc:compileGroovy FROM-CACHE
> Task :buildSrc:pluginDescriptors
> Task :buildSrc:processResources
> Task :buildSrc:classes
> Task :buildSrc:jar
> Task :buildSrc:assemble
> Task :buildSrc:spotlessGroovy
> Task :buildSrc:spotlessGroovyCheck
> Task :buildSrc:spotlessGroovyGradle
> Task :buildSrc:spotlessGroovyGradleCheck
> Task :buildSrc:spotlessCheck
> Task :buildSrc:pluginUnderTestMetadata
> Task :buildSrc:compileTestJava NO-SOURCE
> Task :buildSrc:compileTestGroovy NO-SOURCE
> Task :buildSrc:processTestResources NO-SOURCE
> Task :buildSrc:testClasses UP-TO-DATE
> Task :buildSrc:test NO-SOURCE
> Task :buildSrc:validateTaskProperties FROM-CACHE
> Task :buildSrc:check
> Task :buildSrc:build
Configuration on demand is an incubating feature.

FAILURE: Build failed with an exception.

* What went wrong:
Task 'javaPostCommitPortabilityApi' not found in root project 'beam'. Some candidates are:
'javaPreCommitPortabilityApi'.

* Try:
Run gradlew tasks to get a list of available tasks. Run with --stacktrace option to get the
stack trace. Run with --info or --debug option to get more log output. Run with --scan to
get full insights.

* Get more help at https://help.gradle.org

Deprecated Gradle features were used in this build, making it incompatible with Gradle 6.0.
Use '--warning-mode all' to show the individual deprecation warnings.
See https://docs.gradle.org/5.2.1/userguide/command_line_interface.html#sec:command_line_warnings

BUILD FAILED in 17s

Publishing build scan...
https://gradle.com/s/wm5k3rrd4ibvc

Build step 'Invoke Gradle script' changed build result to FAILURE
Build step 'Invoke Gradle script' marked build as failure

---------------------------------------------------------------------
To unsubscribe, e-mail: builds-unsubscribe@beam.apache.org
For additional commands, e-mail: builds-help@beam.apache.org


Mime
View raw message