beam-builds mailing list archives

Site index · List index
Message view « Date » · « Thread »
Top « Date » · « Thread »
From Apache Jenkins Server <jenk...@builds.apache.org>
Subject Build failed in Jenkins: beam_PostCommit_Py_VR_Dataflow #6548
Date Thu, 04 Jun 2020 13:16:32 GMT
See <https://builds.apache.org/job/beam_PostCommit_Py_VR_Dataflow/6548/display/redirect?page=changes>

Changes:

[nfisher] [BEAM-10017] Expose Cassandra Connect/Read timeouts

[mxm] [BEAM-10054] Add test which demonstrates a pipeline stall

[mxm] [BEAM-10054] Fix watermark hold for on_time_pane to prevent pipeline

[mxm] linting

[echauchot] [BEAM-10017] Minor fixes of javadoc and error messages


------------------------------------------
[...truncated 19.60 MB...]
INFO:apache_beam.runners.dataflow.dataflow_runner:2020-06-04T13:12:26.708Z: JOB_MESSAGE_BASIC:
Finished operation assert_that/Create/Impulse+assert_that/Create/FlatMap(<lambda at core.py:2623>)+assert_that/Create/Map(decode)+assert_that/Group/pair_with_0+assert_that/Group/GroupByKey/WriteStream
INFO:apache_beam.runners.dataflow.dataflow_runner:2020-06-04T13:12:26.708Z: JOB_MESSAGE_BASIC:
Finished operation Create/MaybeReshuffle/Reshuffle/ReshufflePerKey/GroupByKey/ReadStream+Create/MaybeReshuffle/Reshuffle/ReshufflePerKey/GroupByKey/MergeBuckets+Create/MaybeReshuffle/Reshuffle/ReshufflePerKey/FlatMap(restore_timestamps)+Create/MaybeReshuffle/Reshuffle/RemoveRandomKeys+Create/Map(decode)+Key
param+assert_that/WindowInto(WindowIntoFn)+assert_that/ToVoidKey+assert_that/Group/pair_with_1+assert_that/Group/GroupByKey/WriteStream
INFO:apache_beam.runners.dataflow.dataflow_runner:2020-06-04T13:12:26.708Z: JOB_MESSAGE_BASIC:
Finished operation assert_that/Group/GroupByKey/ReadStream+assert_that/Group/GroupByKey/MergeBuckets+assert_that/Group/Map(_merge_tagged_vals_under_key)+assert_that/Unkey+assert_that/Match
INFO:apache_beam.runners.dataflow.dataflow_runner:2020-06-04T13:12:26.885Z: JOB_MESSAGE_DETAILED:
Cleaning up.
INFO:apache_beam.runners.dataflow.dataflow_runner:2020-06-04T13:12:26.913Z: JOB_MESSAGE_BASIC:
Worker pool stopped.
INFO:apache_beam.runners.dataflow.dataflow_runner:2020-06-04T13:12:26.917Z: JOB_MESSAGE_DEBUG:
Tearing down pending resources...
INFO:apache_beam.runners.dataflow.dataflow_runner:2020-06-04T13:12:26.919Z: JOB_MESSAGE_DEBUG:
Starting worker pool teardown.
INFO:apache_beam.runners.dataflow.dataflow_runner:2020-06-04T13:12:26.923Z: JOB_MESSAGE_BASIC:
Stopping worker pool...

> Task :sdks:python:test-suites:dataflow:py37:validatesRunnerStreamingTests
INFO:apache_beam.runners.dataflow.dataflow_runner:2020-06-04T13:14:05.592Z: JOB_MESSAGE_BASIC:
Finished operation assert_that/Create/Impulse+assert_that/Create/FlatMap(<lambda at core.py:2623>)+assert_that/Create/Map(decode)+assert_that/Group/pair_with_0+assert_that/Group/GroupByKey/WriteStream
INFO:apache_beam.runners.dataflow.dataflow_runner:2020-06-04T13:14:05.592Z: JOB_MESSAGE_BASIC:
Finished operation Create/MaybeReshuffle/Reshuffle/ReshufflePerKey/GroupByKey/ReadStream+Create/MaybeReshuffle/Reshuffle/ReshufflePerKey/GroupByKey/MergeBuckets+Create/MaybeReshuffle/Reshuffle/ReshufflePerKey/FlatMap(restore_timestamps)+Create/MaybeReshuffle/Reshuffle/RemoveRandomKeys+Create/Map(decode)+Key
param+assert_that/WindowInto(WindowIntoFn)+assert_that/ToVoidKey+assert_that/Group/pair_with_1+assert_that/Group/GroupByKey/WriteStream
INFO:apache_beam.runners.dataflow.dataflow_runner:2020-06-04T13:14:05.592Z: JOB_MESSAGE_BASIC:
Finished operation assert_that/Group/GroupByKey/ReadStream+assert_that/Group/GroupByKey/MergeBuckets+assert_that/Group/Map(_merge_tagged_vals_under_key)+assert_that/Unkey+assert_that/Match
INFO:apache_beam.runners.dataflow.dataflow_runner:2020-06-04T13:14:05.592Z: JOB_MESSAGE_BASIC:
Finished operation Create/Impulse+Create/FlatMap(<lambda at core.py:2623>)+Create/MaybeReshuffle/Reshuffle/AddRandomKeys+Create/MaybeReshuffle/Reshuffle/ReshufflePerKey/Map(reify_timestamps)+Create/MaybeReshuffle/Reshuffle/ReshufflePerKey/GroupByKey/WriteStream
INFO:apache_beam.runners.dataflow.dataflow_runner:2020-06-04T13:14:05.734Z: JOB_MESSAGE_DETAILED:
Cleaning up.
INFO:apache_beam.runners.dataflow.dataflow_runner:2020-06-04T13:14:05.768Z: JOB_MESSAGE_BASIC:
Worker pool stopped.
INFO:apache_beam.runners.dataflow.dataflow_runner:2020-06-04T13:14:05.776Z: JOB_MESSAGE_DEBUG:
Tearing down pending resources...
INFO:apache_beam.runners.dataflow.dataflow_runner:2020-06-04T13:14:05.779Z: JOB_MESSAGE_DEBUG:
Starting worker pool teardown.
INFO:apache_beam.runners.dataflow.dataflow_runner:2020-06-04T13:14:05.784Z: JOB_MESSAGE_BASIC:
Stopping worker pool...

> Task :sdks:python:test-suites:dataflow:py36:validatesRunnerStreamingTests
INFO:apache_beam.runners.dataflow.dataflow_runner:2020-06-04T13:14:31.427Z: JOB_MESSAGE_BASIC:
Finished operation Create/MaybeReshuffle/Reshuffle/ReshufflePerKey/GroupByKey/ReadStream+Create/MaybeReshuffle/Reshuffle/ReshufflePerKey/GroupByKey/MergeBuckets+Create/MaybeReshuffle/Reshuffle/ReshufflePerKey/FlatMap(restore_timestamps)+Create/MaybeReshuffle/Reshuffle/RemoveRandomKeys+Create/Map(decode)+Key
param+assert_that/WindowInto(WindowIntoFn)+assert_that/ToVoidKey+assert_that/Group/pair_with_1+assert_that/Group/GroupByKey/WriteStream
INFO:apache_beam.runners.dataflow.dataflow_runner:2020-06-04T13:14:31.427Z: JOB_MESSAGE_BASIC:
Finished operation assert_that/Group/GroupByKey/ReadStream+assert_that/Group/GroupByKey/MergeBuckets+assert_that/Group/Map(_merge_tagged_vals_under_key)+assert_that/Unkey+assert_that/Match
INFO:apache_beam.runners.dataflow.dataflow_runner:2020-06-04T13:14:31.427Z: JOB_MESSAGE_BASIC:
Finished operation Create/Impulse+Create/FlatMap(<lambda at core.py:2623>)+Create/MaybeReshuffle/Reshuffle/AddRandomKeys+Create/MaybeReshuffle/Reshuffle/ReshufflePerKey/Map(reify_timestamps)+Create/MaybeReshuffle/Reshuffle/ReshufflePerKey/GroupByKey/WriteStream
INFO:apache_beam.runners.dataflow.dataflow_runner:2020-06-04T13:14:31.427Z: JOB_MESSAGE_BASIC:
Finished operation assert_that/Create/Impulse+assert_that/Create/FlatMap(<lambda at core.py:2623>)+assert_that/Create/Map(decode)+assert_that/Group/pair_with_0+assert_that/Group/GroupByKey/WriteStream
INFO:apache_beam.runners.dataflow.dataflow_runner:2020-06-04T13:14:31.582Z: JOB_MESSAGE_DETAILED:
Cleaning up.
INFO:apache_beam.runners.dataflow.dataflow_runner:2020-06-04T13:14:31.613Z: JOB_MESSAGE_BASIC:
Worker pool stopped.
INFO:apache_beam.runners.dataflow.dataflow_runner:2020-06-04T13:14:31.617Z: JOB_MESSAGE_DEBUG:
Tearing down pending resources...
INFO:apache_beam.runners.dataflow.dataflow_runner:2020-06-04T13:14:31.619Z: JOB_MESSAGE_DEBUG:
Starting worker pool teardown.
INFO:apache_beam.runners.dataflow.dataflow_runner:2020-06-04T13:14:31.624Z: JOB_MESSAGE_BASIC:
Stopping worker pool...

> Task :sdks:python:test-suites:dataflow:py35:validatesRunnerStreamingTests
INFO:apache_beam.runners.dataflow.dataflow_runner:2020-06-04T13:14:40.883Z: JOB_MESSAGE_BASIC:
Worker pool stopped.
INFO:apache_beam.runners.dataflow.dataflow_runner:Job 2020-06-04_06_06_43-16522176590072527367
is in state JOB_STATE_DONE
Worker logs: https://console.cloud.google.com/dataflow/jobs/us-central1/2020-06-04_05_42_36-3375225247085581290?project=apache-beam-testing
Worker logs: https://console.cloud.google.com/dataflow/jobs/us-central1/2020-06-04_05_50_35-1038179643057982454?project=apache-beam-testing
Worker logs: https://console.cloud.google.com/dataflow/jobs/us-central1/2020-06-04_05_58_39-4595905034069954263?project=apache-beam-testing
Worker logs: https://console.cloud.google.com/dataflow/jobs/us-central1/2020-06-04_05_42_37-3694814758128717098?project=apache-beam-testing
Worker logs: https://console.cloud.google.com/dataflow/jobs/us-central1/2020-06-04_05_50_23-8659531962768758458?project=apache-beam-testing
Worker logs: https://console.cloud.google.com/dataflow/jobs/us-central1/2020-06-04_05_58_31-12847761806196255428?project=apache-beam-testing
Worker logs: https://console.cloud.google.com/dataflow/jobs/us-central1/2020-06-04_05_42_36-1388276048522081786?project=apache-beam-testing
Worker logs: https://console.cloud.google.com/dataflow/jobs/us-central1/2020-06-04_05_50_30-17844069501483430968?project=apache-beam-testing
Worker logs: https://console.cloud.google.com/dataflow/jobs/us-central1/2020-06-04_05_58_39-11075183757089631497?project=apache-beam-testing
Worker logs: https://console.cloud.google.com/dataflow/jobs/us-central1/2020-06-04_05_42_35-3461677451635223149?project=apache-beam-testing
Worker logs: https://console.cloud.google.com/dataflow/jobs/us-central1/2020-06-04_05_50_15-12570078859431216598?project=apache-beam-testing
Worker logs: https://console.cloud.google.com/dataflow/jobs/us-central1/2020-06-04_05_58_28-10591959015817552714?project=apache-beam-testing
Worker logs: https://console.cloud.google.com/dataflow/jobs/us-central1/2020-06-04_05_42_34-17029596906055491705?project=apache-beam-testing
Worker logs: https://console.cloud.google.com/dataflow/jobs/us-central1/2020-06-04_05_50_18-17174682628397791214?project=apache-beam-testing
Worker logs: https://console.cloud.google.com/dataflow/jobs/us-central1/2020-06-04_05_58_46-16844491389852809947?project=apache-beam-testing
Worker logs: https://console.cloud.google.com/dataflow/jobs/us-central1/2020-06-04_06_06_43-16522176590072527367?project=apache-beam-testing
Worker logs: https://console.cloud.google.com/dataflow/jobs/us-central1/2020-06-04_05_42_36-12729338518416006199?project=apache-beam-testing
Worker logs: https://console.cloud.google.com/dataflow/jobs/us-central1/2020-06-04_05_51_08-12590384386799825175?project=apache-beam-testing
Worker logs: https://console.cloud.google.com/dataflow/jobs/us-central1/2020-06-04_05_42_36-9524461134730665572?project=apache-beam-testing
Worker logs: https://console.cloud.google.com/dataflow/jobs/us-central1/2020-06-04_05_50_39-2832661781112600162?project=apache-beam-testing
Worker logs: https://console.cloud.google.com/dataflow/jobs/us-central1/2020-06-04_05_58_44-17299163975907790402?project=apache-beam-testing
Worker logs: https://console.cloud.google.com/dataflow/jobs/us-central1/2020-06-04_05_42_35-7574250452140390950?project=apache-beam-testing
Worker logs: https://console.cloud.google.com/dataflow/jobs/us-central1/2020-06-04_05_50_24-11333373348466371615?project=apache-beam-testing
Worker logs: https://console.cloud.google.com/dataflow/jobs/us-central1/2020-06-04_05_58_23-11934422298659750615?project=apache-beam-testing
test_gbk_many_values (apache_beam.runners.portability.fn_api_runner.fn_runner_test.FnApiBasedStateBackedCoderTest)
... ok
Test TimestampCombiner with EARLIEST. ... ok
Test TimestampCombiner with LATEST. ... ok
test_dofn_lifecycle (apache_beam.transforms.dofn_lifecycle_test.DoFnLifecycleTest) ... ok
test_impulse (apache_beam.transforms.ptransform_test.PTransformTest) ... ok
Runs streaming Dataflow job and verifies that user metrics are reported ... ok
test_flatten_one_single_pcollection (apache_beam.transforms.ptransform_test.PTransformTest)
... ok
test_flatten_pcollections (apache_beam.transforms.ptransform_test.PTransformTest) ... ok
test_user_counter_using_pardo (apache_beam.metrics.metric_test.MetricsTest) ... ok
test_flatten_a_flattened_pcollection (apache_beam.transforms.ptransform_test.PTransformTest)
... ok
test_flatten_multiple_pcollections_having_multiple_consumers (apache_beam.transforms.ptransform_test.PTransformTest)
... ok
test_undeclared_outputs (apache_beam.transforms.ptransform_test.PTransformTest) ... ok
test_par_do_with_multiple_outputs_and_using_return (apache_beam.transforms.ptransform_test.PTransformTest)
... ok
test_par_do_with_multiple_outputs_and_using_yield (apache_beam.transforms.ptransform_test.PTransformTest)
... ok
test_as_dict_twice (apache_beam.transforms.sideinputs_test.SideInputsTest) ... ok
test_as_list_and_as_dict_side_inputs (apache_beam.transforms.sideinputs_test.SideInputsTest)
... ok
test_as_list_twice (apache_beam.transforms.sideinputs_test.SideInputsTest) ... ok
test_multiple_empty_outputs (apache_beam.transforms.ptransform_test.PTransformTest) ... ok
test_as_singleton_with_different_defaults (apache_beam.transforms.sideinputs_test.SideInputsTest)
... ok
test_empty_singleton_side_input (apache_beam.transforms.sideinputs_test.SideInputsTest) ...
ok
test_as_singleton_without_unique_labels (apache_beam.transforms.sideinputs_test.SideInputsTest)
... ok
test_iterable_side_input (apache_beam.transforms.sideinputs_test.SideInputsTest) ... ok
test_default_value_singleton_side_input (apache_beam.transforms.sideinputs_test.SideInputsTest)
... ok
test_reshuffle_preserves_timestamps (apache_beam.transforms.util_test.ReshuffleTest) ... ok
test_flattened_side_input (apache_beam.transforms.sideinputs_test.SideInputsTest) ... ok
test_element_param (apache_beam.pipeline_test.DoFnTest) ... ok
test_key_param (apache_beam.pipeline_test.DoFnTest) ... ok

----------------------------------------------------------------------
XML: nosetests-validatesRunnerStreamingTests-df-py35.xml
----------------------------------------------------------------------
XML: <https://builds.apache.org/job/beam_PostCommit_Py_VR_Dataflow/ws/src/sdks/python/nosetests.xml>
----------------------------------------------------------------------
Ran 27 tests in 1956.562s

OK

> Task :sdks:python:test-suites:dataflow:py37:validatesRunnerStreamingTests
INFO:apache_beam.runners.dataflow.dataflow_runner:2020-06-04T13:15:58.312Z: JOB_MESSAGE_BASIC:
Worker pool stopped.
INFO:apache_beam.runners.dataflow.dataflow_runner:Job 2020-06-04_06_08_10-14167703350188488471
is in state JOB_STATE_DONE
Worker logs: https://console.cloud.google.com/dataflow/jobs/us-central1/2020-06-04_05_43_24-15863507626974967805?project=apache-beam-testing
Worker logs: https://console.cloud.google.com/dataflow/jobs/us-central1/2020-06-04_05_51_31-16812243782148796502?project=apache-beam-testing
Worker logs: https://console.cloud.google.com/dataflow/jobs/us-central1/2020-06-04_05_59_24-11368103170814831697?project=apache-beam-testing
Worker logs: https://console.cloud.google.com/dataflow/jobs/us-central1/2020-06-04_05_43_25-5734517903957598858?project=apache-beam-testing
Worker logs: https://console.cloud.google.com/dataflow/jobs/us-central1/2020-06-04_05_51_00-12881463426199674742?project=apache-beam-testing
Worker logs: https://console.cloud.google.com/dataflow/jobs/us-central1/2020-06-04_05_58_52-2051929710443295512?project=apache-beam-testing
Worker logs: https://console.cloud.google.com/dataflow/jobs/us-central1/2020-06-04_05_43_24-1060033396012768311?project=apache-beam-testing
Worker logs: https://console.cloud.google.com/dataflow/jobs/us-central1/2020-06-04_05_51_03-4665348742547276705?project=apache-beam-testing
Worker logs: https://console.cloud.google.com/dataflow/jobs/us-central1/2020-06-04_05_59_29-11471629209463882703?project=apache-beam-testing
Worker logs: https://console.cloud.google.com/dataflow/jobs/us-central1/2020-06-04_05_43_23-13118361733882658435?project=apache-beam-testing
Worker logs: https://console.cloud.google.com/dataflow/jobs/us-central1/2020-06-04_05_51_32-1133745211231803898?project=apache-beam-testing
Worker logs: https://console.cloud.google.com/dataflow/jobs/us-central1/2020-06-04_05_59_15-4531013482955827958?project=apache-beam-testing
Worker logs: https://console.cloud.google.com/dataflow/jobs/us-central1/2020-06-04_05_43_22-6765598108784266071?project=apache-beam-testing
Worker logs: https://console.cloud.google.com/dataflow/jobs/us-central1/2020-06-04_05_51_06-5452269467655010188?project=apache-beam-testing
Worker logs: https://console.cloud.google.com/dataflow/jobs/us-central1/2020-06-04_05_43_23-16345646273493589247?project=apache-beam-testing
Worker logs: https://console.cloud.google.com/dataflow/jobs/us-central1/2020-06-04_05_50_50-17506579161396882856?project=apache-beam-testing
Worker logs: https://console.cloud.google.com/dataflow/jobs/us-central1/2020-06-04_05_59_02-16964628110971336971?project=apache-beam-testing
Worker logs: https://console.cloud.google.com/dataflow/jobs/us-central1/2020-06-04_05_43_25-14622131259051701461?project=apache-beam-testing
Worker logs: https://console.cloud.google.com/dataflow/jobs/us-central1/2020-06-04_05_51_44-11661507175650864354?project=apache-beam-testing
Worker logs: https://console.cloud.google.com/dataflow/jobs/us-central1/2020-06-04_05_59_52-17857446609084804989?project=apache-beam-testing
Worker logs: https://console.cloud.google.com/dataflow/jobs/us-central1/2020-06-04_06_08_10-14167703350188488471?project=apache-beam-testing
Worker logs: https://console.cloud.google.com/dataflow/jobs/us-central1/2020-06-04_05_43_22-215680951170009405?project=apache-beam-testing
Worker logs: https://console.cloud.google.com/dataflow/jobs/us-central1/2020-06-04_05_51_26-12955101820359943091?project=apache-beam-testing
Worker logs: https://console.cloud.google.com/dataflow/jobs/us-central1/2020-06-04_05_59_09-16000327422290838301?project=apache-beam-testing
test_gbk_many_values (apache_beam.runners.portability.fn_api_runner.fn_runner_test.FnApiBasedStateBackedCoderTest)
... ok
Test TimestampCombiner with EARLIEST. ... ok
Test TimestampCombiner with LATEST. ... ok
test_flatten_a_flattened_pcollection (apache_beam.transforms.ptransform_test.PTransformTest)
... ok
Runs streaming Dataflow job and verifies that user metrics are reported ... ok
test_flatten_pcollections (apache_beam.transforms.ptransform_test.PTransformTest) ... ok
test_dofn_lifecycle (apache_beam.transforms.dofn_lifecycle_test.DoFnLifecycleTest) ... ok
test_flatten_one_single_pcollection (apache_beam.transforms.ptransform_test.PTransformTest)
... ok
test_impulse (apache_beam.transforms.ptransform_test.PTransformTest) ... ok
test_user_counter_using_pardo (apache_beam.metrics.metric_test.MetricsTest) ... ok
test_flatten_multiple_pcollections_having_multiple_consumers (apache_beam.transforms.ptransform_test.PTransformTest)
... ok
test_par_do_with_multiple_outputs_and_using_return (apache_beam.transforms.ptransform_test.PTransformTest)
... ok
test_multiple_empty_outputs (apache_beam.transforms.ptransform_test.PTransformTest) ... ok
test_as_dict_twice (apache_beam.transforms.sideinputs_test.SideInputsTest) ... ok
test_as_list_and_as_dict_side_inputs (apache_beam.transforms.sideinputs_test.SideInputsTest)
... ok
test_as_list_twice (apache_beam.transforms.sideinputs_test.SideInputsTest) ... ok
test_par_do_with_multiple_outputs_and_using_yield (apache_beam.transforms.ptransform_test.PTransformTest)
... ok
test_as_singleton_with_different_defaults (apache_beam.transforms.sideinputs_test.SideInputsTest)
... ok
test_undeclared_outputs (apache_beam.transforms.ptransform_test.PTransformTest) ... ok
test_flattened_side_input (apache_beam.transforms.sideinputs_test.SideInputsTest) ... ok
test_as_singleton_without_unique_labels (apache_beam.transforms.sideinputs_test.SideInputsTest)
... ok
test_empty_singleton_side_input (apache_beam.transforms.sideinputs_test.SideInputsTest) ...
ok
test_default_value_singleton_side_input (apache_beam.transforms.sideinputs_test.SideInputsTest)
... ok
test_iterable_side_input (apache_beam.transforms.sideinputs_test.SideInputsTest) ... ok
test_reshuffle_preserves_timestamps (apache_beam.transforms.util_test.ReshuffleTest) ... ok
test_element_param (apache_beam.pipeline_test.DoFnTest) ... ok
test_key_param (apache_beam.pipeline_test.DoFnTest) ... ok

----------------------------------------------------------------------
XML: nosetests-validatesRunnerStreamingTests-df-py37.xml
----------------------------------------------------------------------
XML: <https://builds.apache.org/job/beam_PostCommit_Py_VR_Dataflow/ws/src/sdks/python/nosetests.xml>
----------------------------------------------------------------------
Ran 27 tests in 1983.603s

OK

> Task :sdks:python:test-suites:dataflow:py36:validatesRunnerStreamingTests
INFO:apache_beam.runners.dataflow.dataflow_runner:2020-06-04T13:16:15.746Z: JOB_MESSAGE_BASIC:
Worker pool stopped.
INFO:apache_beam.runners.dataflow.dataflow_runner:Job 2020-06-04_06_08_30-7115901793824499573
is in state JOB_STATE_DONE
Worker logs: https://console.cloud.google.com/dataflow/jobs/us-central1/2020-06-04_05_43_17-12704597515301301424?project=apache-beam-testing
Worker logs: https://console.cloud.google.com/dataflow/jobs/us-central1/2020-06-04_05_51_26-2965616000349904603?project=apache-beam-testing
Worker logs: https://console.cloud.google.com/dataflow/jobs/us-central1/2020-06-04_05_59_28-4687242464662344633?project=apache-beam-testing
Worker logs: https://console.cloud.google.com/dataflow/jobs/us-central1/2020-06-04_05_43_19-7806991089882160482?project=apache-beam-testing
Worker logs: https://console.cloud.google.com/dataflow/jobs/us-central1/2020-06-04_05_50_45-9543028968644580651?project=apache-beam-testing
Worker logs: https://console.cloud.google.com/dataflow/jobs/us-central1/2020-06-04_05_58_57-1020811063912216968?project=apache-beam-testing
Worker logs: https://console.cloud.google.com/dataflow/jobs/us-central1/2020-06-04_05_43_17-9800723263885797525?project=apache-beam-testing
Worker logs: https://console.cloud.google.com/dataflow/jobs/us-central1/2020-06-04_05_51_36-11285630246727409901?project=apache-beam-testing
Worker logs: https://console.cloud.google.com/dataflow/jobs/us-central1/2020-06-04_05_59_09-12868057236406865066?project=apache-beam-testing
Worker logs: https://console.cloud.google.com/dataflow/jobs/us-central1/2020-06-04_05_43_18-4453100765996467474?project=apache-beam-testing
Worker logs: https://console.cloud.google.com/dataflow/jobs/us-central1/2020-06-04_05_51_13-15640371776415557909?project=apache-beam-testing
Worker logs: https://console.cloud.google.com/dataflow/jobs/us-central1/2020-06-04_05_43_16-15792631218209685348?project=apache-beam-testing
Worker logs: https://console.cloud.google.com/dataflow/jobs/us-central1/2020-06-04_05_51_36-4882018917019423186?project=apache-beam-testing
Worker logs: https://console.cloud.google.com/dataflow/jobs/us-central1/2020-06-04_05_59_23-17576251043626612340?project=apache-beam-testing
Worker logs: https://console.cloud.google.com/dataflow/jobs/us-central1/2020-06-04_05_43_18-9722810473682326949?project=apache-beam-testing
Worker logs: https://console.cloud.google.com/dataflow/jobs/us-central1/2020-06-04_05_50_57-5621222858243004945?project=apache-beam-testing
Worker logs: https://console.cloud.google.com/dataflow/jobs/us-central1/2020-06-04_05_59_15-16454947705163816859?project=apache-beam-testing
Worker logs: https://console.cloud.google.com/dataflow/jobs/us-central1/2020-06-04_05_43_18-17060151265397898612?project=apache-beam-testing
Worker logs: https://console.cloud.google.com/dataflow/jobs/us-central1/2020-06-04_05_52_00-13479762468130093068?project=apache-beam-testing
Worker logs: https://console.cloud.google.com/dataflow/jobs/us-central1/2020-06-04_06_00_07-11327857041644225478?project=apache-beam-testing
Worker logs: https://console.cloud.google.com/dataflow/jobs/us-central1/2020-06-04_06_08_30-7115901793824499573?project=apache-beam-testing
Worker logs: https://console.cloud.google.com/dataflow/jobs/us-central1/2020-06-04_05_43_18-8359655993892034689?project=apache-beam-testing
Worker logs: https://console.cloud.google.com/dataflow/jobs/us-central1/2020-06-04_05_50_58-15234703318422304111?project=apache-beam-testing
Worker logs: https://console.cloud.google.com/dataflow/jobs/us-central1/2020-06-04_05_58_31-3487714553808981281?project=apache-beam-testing
test_gbk_many_values (apache_beam.runners.portability.fn_api_runner.fn_runner_test.FnApiBasedStateBackedCoderTest)
... ok
Test TimestampCombiner with EARLIEST. ... ok
Test TimestampCombiner with LATEST. ... ok
Runs streaming Dataflow job and verifies that user metrics are reported ... ok
test_flatten_a_flattened_pcollection (apache_beam.transforms.ptransform_test.PTransformTest)
... ok
test_flatten_one_single_pcollection (apache_beam.transforms.ptransform_test.PTransformTest)
... ok
test_impulse (apache_beam.transforms.ptransform_test.PTransformTest) ... ok
test_user_counter_using_pardo (apache_beam.metrics.metric_test.MetricsTest) ... ok
test_dofn_lifecycle (apache_beam.transforms.dofn_lifecycle_test.DoFnLifecycleTest) ... ok
test_flatten_pcollections (apache_beam.transforms.ptransform_test.PTransformTest) ... ok
test_flatten_multiple_pcollections_having_multiple_consumers (apache_beam.transforms.ptransform_test.PTransformTest)
... ok
test_par_do_with_multiple_outputs_and_using_yield (apache_beam.transforms.ptransform_test.PTransformTest)
... ok
test_multiple_empty_outputs (apache_beam.transforms.ptransform_test.PTransformTest) ... ok
test_as_list_twice (apache_beam.transforms.sideinputs_test.SideInputsTest) ... ok
test_par_do_with_multiple_outputs_and_using_return (apache_beam.transforms.ptransform_test.PTransformTest)
... ok
test_as_list_and_as_dict_side_inputs (apache_beam.transforms.sideinputs_test.SideInputsTest)
... ok
test_as_dict_twice (apache_beam.transforms.sideinputs_test.SideInputsTest) ... ok
test_as_singleton_with_different_defaults (apache_beam.transforms.sideinputs_test.SideInputsTest)
... ok
test_undeclared_outputs (apache_beam.transforms.ptransform_test.PTransformTest) ... ok
test_as_singleton_without_unique_labels (apache_beam.transforms.sideinputs_test.SideInputsTest)
... ok
test_default_value_singleton_side_input (apache_beam.transforms.sideinputs_test.SideInputsTest)
... ok
test_empty_singleton_side_input (apache_beam.transforms.sideinputs_test.SideInputsTest) ...
ok
test_flattened_side_input (apache_beam.transforms.sideinputs_test.SideInputsTest) ... ok
test_reshuffle_preserves_timestamps (apache_beam.transforms.util_test.ReshuffleTest) ... ok
test_iterable_side_input (apache_beam.transforms.sideinputs_test.SideInputsTest) ... ok
test_element_param (apache_beam.pipeline_test.DoFnTest) ... ok
test_key_param (apache_beam.pipeline_test.DoFnTest) ... ok

----------------------------------------------------------------------
XML: nosetests-validatesRunnerStreamingTests-df-py36.xml
----------------------------------------------------------------------
XML: <https://builds.apache.org/job/beam_PostCommit_Py_VR_Dataflow/ws/src/sdks/python/nosetests.xml>
----------------------------------------------------------------------
Ran 27 tests in 2010.556s

OK

FAILURE: Build failed with an exception.

* Where:
Script '<https://builds.apache.org/job/beam_PostCommit_Py_VR_Dataflow/ws/src/sdks/python/test-suites/dataflow/common.gradle'>
line: 173

* What went wrong:
Execution failed for task ':sdks:python:test-suites:dataflow:py2:validatesRunnerStreamingTests'.
> Process 'command 'sh'' finished with non-zero exit value 1

* Try:
Run with --stacktrace option to get the stack trace. Run with --info or --debug option to
get more log output. Run with --scan to get full insights.

* Get more help at https://help.gradle.org

Deprecated Gradle features were used in this build, making it incompatible with Gradle 6.0.
Use '--warning-mode all' to show the individual deprecation warnings.
See https://docs.gradle.org/5.2.1/userguide/command_line_interface.html#sec:command_line_warnings

BUILD FAILED in 1h 16m 2s
76 actionable tasks: 58 executed, 18 from cache

Publishing build scan...
https://gradle.com/s/xbh4awfjeuyli

Build step 'Invoke Gradle script' changed build result to FAILURE
Build step 'Invoke Gradle script' marked build as failure

---------------------------------------------------------------------
To unsubscribe, e-mail: builds-unsubscribe@beam.apache.org
For additional commands, e-mail: builds-help@beam.apache.org


Mime
View raw message