beam-builds mailing list archives

Site index · List index
Message view « Date » · « Thread »
Top « Date » · « Thread »
From Apache Jenkins Server <jenk...@builds.apache.org>
Subject Build failed in Jenkins: beam_LoadTests_Java_Combine_Dataflow_Batch #410
Date Sat, 20 Jun 2020 12:27:37 GMT
See <https://ci-beam.apache.org/job/beam_LoadTests_Java_Combine_Dataflow_Batch/410/display/redirect?page=changes>

Changes:

[heejong] [BEAM-10202] make run_job_server.sh, run_expansion_service.sh

[Boyuan Zhang] Enable test_pardo_timers_clear for fn_runner

[noreply] Update Beam Katas Built-in IOs to get the Kotlin Katas featured (#12031)

[noreply] grpc._channel._Rendezvous -> grpc.RpcError (#12033)

[noreply] [BEAM-7390] Add code snippet for GroupIntoBatches (#10165)

[noreply] Update Dataflow Python container to 20200619 (#12043)

[Andrew Pilloud] [BEAM-10267] ZetaSQLCalc makes grpc call per row


------------------------------------------
Started by timer
Running as SYSTEM
[EnvInject] - Loading node environment variables.
Building remotely on apache-beam-jenkins-11 (beam) in workspace <https://ci-beam.apache.org/job/beam_LoadTests_Java_Combine_Dataflow_Batch/ws/>
No credentials specified
Wiping out workspace first.
Cloning the remote Git repository
Cloning repository https://github.com/apache/beam.git
 > git init <https://ci-beam.apache.org/job/beam_LoadTests_Java_Combine_Dataflow_Batch/ws/src>
# timeout=10
Fetching upstream changes from https://github.com/apache/beam.git
 > git --version # timeout=10
 > git fetch --tags --progress https://github.com/apache/beam.git +refs/heads/*:refs/remotes/origin/*
# timeout=10
 > git config remote.origin.url https://github.com/apache/beam.git # timeout=10
 > git config --add remote.origin.fetch +refs/heads/*:refs/remotes/origin/* # timeout=10
 > git config remote.origin.url https://github.com/apache/beam.git # timeout=10
Fetching upstream changes from https://github.com/apache/beam.git
 > git fetch --tags --progress https://github.com/apache/beam.git +refs/heads/*:refs/remotes/origin/*
+refs/pull/${ghprbPullId}/*:refs/remotes/origin/pr/${ghprbPullId}/* # timeout=10
 > git rev-parse origin/master^{commit} # timeout=10
Checking out Revision f3d5fc4b9fdbfdf943bb4d57d16a4dcb022923dc (origin/master)
 > git config core.sparsecheckout # timeout=10
 > git checkout -f f3d5fc4b9fdbfdf943bb4d57d16a4dcb022923dc # timeout=10
Commit message: "Merge pull request #12036 from apilloud/singleexp"
 > git rev-list --no-walk 99055cffc040d991e4fe73953da06bcc56764fc7 # timeout=10
No emails were triggered.
[EnvInject] - Executing scripts and injecting environment variables after the SCM step.
[EnvInject] - Injecting as environment variables the properties content 
SPARK_LOCAL_IP=127.0.0.1

[EnvInject] - Variables injected successfully.
[beam_LoadTests_Java_Combine_Dataflow_Batch] $ /bin/bash -xe /tmp/jenkins6709157663472696316.sh
+ echo '*** Load test: 2GB of 10B records ***'
*** Load test: 2GB of 10B records ***
[Gradle] - Launching build.
[src] $ <https://ci-beam.apache.org/job/beam_LoadTests_Java_Combine_Dataflow_Batch/ws/src/gradlew>
-PloadTest.mainClass=org.apache.beam.sdk.loadtests.CombineLoadTest -Prunner=:runners:google-cloud-dataflow-java
-PwithDataflowWorkerJar=false '-PloadTest.args=--project=apache-beam-testing --region=us-central1
--appName=load_tests_Java_Dataflow_batch_Combine_1 --tempLocation=gs://temp-storage-for-perf-tests/loadtests
--publishToBigQuery=true --bigQueryDataset=load_test --bigQueryTable=java_dataflow_batch_Combine_1
--influxMeasurement=java_batch_combine_1 --publishToInfluxDB=true --sourceOptions={"numRecords":200000000,"keySizeBytes":1,"valueSizeBytes":9}
--fanout=1 --iterations=1 --topCount=20 --numWorkers=5 --autoscalingAlgorithm=NONE --perKeyCombiner=TOP_LARGEST
--streaming=false --influxDatabase=beam_test_metrics --influxHost=http://10.128.0.96:8086
--runner=TestDataflowRunner' --continue --max-****s=12 -Dorg.gradle.jvmargs=-Xms2g -Dorg.gradle.jvmargs=-Xmx4g
-Pdocker-pull-licenses :sdks:java:testing:load-tests:run
Starting a Gradle Daemon, 1 busy Daemon could not be reused, use --status for details
> Task :buildSrc:compileJava NO-SOURCE
> Task :buildSrc:compileGroovy FROM-CACHE
> Task :buildSrc:pluginDescriptors
> Task :buildSrc:processResources
> Task :buildSrc:classes
> Task :buildSrc:jar
> Task :buildSrc:assemble
> Task :buildSrc:spotlessGroovy
> Task :buildSrc:spotlessGroovyCheck
> Task :buildSrc:spotlessGroovyGradle
> Task :buildSrc:spotlessGroovyGradleCheck
> Task :buildSrc:spotlessCheck
> Task :buildSrc:pluginUnderTestMetadata
> Task :buildSrc:compileTestJava NO-SOURCE
> Task :buildSrc:compileTestGroovy NO-SOURCE
> Task :buildSrc:processTestResources NO-SOURCE
> Task :buildSrc:testClasses UP-TO-DATE
> Task :buildSrc:test NO-SOURCE
> Task :buildSrc:validateTaskProperties FROM-CACHE
> Task :buildSrc:check
> Task :buildSrc:build
Configuration on demand is an incubating feature.

> Configure project :sdks:java:container
Found go 1.12 in /usr/bin/go, use it.

> Task :sdks:java:fn-execution:processResources NO-SOURCE
> Task :runners:java-fn-execution:processResources NO-SOURCE
> Task :sdks:java:core:generateAvroProtocol NO-SOURCE
> Task :vendor:sdks-java-extensions-protobuf:processResources NO-SOURCE
> Task :sdks:java:harness:processResources NO-SOURCE
> Task :sdks:java:extensions:google-cloud-platform-core:processResources NO-SOURCE
> Task :runners:core-java:processResources NO-SOURCE
> Task :runners:core-construction-java:processResources NO-SOURCE
> Task :sdks:java:expansion-service:processResources NO-SOURCE
> Task :sdks:java:core:generateAvroJava NO-SOURCE
> Task :runners:java-job-service:processResources NO-SOURCE
> Task :model:job-management:extractProto
> Task :model:fn-execution:extractProto
> Task :runners:local-java:processResources NO-SOURCE
> Task :runners:direct-java:processResources NO-SOURCE
> Task :sdks:java:io:google-cloud-platform:processResources NO-SOURCE
> Task :sdks:java:extensions:protobuf:extractProto
> Task :runners:google-cloud-dataflow-java:****:legacy-****:processResources NO-SOURCE
> Task :sdks:java:extensions:protobuf:processResources NO-SOURCE
> Task :sdks:java:io:synthetic:processResources NO-SOURCE
> Task :sdks:java:testing:test-utils:processResources NO-SOURCE
> Task :sdks:java:io:kafka:processResources NO-SOURCE
> Task :sdks:java:io:kinesis:processResources NO-SOURCE
> Task :sdks:java:testing:load-tests:processResources NO-SOURCE
> Task :model:job-management:processResources
> Task :model:fn-execution:processResources
> Task :sdks:java:core:generateGrammarSource FROM-CACHE
> Task :runners:google-cloud-dataflow-java:processResources
> Task :sdks:java:core:processResources
> Task :model:pipeline:extractIncludeProto
> Task :model:pipeline:extractProto
> Task :runners:google-cloud-dataflow-java:****:windmill:extractIncludeProto
> Task :runners:google-cloud-dataflow-java:****:windmill:extractProto
> Task :runners:google-cloud-dataflow-java:****:windmill:generateProto
> Task :runners:google-cloud-dataflow-java:****:windmill:compileJava FROM-CACHE
> Task :runners:google-cloud-dataflow-java:****:windmill:processResources
> Task :runners:google-cloud-dataflow-java:****:windmill:classes
> Task :model:pipeline:generateProto
> Task :model:pipeline:compileJava FROM-CACHE
> Task :model:pipeline:processResources
> Task :model:pipeline:classes
> Task :model:pipeline:jar
> Task :model:job-management:extractIncludeProto
> Task :model:fn-execution:extractIncludeProto
> Task :model:job-management:generateProto
> Task :model:fn-execution:generateProto
> Task :model:job-management:compileJava FROM-CACHE
> Task :model:job-management:classes
> Task :model:fn-execution:compileJava FROM-CACHE
> Task :model:fn-execution:classes
> Task :runners:google-cloud-dataflow-java:****:windmill:shadowJar
> Task :model:pipeline:shadowJar
> Task :model:job-management:shadowJar
> Task :model:fn-execution:shadowJar
> Task :sdks:java:core:compileJava FROM-CACHE
> Task :sdks:java:core:classes
> Task :sdks:java:core:shadowJar
> Task :sdks:java:extensions:protobuf:extractIncludeProto
> Task :sdks:java:extensions:protobuf:generateProto NO-SOURCE
> Task :sdks:java:io:synthetic:compileJava FROM-CACHE
> Task :sdks:java:io:synthetic:classes UP-TO-DATE
> Task :vendor:sdks-java-extensions-protobuf:compileJava FROM-CACHE
> Task :vendor:sdks-java-extensions-protobuf:classes UP-TO-DATE
> Task :runners:local-java:compileJava FROM-CACHE
> Task :runners:local-java:classes UP-TO-DATE
> Task :runners:local-java:jar
> Task :sdks:java:io:synthetic:jar
> Task :sdks:java:extensions:google-cloud-platform-core:compileJava FROM-CACHE
> Task :sdks:java:extensions:google-cloud-platform-core:classes UP-TO-DATE
> Task :sdks:java:io:kinesis:compileJava FROM-CACHE
> Task :sdks:java:io:kinesis:classes UP-TO-DATE
> Task :runners:core-construction-java:compileJava FROM-CACHE
> Task :runners:core-construction-java:classes UP-TO-DATE
> Task :sdks:java:extensions:google-cloud-platform-core:jar
> Task :sdks:java:io:kinesis:jar
> Task :vendor:sdks-java-extensions-protobuf:shadowJar
> Task :sdks:java:testing:test-utils:compileJava FROM-CACHE
> Task :sdks:java:fn-execution:compileJava FROM-CACHE
> Task :sdks:java:testing:test-utils:classes UP-TO-DATE
> Task :sdks:java:fn-execution:classes UP-TO-DATE
> Task :sdks:java:testing:test-utils:jar
> Task :runners:core-construction-java:jar
> Task :sdks:java:fn-execution:jar
> Task :runners:core-java:compileJava FROM-CACHE
> Task :runners:core-java:classes UP-TO-DATE
> Task :sdks:java:extensions:protobuf:compileJava FROM-CACHE
> Task :sdks:java:extensions:protobuf:classes UP-TO-DATE
> Task :sdks:java:extensions:protobuf:jar
> Task :runners:core-java:jar
> Task :sdks:java:harness:compileJava FROM-CACHE
> Task :sdks:java:harness:classes UP-TO-DATE
> Task :sdks:java:harness:jar
> Task :sdks:java:harness:shadowJar
> Task :runners:java-fn-execution:compileJava FROM-CACHE
> Task :runners:java-fn-execution:classes UP-TO-DATE
> Task :runners:java-fn-execution:jar
> Task :sdks:java:expansion-service:compileJava FROM-CACHE
> Task :sdks:java:expansion-service:classes UP-TO-DATE
> Task :sdks:java:expansion-service:jar
> Task :runners:java-job-service:compileJava FROM-CACHE
> Task :runners:java-job-service:classes UP-TO-DATE
> Task :runners:java-job-service:jar
> Task :sdks:java:io:kafka:compileJava FROM-CACHE
> Task :sdks:java:io:kafka:classes UP-TO-DATE
> Task :sdks:java:io:kafka:jar
> Task :runners:direct-java:compileJava FROM-CACHE
> Task :runners:direct-java:classes UP-TO-DATE
> Task :sdks:java:io:google-cloud-platform:compileJava FROM-CACHE
> Task :sdks:java:io:google-cloud-platform:classes UP-TO-DATE
> Task :sdks:java:io:google-cloud-platform:jar
> Task :runners:google-cloud-dataflow-java:compileJava FROM-CACHE
> Task :runners:google-cloud-dataflow-java:classes
> Task :runners:google-cloud-dataflow-java:jar
> Task :runners:google-cloud-dataflow-java:****:legacy-****:compileJava FROM-CACHE
> Task :runners:google-cloud-dataflow-java:****:legacy-****:classes UP-TO-DATE
> Task :runners:direct-java:shadowJar
> Task :sdks:java:testing:load-tests:compileJava FROM-CACHE
> Task :sdks:java:testing:load-tests:classes UP-TO-DATE
> Task :sdks:java:testing:load-tests:jar
> Task :runners:google-cloud-dataflow-java:****:legacy-****:shadowJar

> Task :sdks:java:testing:load-tests:run FAILED
Exception in thread "main" java.lang.RuntimeException: Failed to construct instance from factory
method TestDataflowRunner#fromOptions(interface org.apache.beam.sdk.options.PipelineOptions)
	at org.apache.beam.sdk.util.InstanceBuilder.buildFromMethod(InstanceBuilder.java:224)
	at org.apache.beam.sdk.util.InstanceBuilder.build(InstanceBuilder.java:155)
	at org.apache.beam.sdk.PipelineRunner.fromOptions(PipelineRunner.java:55)
	at org.apache.beam.sdk.Pipeline.create(Pipeline.java:149)
	at org.apache.beam.sdk.loadtests.LoadTest.<init>(LoadTest.java:86)
	at org.apache.beam.sdk.loadtests.CombineLoadTest.<init>(CombineLoadTest.java:112)
	at org.apache.beam.sdk.loadtests.CombineLoadTest.main(CombineLoadTest.java:169)
Caused by: java.lang.reflect.InvocationTargetException
	at sun.reflect.NativeMethodAccessorImpl.invoke0(Native Method)
	at sun.reflect.NativeMethodAccessorImpl.invoke(NativeMethodAccessorImpl.java:62)
	at sun.reflect.DelegatingMethodAccessorImpl.invoke(DelegatingMethodAccessorImpl.java:43)
	at java.lang.reflect.Method.invoke(Method.java:498)
	at org.apache.beam.sdk.util.InstanceBuilder.buildFromMethod(InstanceBuilder.java:214)
	... 6 more
Caused by: java.lang.NullPointerException
	at org.apache.beam.vendor.guava.v26_0_jre.com.google.common.base.Preconditions.checkNotNull(Preconditions.java:877)
	at org.apache.beam.vendor.guava.v26_0_jre.com.google.common.base.Joiner.toString(Joiner.java:452)
	at org.apache.beam.vendor.guava.v26_0_jre.com.google.common.base.Joiner.appendTo(Joiner.java:106)
	at org.apache.beam.vendor.guava.v26_0_jre.com.google.common.base.Joiner.appendTo(Joiner.java:152)
	at org.apache.beam.vendor.guava.v26_0_jre.com.google.common.base.Joiner.join(Joiner.java:195)
	at org.apache.beam.vendor.guava.v26_0_jre.com.google.common.base.Joiner.join(Joiner.java:185)
	at org.apache.beam.vendor.guava.v26_0_jre.com.google.common.base.Joiner.join(Joiner.java:211)
	at org.apache.beam.runners.dataflow.TestDataflowRunner.fromOptions(TestDataflowRunner.java:74)
	... 11 more

FAILURE: Build failed with an exception.

* What went wrong:
Execution failed for task ':sdks:java:testing:load-tests:run'.
> Process 'command '/usr/lib/jvm/java-8-openjdk-amd64/bin/java'' finished with non-zero
exit value 1

* Try:
Run with --stacktrace option to get the stack trace. Run with --info or --debug option to
get more log output. Run with --scan to get full insights.

* Get more help at https://help.gradle.org

Deprecated Gradle features were used in this build, making it incompatible with Gradle 6.0.
Use '--warning-mode all' to show the individual deprecation warnings.
See https://docs.gradle.org/5.2.1/userguide/command_line_interface.html#sec:command_line_warnings

BUILD FAILED in 49s
74 actionable tasks: 48 executed, 26 from cache

Publishing build scan...
https://gradle.com/s/t2addcfh7opje

Build step 'Invoke Gradle script' changed build result to FAILURE
Build step 'Invoke Gradle script' marked build as failure

---------------------------------------------------------------------
To unsubscribe, e-mail: builds-unsubscribe@beam.apache.org
For additional commands, e-mail: builds-help@beam.apache.org


Mime
View raw message