beam-builds mailing list archives

Site index · List index
Message view « Date » · « Thread »
Top « Date » · « Thread »
From Apache Jenkins Server <jenk...@builds.apache.org>
Subject Build failed in Jenkins: beam_PostCommit_Py_ValCont #6310
Date Fri, 08 May 2020 06:27:15 GMT
See <https://builds.apache.org/job/beam_PostCommit_Py_ValCont/6310/display/redirect?page=changes>

Changes:

[robertwb] Move job server to its own module.

[robertwb] [BEAM-9845] Stage artifacts over expansion service.

[robertwb] [BEAM-9577] Resolve dependencies in Java expansion service.

[robertwb] Start artifact service in expansion service driver. 0;256;0c# Please

[amaliujia] [BEAM-9929] Support UNNEST(array_column) in ZetaSQL.


------------------------------------------
[...truncated 728.88 KB...]
copying apache_beam/utils/__init__.py -> apache-beam-2.22.0.dev0/apache_beam/utils
copying apache_beam/utils/annotations.py -> apache-beam-2.22.0.dev0/apache_beam/utils
copying apache_beam/utils/annotations_test.py -> apache-beam-2.22.0.dev0/apache_beam/utils
copying apache_beam/utils/counters.pxd -> apache-beam-2.22.0.dev0/apache_beam/utils
copying apache_beam/utils/counters.py -> apache-beam-2.22.0.dev0/apache_beam/utils
copying apache_beam/utils/counters_test.py -> apache-beam-2.22.0.dev0/apache_beam/utils
copying apache_beam/utils/interactive_utils.py -> apache-beam-2.22.0.dev0/apache_beam/utils
copying apache_beam/utils/plugin.py -> apache-beam-2.22.0.dev0/apache_beam/utils
copying apache_beam/utils/processes.py -> apache-beam-2.22.0.dev0/apache_beam/utils
copying apache_beam/utils/processes_test.py -> apache-beam-2.22.0.dev0/apache_beam/utils
copying apache_beam/utils/profiler.py -> apache-beam-2.22.0.dev0/apache_beam/utils
copying apache_beam/utils/proto_utils.py -> apache-beam-2.22.0.dev0/apache_beam/utils
copying apache_beam/utils/retry.py -> apache-beam-2.22.0.dev0/apache_beam/utils
copying apache_beam/utils/retry_test.py -> apache-beam-2.22.0.dev0/apache_beam/utils
copying apache_beam/utils/subprocess_server.py -> apache-beam-2.22.0.dev0/apache_beam/utils
copying apache_beam/utils/subprocess_server_test.py -> apache-beam-2.22.0.dev0/apache_beam/utils
copying apache_beam/utils/thread_pool_executor.py -> apache-beam-2.22.0.dev0/apache_beam/utils
copying apache_beam/utils/thread_pool_executor_test.py -> apache-beam-2.22.0.dev0/apache_beam/utils
copying apache_beam/utils/timestamp.py -> apache-beam-2.22.0.dev0/apache_beam/utils
copying apache_beam/utils/timestamp_test.py -> apache-beam-2.22.0.dev0/apache_beam/utils
copying apache_beam/utils/urns.py -> apache-beam-2.22.0.dev0/apache_beam/utils
copying apache_beam/utils/windowed_value.pxd -> apache-beam-2.22.0.dev0/apache_beam/utils
copying apache_beam/utils/windowed_value.py -> apache-beam-2.22.0.dev0/apache_beam/utils
copying apache_beam/utils/windowed_value_test.py -> apache-beam-2.22.0.dev0/apache_beam/utils
Writing apache-beam-2.22.0.dev0/setup.cfg
creating dist
Creating tar archive
removing 'apache-beam-2.22.0.dev0' (and everything under it)
SDK_LOCATION=$(find dist/apache-beam-*.tar.gz)
find dist/apache-beam-*.tar.gz

# Run ValidatesRunner tests on Google Cloud Dataflow service
echo ">>> RUNNING DATAFLOW RUNNER VALIDATESCONTAINER TEST"
>>> RUNNING DATAFLOW RUNNER VALIDATESCONTAINER TEST
python setup.py nosetests \
  --attr ValidatesContainer \
  --nologcapture \
  --processes=1 \
  --process-timeout=900 \
  --with-xunitmp \
  --xunitmp-file=$XUNIT_FILE \
  --ignore-files '.*py3\d?\.py$' \
  --test-pipeline-options=" \
    --runner=TestDataflowRunner \
    --project=$PROJECT \
    --region=$REGION \
    --worker_harness_container_image=$CONTAINER:$TAG \
    --staging_location=$GCS_LOCATION/staging-validatesrunner-test \
    --temp_location=$GCS_LOCATION/temp-validatesrunner-test \
    --output=$GCS_LOCATION/output \
    --sdk_location=$SDK_LOCATION \
    --num_workers=1"
setup.py:262: UserWarning: You are using Apache Beam with Python 2. New releases of Apache
Beam will soon support Python 3 only.
  'You are using Apache Beam with Python 2. '
<https://builds.apache.org/job/beam_PostCommit_Py_ValCont/ws/src/sdks/python/container/venv/python/local/lib/python2.7/site-packages/setuptools/dist.py>:476:
UserWarning: Normalizing '2.22.0.dev' to '2.22.0.dev0'
  normalized_version,
running nosetests
running egg_info
<https://builds.apache.org/job/beam_PostCommit_Py_ValCont/ws/src/sdks/python/gen_protos.py>:241:
UserWarning: Installing grpcio-tools is recommended for development.
  warnings.warn('Installing grpcio-tools is recommended for development.')
INFO:gen_protos:Skipping proto regeneration: all files up to date
writing requirements to apache_beam.egg-info/requires.txt
writing apache_beam.egg-info/PKG-INFO
writing top-level names to apache_beam.egg-info/top_level.txt
writing dependency_links to apache_beam.egg-info/dependency_links.txt
writing entry points to apache_beam.egg-info/entry_points.txt
reading manifest file 'apache_beam.egg-info/SOURCES.txt'
reading manifest template 'MANIFEST.in'
warning: no files found matching 'README.md'
warning: no files found matching 'NOTICE'
warning: no files found matching 'LICENSE'
writing manifest file 'apache_beam.egg-info/SOURCES.txt'
<https://builds.apache.org/job/beam_PostCommit_Py_ValCont/ws/src/sdks/python/apache_beam/__init__.py>:82:
UserWarning: You are using Apache Beam with Python 2. New releases of Apache Beam will soon
support Python 3 only.
  'You are using Apache Beam with Python 2. '
WARNING:root:python-snappy is not installed; some tests will be skipped.
WARNING:root:Tensorflow is not installed, so skipping some tests.
WARNING:apache_beam.runners.interactive.interactive_environment:Interactive Beam requires
Python 3.5.3+.
WARNING:apache_beam.runners.interactive.interactive_environment:Dependencies required for
Interactive Beam PCollection visualization are not available, please use: `pip install apache-beam[interactive]`
to install necessary dependencies to enable all data visualization features.
WARNING:apache_beam.runners.interactive.interactive_environment:You cannot use Interactive
Beam features when you are not in an interactive environment such as a Jupyter notebook or
ipython terminal.
WARNING:root:Make sure that locally built Python SDK docker image has Python 2.7 interpreter.
WARNING:root:Make sure that locally built Python SDK docker image has Python 2.7 interpreter.
test_wordcount_fnapi_it (apache_beam.examples.wordcount_it_test.WordCountIT) ... ERROR
test_metrics_fnapi_it (apache_beam.runners.dataflow.dataflow_exercise_metrics_pipeline_test.ExerciseMetricsPipelineTest)
... ERROR

======================================================================
ERROR: test suite for <class 'apache_beam.examples.wordcount_it_test.WordCountIT'>
----------------------------------------------------------------------
Traceback (most recent call last):
  File "<https://builds.apache.org/job/beam_PostCommit_Py_ValCont/ws/src/sdks/python/container/venv/python/local/lib/python2.7/site-packages/nose/plugins/multiprocess.py",>
line 812, in run
    test(orig)
  File "<https://builds.apache.org/job/beam_PostCommit_Py_ValCont/ws/src/sdks/python/container/venv/python/local/lib/python2.7/site-packages/nose/suite.py",>
line 177, in __call__
    return self.run(*arg, **kw)
  File "<https://builds.apache.org/job/beam_PostCommit_Py_ValCont/ws/src/sdks/python/container/venv/python/local/lib/python2.7/site-packages/nose/plugins/multiprocess.py",>
line 822, in run
    test.config.plugins.addError(test,err)
  File "<https://builds.apache.org/job/beam_PostCommit_Py_ValCont/ws/src/sdks/python/container/venv/python/local/lib/python2.7/site-packages/nose/plugins/manager.py",>
line 99, in __call__
    return self.call(*arg, **kw)
  File "<https://builds.apache.org/job/beam_PostCommit_Py_ValCont/ws/src/sdks/python/container/venv/python/local/lib/python2.7/site-packages/nose/plugins/manager.py",>
line 167, in simple
    result = meth(*arg, **kw)
  File "<https://builds.apache.org/job/beam_PostCommit_Py_ValCont/ws/src/sdks/python/container/venv/python/local/lib/python2.7/site-packages/nose/plugins/xunit.py",>
line 287, in addError
    tb = format_exception(err, self.encoding)
  File "<https://builds.apache.org/job/beam_PostCommit_Py_ValCont/ws/src/sdks/python/container/venv/python/local/lib/python2.7/site-packages/nose/pyversion.py",>
line 214, in format_exception
    ''.join(traceback.format_exception(*exc_info)),
  File "/usr/lib/python2.7/traceback.py", line 141, in format_exception
    list = list + format_tb(tb, limit)
  File "/usr/lib/python2.7/traceback.py", line 76, in format_tb
    return format_list(extract_tb(tb, limit))
  File "/usr/lib/python2.7/traceback.py", line 101, in extract_tb
    line = linecache.getline(filename, lineno, f.f_globals)
  File "<https://builds.apache.org/job/beam_PostCommit_Py_ValCont/ws/src/sdks/python/container/venv/python/lib/python2.7/linecache.py",>
line 14, in getline
    lines = getlines(filename, module_globals)
  File "<https://builds.apache.org/job/beam_PostCommit_Py_ValCont/ws/src/sdks/python/container/venv/python/lib/python2.7/linecache.py",>
line 41, in getlines
    return updatecache(filename, module_globals)
  File "<https://builds.apache.org/job/beam_PostCommit_Py_ValCont/ws/src/sdks/python/container/venv/python/lib/python2.7/linecache.py",>
line 132, in updatecache
    lines = fp.readlines()
  File "<https://builds.apache.org/job/beam_PostCommit_Py_ValCont/ws/src/sdks/python/container/venv/python/local/lib/python2.7/site-packages/nose/plugins/multiprocess.py",>
line 276, in signalhandler
    raise TimedOutException()
TimedOutException: '<nose.plugins.multiprocess.NoSharedFixtureContextSuite context=WordCountIT>'

======================================================================
ERROR: test_metrics_fnapi_it (apache_beam.runners.dataflow.dataflow_exercise_metrics_pipeline_test.ExerciseMetricsPipelineTest)
----------------------------------------------------------------------
Traceback (most recent call last):
  File "<https://builds.apache.org/job/beam_PostCommit_Py_ValCont/ws/src/sdks/python/container/venv/python/local/lib/python2.7/site-packages/nose/plugins/multiprocess.py",>
line 812, in run
    test(orig)
  File "<https://builds.apache.org/job/beam_PostCommit_Py_ValCont/ws/src/sdks/python/container/venv/python/local/lib/python2.7/site-packages/nose/case.py",>
line 45, in __call__
    return self.run(*arg, **kwarg)
  File "<https://builds.apache.org/job/beam_PostCommit_Py_ValCont/ws/src/sdks/python/container/venv/python/local/lib/python2.7/site-packages/nose/case.py",>
line 133, in run
    self.runTest(result)
  File "<https://builds.apache.org/job/beam_PostCommit_Py_ValCont/ws/src/sdks/python/container/venv/python/local/lib/python2.7/site-packages/nose/case.py",>
line 151, in runTest
    test(result)
  File "/usr/lib/python2.7/unittest/case.py", line 393, in __call__
    return self.run(*args, **kwds)
  File "/usr/lib/python2.7/unittest/case.py", line 329, in run
    testMethod()
  File "<https://builds.apache.org/job/beam_PostCommit_Py_ValCont/ws/src/sdks/python/apache_beam/runners/dataflow/dataflow_exercise_metrics_pipeline_test.py",>
line 57, in test_metrics_fnapi_it
    result = self.run_pipeline(experiment='beam_fn_api')
  File "<https://builds.apache.org/job/beam_PostCommit_Py_ValCont/ws/src/sdks/python/apache_beam/runners/dataflow/dataflow_exercise_metrics_pipeline_test.py",>
line 45, in run_pipeline
    return dataflow_exercise_metrics_pipeline.apply_and_run(p)
  File "<https://builds.apache.org/job/beam_PostCommit_Py_ValCont/ws/src/sdks/python/apache_beam/runners/dataflow/dataflow_exercise_metrics_pipeline.py",>
line 167, in apply_and_run
    | 'm_out' >> beam.FlatMap(
  File "<https://builds.apache.org/job/beam_PostCommit_Py_ValCont/ws/src/sdks/python/apache_beam/transforms/ptransform.py",>
line 562, in __ror__
    result = p.apply(self, pvalueish, label)
  File "<https://builds.apache.org/job/beam_PostCommit_Py_ValCont/ws/src/sdks/python/apache_beam/pipeline.py",>
line 658, in apply
    pvalueish_result = self.runner.apply(transform, pvalueish, self._options)
  File "<https://builds.apache.org/job/beam_PostCommit_Py_ValCont/ws/src/sdks/python/apache_beam/runners/dataflow/dataflow_runner.py",>
line 153, in apply
    return super(DataflowRunner, self).apply(transform, input, options)
  File "<https://builds.apache.org/job/beam_PostCommit_Py_ValCont/ws/src/sdks/python/apache_beam/runners/runner.py",>
line 198, in apply
    return m(transform, input, options)
  File "<https://builds.apache.org/job/beam_PostCommit_Py_ValCont/ws/src/sdks/python/apache_beam/runners/runner.py",>
line 228, in apply_PTransform
    return transform.expand(input)
  File "<https://builds.apache.org/job/beam_PostCommit_Py_ValCont/ws/src/sdks/python/apache_beam/transforms/core.py",>
line 2715, in expand
    | Map(coder.decode).with_output_types(self.get_output_type()))
  File "<https://builds.apache.org/job/beam_PostCommit_Py_ValCont/ws/src/sdks/python/apache_beam/pvalue.py",>
line 140, in __or__
    return self.pipeline.apply(ptransform, self)
  File "<https://builds.apache.org/job/beam_PostCommit_Py_ValCont/ws/src/sdks/python/apache_beam/pipeline.py",>
line 658, in apply
    pvalueish_result = self.runner.apply(transform, pvalueish, self._options)
  File "<https://builds.apache.org/job/beam_PostCommit_Py_ValCont/ws/src/sdks/python/apache_beam/runners/dataflow/dataflow_runner.py",>
line 153, in apply
    return super(DataflowRunner, self).apply(transform, input, options)
  File "<https://builds.apache.org/job/beam_PostCommit_Py_ValCont/ws/src/sdks/python/apache_beam/runners/runner.py",>
line 198, in apply
    return m(transform, input, options)
  File "<https://builds.apache.org/job/beam_PostCommit_Py_ValCont/ws/src/sdks/python/apache_beam/runners/runner.py",>
line 228, in apply_PTransform
    return transform.expand(input)
  File "<https://builds.apache.org/job/beam_PostCommit_Py_ValCont/ws/src/sdks/python/apache_beam/transforms/core.py",>
line 2706, in expand
    return pcoll | Reshuffle()
  File "<https://builds.apache.org/job/beam_PostCommit_Py_ValCont/ws/src/sdks/python/apache_beam/pvalue.py",>
line 140, in __or__
    return self.pipeline.apply(ptransform, self)
  File "<https://builds.apache.org/job/beam_PostCommit_Py_ValCont/ws/src/sdks/python/apache_beam/pipeline.py",>
line 658, in apply
    pvalueish_result = self.runner.apply(transform, pvalueish, self._options)
  File "<https://builds.apache.org/job/beam_PostCommit_Py_ValCont/ws/src/sdks/python/apache_beam/runners/dataflow/dataflow_runner.py",>
line 153, in apply
    return super(DataflowRunner, self).apply(transform, input, options)
  File "<https://builds.apache.org/job/beam_PostCommit_Py_ValCont/ws/src/sdks/python/apache_beam/runners/runner.py",>
line 198, in apply
    return m(transform, input, options)
  File "<https://builds.apache.org/job/beam_PostCommit_Py_ValCont/ws/src/sdks/python/apache_beam/runners/runner.py",>
line 228, in apply_PTransform
    return transform.expand(input)
  File "<https://builds.apache.org/job/beam_PostCommit_Py_ValCont/ws/src/sdks/python/apache_beam/transforms/util.py",>
line 715, in expand
    | 'RemoveRandomKeys' >> Map(lambda t: t[1]).with_input_types(
  File "<https://builds.apache.org/job/beam_PostCommit_Py_ValCont/ws/src/sdks/python/apache_beam/pvalue.py",>
line 140, in __or__
    return self.pipeline.apply(ptransform, self)
  File "<https://builds.apache.org/job/beam_PostCommit_Py_ValCont/ws/src/sdks/python/apache_beam/pipeline.py",>
line 658, in apply
    pvalueish_result = self.runner.apply(transform, pvalueish, self._options)
  File "<https://builds.apache.org/job/beam_PostCommit_Py_ValCont/ws/src/sdks/python/apache_beam/runners/dataflow/dataflow_runner.py",>
line 153, in apply
    return super(DataflowRunner, self).apply(transform, input, options)
  File "<https://builds.apache.org/job/beam_PostCommit_Py_ValCont/ws/src/sdks/python/apache_beam/runners/runner.py",>
line 198, in apply
    return m(transform, input, options)
  File "<https://builds.apache.org/job/beam_PostCommit_Py_ValCont/ws/src/sdks/python/apache_beam/runners/runner.py",>
line 228, in apply_PTransform
    return transform.expand(input)
  File "<https://builds.apache.org/job/beam_PostCommit_Py_ValCont/ws/src/sdks/python/apache_beam/transforms/util.py",>
line 673, in expand
    ungrouped = pcoll | Map(reify_timestamps).with_output_types(Any)
  File "<https://builds.apache.org/job/beam_PostCommit_Py_ValCont/ws/src/sdks/python/apache_beam/pvalue.py",>
line 140, in __or__
    return self.pipeline.apply(ptransform, self)
  File "<https://builds.apache.org/job/beam_PostCommit_Py_ValCont/ws/src/sdks/python/apache_beam/pipeline.py",>
line 654, in apply
    type_options = self._options.view_as(TypeOptions)
  File "<https://builds.apache.org/job/beam_PostCommit_Py_ValCont/ws/src/sdks/python/apache_beam/options/pipeline_options.py",>
line 355, in view_as
    view = cls(self._flags)
  File "<https://builds.apache.org/job/beam_PostCommit_Py_ValCont/ws/src/sdks/python/apache_beam/options/pipeline_options.py",>
line 202, in __init__
    cls._add_argparse_args(parser)  # type: ignore
  File "<https://builds.apache.org/job/beam_PostCommit_Py_ValCont/ws/src/sdks/python/container/venv/python/local/lib/python2.7/site-packages/nose/plugins/multiprocess.py",>
line 276, in signalhandler
    raise TimedOutException()
TimedOutException: 'test_metrics_fnapi_it (apache_beam.runners.dataflow.dataflow_exercise_metrics_pipeline_test.ExerciseMetricsPipelineTest)'

----------------------------------------------------------------------
XML: nosetests-beam_python2.7_sdk.xml
----------------------------------------------------------------------
XML: <https://builds.apache.org/job/beam_PostCommit_Py_ValCont/ws/src/sdks/python/nosetests.xml>
----------------------------------------------------------------------
Ran 2 tests in 904.858s

FAILED (errors=2)
cleanup_container
Untagged: us.gcr.io/apache-beam-testing/jenkins/beam_python2.7_sdk:20200508-060022
Untagged: us.gcr.io/apache-beam-testing/jenkins/beam_python2.7_sdk@sha256:8e51cc42d459a7d89fdd99a291409cb03882304c4554e4dc4f404fd1f4fc3ecf
Deleted: sha256:1c625afa8e15df865059e71df7719186d10d5340fbcd1c51a3dd24fd50d5be47
Deleted: sha256:af6a45dcf795d58250d8af6877af4affee2425c795aafb1c000ad3ced52af8d2
Deleted: sha256:52541ad667f48572d6c4fc0b39511a08545b560e737ea6fab06e28ef134a5586
Deleted: sha256:21550d14d210f36f93556dbdfe420274daf5f317bc1edb55bbab9b6ebc91bbd1
Deleted: sha256:e57feceb46d20094c5e61a55f2d6d7f79c7df9245d550998e61a7e23f111a159
Deleted: sha256:bd7462a2d67aef479ef506ed6752ad56ae6ad1b5f1b26d21ce6a93c6bf228e7f
Deleted: sha256:79c1553ce7bd87a1d87598ffb4c652516c7fe54da28593267a9bf74c397a24f1
Deleted: sha256:c16c8724ed747a8f732b412db30e051b74af054f2f7aeaaecec4004d7a65483c
Deleted: sha256:4d387396b6963142991a6b47e9d6a62a4a84bb31ad1d0861a31e2915daf28cf7
Deleted: sha256:9bd3f3c90987e28961011230e6884b04eeaf27b6e529879508cd540dde2b79c3
Deleted: sha256:72917990e9c497ccb4807da54ebe7aaefa8fa28b8916992f7bceaef4ab24567f
Deleted: sha256:dafa1f7c54365ec81edc8a534e9166ab22b1c17c425c19273973330711972380
Deleted: sha256:ae0c3721eb984c362c9a1a91a3787bfde730daed2f3f818ed36516e41fb3e9bd
Deleted: sha256:336e24d18fac0c5487fe88adec0964444a2e6e7616887846b0e71555d4e21d3b
Deleted: sha256:395ccce1420e41f9976a9b3ea6a0d60a2ac520ae0fbb4221714450e8828591e4
Deleted: sha256:a3b5354b401a8b99bae0a6119e92111be934ad7aafc0a8768ae0e3512c12bd8b
Deleted: sha256:091839f61b470d557b9a04921eeb2fa2fa5dfe9204a1043afa1f62ae0d6e9ab0
Deleted: sha256:d0987bf43e8029c5ed7487686d444de694fc548f6a586c617d91dfd1c49449fe
Deleted: sha256:9539893d566b62bb0117c55140832b2f540266354ae8a09ddf45dc2b90ab5c9f
Deleted: sha256:876f3da321bfada15eae30874b7f06521472b8abaf4672abbb2d4d9dc2b366e3
Deleted: sha256:dbd2580d3e6b71beb4baf37ce885016e89645ed0a441f6e5bb75435e2965fcfd
Deleted: sha256:7d2761167850183dbe3673d4f23b95c49d2f9e1839d167a10efcc7af924fdb31
Deleted: sha256:04043faf53ef0226b7212c61af3c0b34521788c5da9e28f3073f8675e07a2ea2
Deleted: sha256:04101a934c7a47c962d4da5ce8a8ea60b971f95761a6ba84522463e4cb35ee62
Deleted: sha256:96c62fa918e5da1907c16449c760614fd3de9c8cec798cf8dd4c22b2f5761013
Deleted: sha256:3e18ecaf47d3c28e416e3351cec6c37973d24ac6061bcfaaf22128c0101acb5f
Deleted: sha256:2cd41a629053e8ca359bcfa874cc36e00ae4ac0cdac4dae18b520c81fd47da60
Deleted: sha256:cf0f18d4a885985b21e4017058e53b23f48223d86401cd1eb1bed173a60118b8
Digests:
- us.gcr.io/apache-beam-testing/jenkins/beam_python2.7_sdk@sha256:8e51cc42d459a7d89fdd99a291409cb03882304c4554e4dc4f404fd1f4fc3ecf
  Associated tags:
 - 20200508-060022
Tags:
- us.gcr.io/apache-beam-testing/jenkins/beam_python2.7_sdk:20200508-060022
Deleted [us.gcr.io/apache-beam-testing/jenkins/beam_python2.7_sdk:20200508-060022].
Deleted [us.gcr.io/apache-beam-testing/jenkins/beam_python2.7_sdk@sha256:8e51cc42d459a7d89fdd99a291409cb03882304c4554e4dc4f404fd1f4fc3ecf].
Removed the container
Build step 'Execute shell' marked build as failure

---------------------------------------------------------------------
To unsubscribe, e-mail: builds-unsubscribe@beam.apache.org
For additional commands, e-mail: builds-help@beam.apache.org


Mime
View raw message