beam-builds mailing list archives

Site index · List index
Message view « Date » · « Thread »
Top « Date » · « Thread »
From Apache Jenkins Server <jenk...@builds.apache.org>
Subject Build failed in Jenkins: beam_PostCommit_Website_Publish #5971
Date Fri, 10 Apr 2020 00:01:24 GMT
See <https://builds.apache.org/job/beam_PostCommit_Website_Publish/5971/display/redirect>

Changes:


------------------------------------------
Started by timer
Running as SYSTEM
[EnvInject] - Loading node environment variables.
Building remotely on websites (git-websites svn-websites) in workspace <https://builds.apache.org/job/beam_PostCommit_Website_Publish/ws/>
No credentials specified
Wiping out workspace first.
Cloning the remote Git repository
Cloning repository https://github.com/apache/beam.git
 > git init <https://builds.apache.org/job/beam_PostCommit_Website_Publish/ws/src>
# timeout=10
Fetching upstream changes from https://github.com/apache/beam.git
 > git --version # timeout=10
 > git fetch --tags --progress -- https://github.com/apache/beam.git +refs/heads/*:refs/remotes/origin/*
 > git config remote.origin.url https://github.com/apache/beam.git # timeout=10
 > git config --add remote.origin.fetch +refs/heads/*:refs/remotes/origin/* # timeout=10
 > git config remote.origin.url https://github.com/apache/beam.git # timeout=10
Fetching upstream changes from https://github.com/apache/beam.git
 > git fetch --tags --progress -- https://github.com/apache/beam.git +refs/heads/*:refs/remotes/origin/*
+refs/pull/${ghprbPullId}/*:refs/remotes/origin/pr/${ghprbPullId}/*
 > git rev-parse origin/master^{commit} # timeout=10
Checking out Revision e8fc5859bdd05560f475a99b76170bcec90eafdd (origin/master)
 > git config core.sparsecheckout # timeout=10
 > git checkout -f e8fc5859bdd05560f475a99b76170bcec90eafdd
Commit message: "Merge pull request #11367 from scwhittle/revert-11364-contention"
 > git rev-list --no-walk e8fc5859bdd05560f475a99b76170bcec90eafdd # timeout=10
No emails were triggered.
[EnvInject] - Executing scripts and injecting environment variables after the SCM step.
[EnvInject] - Injecting as environment variables the properties content 
SPARK_LOCAL_IP=127.0.0.1

[EnvInject] - Variables injected successfully.
[Gradle] - Launching build.
[src] $ <https://builds.apache.org/job/beam_PostCommit_Website_Publish/ws/src/gradlew>
--continue --max-workers=12 -Dorg.gradle.jvmargs=-Xms2g -Dorg.gradle.jvmargs=-Xmx4g :website:clean
:website:publishWebsite
To honour the JVM settings for this build a new JVM will be forked. Please consider using
the daemon: https://docs.gradle.org/5.2.1/userguide/gradle_daemon.html.
Daemon will be stopped at the end of the build stopping after processing
> Task :buildSrc:compileJava NO-SOURCE
> Task :buildSrc:compileGroovy FROM-CACHE
> Task :buildSrc:pluginDescriptors
> Task :buildSrc:processResources
> Task :buildSrc:classes
> Task :buildSrc:jar
> Task :buildSrc:assemble
> Task :buildSrc:spotlessGroovy
> Task :buildSrc:spotlessGroovyCheck
> Task :buildSrc:spotlessGroovyGradle
> Task :buildSrc:spotlessGroovyGradleCheck
> Task :buildSrc:spotlessCheck
> Task :buildSrc:pluginUnderTestMetadata
> Task :buildSrc:compileTestJava NO-SOURCE
> Task :buildSrc:compileTestGroovy NO-SOURCE
> Task :buildSrc:processTestResources NO-SOURCE
> Task :buildSrc:testClasses UP-TO-DATE
> Task :buildSrc:test NO-SOURCE
> Task :buildSrc:validateTaskProperties FROM-CACHE
> Task :buildSrc:check
> Task :buildSrc:build
Configuration on demand is an incubating feature.
> Task :website:cleanWebsite UP-TO-DATE
> Task :website:clean UP-TO-DATE
> Task :website:setupBuildDir

> Task :website:buildDockerImage
Sending build context to Docker daemon  27.48MB
Step 1/7 : FROM ruby:2.5
 ---> 813c262b2373
Step 2/7 : WORKDIR /ruby
 ---> Using cache
 ---> c6f95b3112c8
Step 3/7 : RUN gem install bundler
 ---> Using cache
 ---> 0aa404e9447c
Step 4/7 : ADD Gemfile Gemfile.lock /ruby/
 ---> Using cache
 ---> dd61d6cd6404
Step 5/7 : RUN bundle install --deployment --path $GEM_HOME
 ---> Using cache
 ---> fae843633f5b
Step 6/7 : ENV LC_ALL C.UTF-8
 ---> Using cache
 ---> adbf57a169bd
Step 7/7 : CMD sleep 3600
 ---> Using cache
 ---> bbe0c7651117
Successfully built bbe0c7651117
Successfully tagged beam-website:latest

> Task :website:createDockerContainer

> Task :website:startDockerContainer
e71de8c41b9548600bb30e1008ca11d7ac152112a2f758e96a0de1aba850510c

> Task :website:setupDockerContainer

> Task :website:buildApacheWebsite
`/` is not writable.
Bundler will use `/tmp/bundler/home/unknown' as your home directory temporarily.
Configuration file: /repo/website/_config.yml
            Source: /repo/website/src
       Destination: generated-apache-content
 Incremental build: enabled
      Generating... 
jekyll 3.6.3 | Error:  Permission denied @ dir_s_mkdir - /repo/build/website/generated-apache-content/security

> Task :website:buildApacheWebsite FAILED

> Task :website:stopAndRemoveDockerContainer
e71de8c41b9548600bb30e1008ca11d7ac152112a2f758e96a0de1aba850510c

FAILURE: Build failed with an exception.

* What went wrong:
Execution failed for task ':website:buildApacheWebsite'.
> Process 'command 'docker'' finished with non-zero exit value 1

* Try:
Run with --stacktrace option to get the stack trace. Run with --info or --debug option to
get more log output. Run with --scan to get full insights.

* Get more help at https://help.gradle.org

Deprecated Gradle features were used in this build, making it incompatible with Gradle 6.0.
Use '--warning-mode all' to show the individual deprecation warnings.
See https://docs.gradle.org/5.2.1/userguide/command_line_interface.html#sec:command_line_warnings

BUILD FAILED in 1m 4s
9 actionable tasks: 7 executed, 2 up-to-date

Publishing build scan...
https://gradle.com/s/4dg2nx52a4irq

Build step 'Invoke Gradle script' changed build result to FAILURE
Build step 'Invoke Gradle script' marked build as failure

---------------------------------------------------------------------
To unsubscribe, e-mail: builds-unsubscribe@beam.apache.org
For additional commands, e-mail: builds-help@beam.apache.org


Mime
View raw message