beam-builds mailing list archives

Site index · List index
Message view « Date » · « Thread »
Top « Date » · « Thread »
From Apache Jenkins Server <jenk...@builds.apache.org>
Subject Build failed in Jenkins: beam_PerformanceTests_WordCountIT_Py37 #1301
Date Mon, 13 Apr 2020 18:57:25 GMT
See <https://builds.apache.org/job/beam_PerformanceTests_WordCountIT_Py37/1301/display/redirect?page=changes>

Changes:

[suztomo] google-api-client 1.30.9

[chamikara] Updates Dataflow stateful DoFn setup to support external transforms

[github] [BEAM-9738] Update dataflow to setup correct docker environment options.

[github] [BEAM-9136]Add licenses for dependencies for Java (#11243)


------------------------------------------
[...truncated 60.01 KB...]
Caching disabled for task ':sdks:python:test-suites:dataflow:py37:integrationTest': Caching
has not been enabled for the task
Task ':sdks:python:test-suites:dataflow:py37:integrationTest' is not up-to-date because:
  Task has not declared any outputs despite executing actions.
Custom actions are attached to task ':sdks:python:test-suites:dataflow:py37:integrationTest'.
Starting process 'command 'sh''. Working directory: <https://builds.apache.org/job/beam_PerformanceTests_WordCountIT_Py37/ws/src/sdks/python/test-suites/dataflow/py37>
Command: sh -c . <https://builds.apache.org/job/beam_PerformanceTests_WordCountIT_Py37/ws/src/build/gradleenv/-1734967052/bin/activate>
&& <https://builds.apache.org/job/beam_PerformanceTests_WordCountIT_Py37/ws/src/sdks/python/scripts/run_integration_test.sh>
--test_opts "--tests=apache_beam.examples.wordcount_it_test:WordCountIT.test_wordcount_it
--attr=IT --nocapture" --pipeline_opts "--project=apache-beam-testing --staging_location=gs://temp-storage-for-end-to-end-tests/staging-it
--temp_location=gs://temp-storage-for-end-to-end-tests/temp-it --input=gs://apache-beam-samples/input_small_files/ascii_sort_1MB_input.0000*
--output=gs://temp-storage-for-end-to-end-tests/py-it-cloud/output --expect_checksum=ea0ca2e5ee4ea5f218790f28d0b9fe7d09d8d710
--num_workers=10 --autoscaling_algorithm=NONE --runner=TestDataflowRunner --sdk_location=build/apache-beam.tar.gz"
--suite integrationTest-perf
Successfully started process 'command 'sh''
>>> RUNNING integration tests with pipeline options: --project=apache-beam-testing
--staging_location=gs://temp-storage-for-end-to-end-tests/staging-it --temp_location=gs://temp-storage-for-end-to-end-tests/temp-it
--input=gs://apache-beam-samples/input_small_files/ascii_sort_1MB_input.0000* --output=gs://temp-storage-for-end-to-end-tests/py-it-cloud/output
--expect_checksum=ea0ca2e5ee4ea5f218790f28d0b9fe7d09d8d710 --num_workers=10 --autoscaling_algorithm=NONE
--runner=TestDataflowRunner --sdk_location=build/apache-beam.tar.gz
>>>   test options: --tests=apache_beam.examples.wordcount_it_test:WordCountIT.test_wordcount_it
--attr=IT --nocapture
running nosetests
running egg_info
writing apache_beam.egg-info/PKG-INFO
writing dependency_links to apache_beam.egg-info/dependency_links.txt
writing entry points to apache_beam.egg-info/entry_points.txt
writing requirements to apache_beam.egg-info/requires.txt
writing top-level names to apache_beam.egg-info/top_level.txt
reading manifest file 'apache_beam.egg-info/SOURCES.txt'
reading manifest template 'MANIFEST.in'
writing manifest file 'apache_beam.egg-info/SOURCES.txt'

> Task :sdks:python:test-suites:dataflow:py37:integrationTest FAILED
:sdks:python:test-suites:dataflow:py37:integrationTest (Thread[Execution worker for ':',5,main])
completed. Took 2.928 secs.

Deprecated Gradle features were used in this build, making it incompatible with Gradle 6.0.
Use '--warning-mode all' to show the individual deprecation warnings.
See https://docs.gradle.org/5.2.1/userguide/command_line_interface.html#sec:command_line_warnings
5 actionable tasks: 5 executed

Publishing build scan...
https://gradle.com/s/7cikp3bt262ma


STDERR: DEPRECATION: Python 2.7 reached the end of its life on January 1st, 2020. Please upgrade
your Python as Python 2.7 is no longer maintained. A future version of pip will drop support
for Python 2.7. More details about Python 2 support in pip, can be found at https://pip.pypa.io/en/latest/development/release-process/#python-2-support
setup.py:247: UserWarning: You are using Apache Beam with Python 2. New releases of Apache
Beam will soon support Python 3 only.
  'You are using Apache Beam with Python 2. '
<https://builds.apache.org/job/beam_PerformanceTests_WordCountIT_Py37/ws/src/build/gradleenv/1922375555/local/lib/python2.7/site-packages/setuptools/dist.py>:476:
UserWarning: Normalizing '2.22.0.dev' to '2.22.0.dev0'
  normalized_version,
INFO:gen_protos:Regenerating Python proto definitions (no output files).
INFO:gen_protos:Found protoc_gen_mypy at <https://builds.apache.org/job/beam_PerformanceTests_WordCountIT_Py37/ws/src/build/gradleenv/1922375555/bin/protoc-gen-mypy>
metrics.proto: warning: Import google/protobuf/timestamp.proto but not used.
beam_fn_api.proto: warning: Import google/protobuf/descriptor.proto but not used.
beam_fn_api.proto: warning: Import google/protobuf/wrappers.proto but not used.
beam_interactive_api.proto: warning: Import google/protobuf/timestamp.proto but not used.
Writing mypy to endpoints_pb2.pyi
Writing mypy to external_transforms_pb2.pyi
Writing mypy to beam_provision_api_pb2.pyi
Writing mypy to beam_runner_api_pb2.pyi
Writing mypy to standard_window_fns_pb2.pyi
Writing mypy to beam_artifact_api_pb2.pyi
Writing mypy to beam_fn_api_pb2.pyi
Writing mypy to metrics_pb2.pyi
Writing mypy to schema_pb2.pyi
Writing mypy to beam_job_api_pb2.pyi
Writing mypy to beam_interactive_api_pb2.pyi
Writing mypy to beam_expansion_api_pb2.pyi
root: Generating grammar tables from /usr/lib/python2.7/lib2to3/PatternGrammar.txt
root: Generating grammar tables from /usr/lib/python2.7/lib2to3/PatternGrammar.txt
root: Generating grammar tables from /usr/lib/python2.7/lib2to3/PatternGrammar.txt
root: Generating grammar tables from /usr/lib/python2.7/lib2to3/PatternGrammar.txt
root: Generating grammar tables from /usr/lib/python2.7/lib2to3/PatternGrammar.txt
root: Generating grammar tables from /usr/lib/python2.7/lib2to3/PatternGrammar.txt
root: Generating grammar tables from /usr/lib/python2.7/lib2to3/PatternGrammar.txt
root: Generating grammar tables from /usr/lib/python2.7/lib2to3/PatternGrammar.txt
root: Generating grammar tables from /usr/lib/python2.7/lib2to3/PatternGrammar.txt
root: Generating grammar tables from /usr/lib/python2.7/lib2to3/PatternGrammar.txt
root: Generating grammar tables from /usr/lib/python2.7/lib2to3/PatternGrammar.txt
root: Generating grammar tables from /usr/lib/python2.7/lib2to3/PatternGrammar.txt
RefactoringTool: Skipping optional fixer: idioms
root: Generating grammar tables from /usr/lib/python2.7/lib2to3/PatternGrammar.txt
root: Generating grammar tables from /usr/lib/python2.7/lib2to3/PatternGrammar.txt
root: Generating grammar tables from /usr/lib/python2.7/lib2to3/PatternGrammar.txt
root: Generating grammar tables from /usr/lib/python2.7/lib2to3/PatternGrammar.txt
root: Generating grammar tables from /usr/lib/python2.7/lib2to3/PatternGrammar.txt
root: Generating grammar tables from /usr/lib/python2.7/lib2to3/PatternGrammar.txt
root: Generating grammar tables from /usr/lib/python2.7/lib2to3/PatternGrammar.txt
root: Generating grammar tables from /usr/lib/python2.7/lib2to3/PatternGrammar.txt
root: Generating grammar tables from /usr/lib/python2.7/lib2to3/PatternGrammar.txt
root: Generating grammar tables from /usr/lib/python2.7/lib2to3/PatternGrammar.txt
root: Generating grammar tables from /usr/lib/python2.7/lib2to3/PatternGrammar.txt
root: Generating grammar tables from /usr/lib/python2.7/lib2to3/PatternGrammar.txt
root: Generating grammar tables from /usr/lib/python2.7/lib2to3/PatternGrammar.txt
root: Generating grammar tables from /usr/lib/python2.7/lib2to3/PatternGrammar.txt
root: Generating grammar tables from /usr/lib/python2.7/lib2to3/PatternGrammar.txt
root: Generating grammar tables from /usr/lib/python2.7/lib2to3/PatternGrammar.txt
root: Generating grammar tables from /usr/lib/python2.7/lib2to3/PatternGrammar.txt
root: Generating grammar tables from /usr/lib/python2.7/lib2to3/PatternGrammar.txt
root: Generating grammar tables from /usr/lib/python2.7/lib2to3/PatternGrammar.txt
root: Generating grammar tables from /usr/lib/python2.7/lib2to3/PatternGrammar.txt
root: Generating grammar tables from /usr/lib/python2.7/lib2to3/PatternGrammar.txt
root: Generating grammar tables from /usr/lib/python2.7/lib2to3/PatternGrammar.txt
root: Generating grammar tables from /usr/lib/python2.7/lib2to3/PatternGrammar.txt
RefactoringTool: Skipping optional fixer: ws_comma
root: Generating grammar tables from /usr/lib/python2.7/lib2to3/PatternGrammar.txt
root: Generating grammar tables from /usr/lib/python2.7/lib2to3/PatternGrammar.txt
root: Generating grammar tables from /usr/lib/python2.7/lib2to3/PatternGrammar.txt
root: Generating grammar tables from /usr/lib/python2.7/lib2to3/PatternGrammar.txt
root: Generating grammar tables from /usr/lib/python2.7/lib2to3/PatternGrammar.txt
root: Generating grammar tables from /usr/lib/python2.7/lib2to3/PatternGrammar.txt
root: Generating grammar tables from /usr/lib/python2.7/lib2to3/PatternGrammar.txt
root: Generating grammar tables from /usr/lib/python2.7/lib2to3/PatternGrammar.txt
root: Generating grammar tables from /usr/lib/python2.7/lib2to3/PatternGrammar.txt
root: Generating grammar tables from /usr/lib/python2.7/lib2to3/PatternGrammar.txt
root: Generating grammar tables from /usr/lib/python2.7/lib2to3/PatternGrammar.txt
root: Generating grammar tables from /usr/lib/python2.7/lib2to3/PatternGrammar.txt
root: Generating grammar tables from /usr/lib/python2.7/lib2to3/PatternGrammar.txt
root: Generating grammar tables from /usr/lib/python2.7/lib2to3/PatternGrammar.txt
root: Generating grammar tables from /usr/lib/python2.7/lib2to3/PatternGrammar.txt
root: Generating grammar tables from /usr/lib/python2.7/lib2to3/PatternGrammar.txt
root: Generating grammar tables from /usr/lib/python2.7/lib2to3/PatternGrammar.txt
root: Generating grammar tables from /usr/lib/python2.7/lib2to3/PatternGrammar.txt
root: Generating grammar tables from /usr/lib/python2.7/lib2to3/PatternGrammar.txt
root: Generating grammar tables from /usr/lib/python2.7/lib2to3/PatternGrammar.txt
root: Generating grammar tables from /usr/lib/python2.7/lib2to3/PatternGrammar.txt
RefactoringTool: Refactored <https://builds.apache.org/job/beam_PerformanceTests_WordCountIT_Py37/ws/src/sdks/python/apache_beam/portability/api/beam_artifact_api_pb2.py>
RefactoringTool: Refactored <https://builds.apache.org/job/beam_PerformanceTests_WordCountIT_Py37/ws/src/sdks/python/apache_beam/portability/api/beam_artifact_api_pb2_grpc.py>
RefactoringTool: Refactored <https://builds.apache.org/job/beam_PerformanceTests_WordCountIT_Py37/ws/src/sdks/python/apache_beam/portability/api/beam_expansion_api_pb2.py>
RefactoringTool: Refactored <https://builds.apache.org/job/beam_PerformanceTests_WordCountIT_Py37/ws/src/sdks/python/apache_beam/portability/api/beam_expansion_api_pb2_grpc.py>
RefactoringTool: Refactored <https://builds.apache.org/job/beam_PerformanceTests_WordCountIT_Py37/ws/src/sdks/python/apache_beam/portability/api/beam_fn_api_pb2.py>
RefactoringTool: Refactored <https://builds.apache.org/job/beam_PerformanceTests_WordCountIT_Py37/ws/src/sdks/python/apache_beam/portability/api/beam_fn_api_pb2_grpc.py>
RefactoringTool: Refactored <https://builds.apache.org/job/beam_PerformanceTests_WordCountIT_Py37/ws/src/sdks/python/apache_beam/portability/api/beam_interactive_api_pb2.py>
RefactoringTool: Refactored <https://builds.apache.org/job/beam_PerformanceTests_WordCountIT_Py37/ws/src/sdks/python/apache_beam/portability/api/beam_job_api_pb2.py>
RefactoringTool: Refactored <https://builds.apache.org/job/beam_PerformanceTests_WordCountIT_Py37/ws/src/sdks/python/apache_beam/portability/api/beam_job_api_pb2_grpc.py>
RefactoringTool: Refactored <https://builds.apache.org/job/beam_PerformanceTests_WordCountIT_Py37/ws/src/sdks/python/apache_beam/portability/api/beam_provision_api_pb2.py>
RefactoringTool: Refactored <https://builds.apache.org/job/beam_PerformanceTests_WordCountIT_Py37/ws/src/sdks/python/apache_beam/portability/api/beam_provision_api_pb2_grpc.py>
RefactoringTool: Refactored <https://builds.apache.org/job/beam_PerformanceTests_WordCountIT_Py37/ws/src/sdks/python/apache_beam/portability/api/beam_runner_api_pb2.py>
RefactoringTool: Refactored <https://builds.apache.org/job/beam_PerformanceTests_WordCountIT_Py37/ws/src/sdks/python/apache_beam/portability/api/beam_runner_api_pb2_grpc.py>
RefactoringTool: No changes to <https://builds.apache.org/job/beam_PerformanceTests_WordCountIT_Py37/ws/src/sdks/python/apache_beam/portability/api/endpoints_pb2.py>
RefactoringTool: Refactored <https://builds.apache.org/job/beam_PerformanceTests_WordCountIT_Py37/ws/src/sdks/python/apache_beam/portability/api/external_transforms_pb2.py>
RefactoringTool: Refactored <https://builds.apache.org/job/beam_PerformanceTests_WordCountIT_Py37/ws/src/sdks/python/apache_beam/portability/api/metrics_pb2.py>
RefactoringTool: No changes to <https://builds.apache.org/job/beam_PerformanceTests_WordCountIT_Py37/ws/src/sdks/python/apache_beam/portability/api/schema_pb2.py>
RefactoringTool: Refactored <https://builds.apache.org/job/beam_PerformanceTests_WordCountIT_Py37/ws/src/sdks/python/apache_beam/portability/api/standard_window_fns_pb2.py>
RefactoringTool: Files that were modified:
RefactoringTool: <https://builds.apache.org/job/beam_PerformanceTests_WordCountIT_Py37/ws/src/sdks/python/apache_beam/portability/api/beam_artifact_api_pb2.py>
RefactoringTool: <https://builds.apache.org/job/beam_PerformanceTests_WordCountIT_Py37/ws/src/sdks/python/apache_beam/portability/api/beam_artifact_api_pb2_grpc.py>
RefactoringTool: <https://builds.apache.org/job/beam_PerformanceTests_WordCountIT_Py37/ws/src/sdks/python/apache_beam/portability/api/beam_expansion_api_pb2.py>
RefactoringTool: <https://builds.apache.org/job/beam_PerformanceTests_WordCountIT_Py37/ws/src/sdks/python/apache_beam/portability/api/beam_expansion_api_pb2_grpc.py>
RefactoringTool: <https://builds.apache.org/job/beam_PerformanceTests_WordCountIT_Py37/ws/src/sdks/python/apache_beam/portability/api/beam_fn_api_pb2.py>
RefactoringTool: <https://builds.apache.org/job/beam_PerformanceTests_WordCountIT_Py37/ws/src/sdks/python/apache_beam/portability/api/beam_fn_api_pb2_grpc.py>
RefactoringTool: <https://builds.apache.org/job/beam_PerformanceTests_WordCountIT_Py37/ws/src/sdks/python/apache_beam/portability/api/beam_interactive_api_pb2.py>
RefactoringTool: <https://builds.apache.org/job/beam_PerformanceTests_WordCountIT_Py37/ws/src/sdks/python/apache_beam/portability/api/beam_job_api_pb2.py>
RefactoringTool: <https://builds.apache.org/job/beam_PerformanceTests_WordCountIT_Py37/ws/src/sdks/python/apache_beam/portability/api/beam_job_api_pb2_grpc.py>
RefactoringTool: <https://builds.apache.org/job/beam_PerformanceTests_WordCountIT_Py37/ws/src/sdks/python/apache_beam/portability/api/beam_provision_api_pb2.py>
RefactoringTool: <https://builds.apache.org/job/beam_PerformanceTests_WordCountIT_Py37/ws/src/sdks/python/apache_beam/portability/api/beam_provision_api_pb2_grpc.py>
RefactoringTool: <https://builds.apache.org/job/beam_PerformanceTests_WordCountIT_Py37/ws/src/sdks/python/apache_beam/portability/api/beam_runner_api_pb2.py>
RefactoringTool: <https://builds.apache.org/job/beam_PerformanceTests_WordCountIT_Py37/ws/src/sdks/python/apache_beam/portability/api/beam_runner_api_pb2_grpc.py>
RefactoringTool: <https://builds.apache.org/job/beam_PerformanceTests_WordCountIT_Py37/ws/src/sdks/python/apache_beam/portability/api/endpoints_pb2.py>
RefactoringTool: <https://builds.apache.org/job/beam_PerformanceTests_WordCountIT_Py37/ws/src/sdks/python/apache_beam/portability/api/external_transforms_pb2.py>
RefactoringTool: <https://builds.apache.org/job/beam_PerformanceTests_WordCountIT_Py37/ws/src/sdks/python/apache_beam/portability/api/metrics_pb2.py>
RefactoringTool: <https://builds.apache.org/job/beam_PerformanceTests_WordCountIT_Py37/ws/src/sdks/python/apache_beam/portability/api/schema_pb2.py>
RefactoringTool: <https://builds.apache.org/job/beam_PerformanceTests_WordCountIT_Py37/ws/src/sdks/python/apache_beam/portability/api/standard_window_fns_pb2.py>
INFO:gen_protos:Writing urn stubs: <https://builds.apache.org/job/beam_PerformanceTests_WordCountIT_Py37/ws/src/sdks/python/apache_beam/portability/api/metrics_pb2_urns.py>
INFO:gen_protos:Writing urn stubs: <https://builds.apache.org/job/beam_PerformanceTests_WordCountIT_Py37/ws/src/sdks/python/apache_beam/portability/api/beam_artifact_api_pb2_urns.py>
INFO:gen_protos:Writing urn stubs: <https://builds.apache.org/job/beam_PerformanceTests_WordCountIT_Py37/ws/src/sdks/python/apache_beam/portability/api/standard_window_fns_pb2_urns.py>
INFO:gen_protos:Writing urn stubs: <https://builds.apache.org/job/beam_PerformanceTests_WordCountIT_Py37/ws/src/sdks/python/apache_beam/portability/api/beam_fn_api_pb2_urns.py>
INFO:gen_protos:Writing urn stubs: <https://builds.apache.org/job/beam_PerformanceTests_WordCountIT_Py37/ws/src/sdks/python/apache_beam/portability/api/beam_job_api_pb2_urns.py>
INFO:gen_protos:Writing urn stubs: <https://builds.apache.org/job/beam_PerformanceTests_WordCountIT_Py37/ws/src/sdks/python/apache_beam/portability/api/beam_runner_api_pb2_urns.py>
warning: no files found matching 'README.md'
warning: no files found matching 'NOTICE'
warning: no files found matching 'LICENSE'
warning: sdist: standard file not found: should have one of README, README.rst, README.txt,
README.md

<https://builds.apache.org/job/beam_PerformanceTests_WordCountIT_Py37/ws/src/build/gradleenv/-1734967052/lib/python3.7/site-packages/setuptools/dist.py>:454:
UserWarning: Normalizing '2.22.0.dev' to '2.22.0.dev0'
  warnings.warn(tmpl.format(**locals()))
INFO:gen_protos:Skipping proto regeneration: all files up to date
warning: no files found matching 'README.md'
warning: no files found matching 'NOTICE'
warning: no files found matching 'LICENSE'
Level 5:avro.schema:Register new name for 'org.apache.avro.file.Header'
Level 5:avro.schema:Register new name for 'org.apache.avro.file.magic'
Level 5:avro.schema:Register new name for 'org.apache.avro.file.sync'
test_wordcount_it (apache_beam.examples.wordcount_it_test.WordCountIT) ... ERROR

======================================================================
ERROR: test_wordcount_it (apache_beam.examples.wordcount_it_test.WordCountIT)
----------------------------------------------------------------------
Traceback (most recent call last):
  File "<https://builds.apache.org/job/beam_PerformanceTests_WordCountIT_Py37/ws/src/sdks/python/apache_beam/examples/wordcount_it_test.py",>
line 50, in test_wordcount_it
    self._run_wordcount_it(wordcount.run)
  File "<https://builds.apache.org/job/beam_PerformanceTests_WordCountIT_Py37/ws/src/sdks/python/apache_beam/examples/wordcount_it_test.py",>
line 57, in _run_wordcount_it
    test_pipeline = TestPipeline(is_integration_test=True)
  File "<https://builds.apache.org/job/beam_PerformanceTests_WordCountIT_Py37/ws/src/sdks/python/apache_beam/testing/test_pipeline.py",>
line 107, in __init__
    super(TestPipeline, self).__init__(runner, options)
  File "<https://builds.apache.org/job/beam_PerformanceTests_WordCountIT_Py37/ws/src/sdks/python/apache_beam/pipeline.py",>
line 202, in __init__
    'Pipeline has validations errors: \n' + '\n'.join(errors))
ValueError: Pipeline has validations errors: 
Missing required option: region.
-------------------- >> begin captured logging << --------------------
avro.schema: Level 5: Register new name for 'org.apache.avro.file.Header'
avro.schema: Level 5: Register new name for 'org.apache.avro.file.magic'
avro.schema: Level 5: Register new name for 'org.apache.avro.file.sync'
--------------------- >> end captured logging << ---------------------

----------------------------------------------------------------------
XML: nosetests-integrationTest-perf.xml
----------------------------------------------------------------------
XML: <https://builds.apache.org/job/beam_PerformanceTests_WordCountIT_Py37/ws/src/sdks/python/nosetests.xml>
----------------------------------------------------------------------
Ran 1 test in 0.418s

FAILED (errors=1)

FAILURE: Build failed with an exception.

* What went wrong:
Execution failed for task ':sdks:python:test-suites:dataflow:py37:integrationTest'.
> Process 'command 'sh'' finished with non-zero exit value 1

* Try:
Run with --stacktrace option to get the stack trace. Run with --debug option to get more log
output. Run with --scan to get full insights.

* Get more help at https://help.gradle.org

BUILD FAILED in 1m 9s

2020-04-13 18:57:24,159 716b51f3 MainThread beam_integration_benchmark(1/1) ERROR    Error
during benchmark beam_integration_benchmark
Traceback (most recent call last):
  File "<https://builds.apache.org/job/beam_PerformanceTests_WordCountIT_Py37/ws/PerfKitBenchmarker/perfkitbenchmarker/pkb.py",>
line 846, in RunBenchmark
    DoRunPhase(spec, collector, detailed_timer)
  File "<https://builds.apache.org/job/beam_PerformanceTests_WordCountIT_Py37/ws/PerfKitBenchmarker/perfkitbenchmarker/pkb.py",>
line 689, in DoRunPhase
    samples = spec.BenchmarkRun(spec)
  File "<https://builds.apache.org/job/beam_PerformanceTests_WordCountIT_Py37/ws/PerfKitBenchmarker/perfkitbenchmarker/linux_benchmarks/beam_integration_benchmark.py",>
line 161, in Run
    job_type=job_type)
  File "<https://builds.apache.org/job/beam_PerformanceTests_WordCountIT_Py37/ws/PerfKitBenchmarker/perfkitbenchmarker/providers/gcp/gcp_dpb_dataflow.py",>
line 96, in SubmitJob
    assert retcode == 0, "Integration Test Failed."
AssertionError: Integration Test Failed.
2020-04-13 18:57:24,160 716b51f3 MainThread beam_integration_benchmark(1/1) INFO     Cleaning
up benchmark beam_integration_benchmark
2020-04-13 18:57:24,162 716b51f3 MainThread beam_integration_benchmark(1/1) ERROR    Exception
running benchmark
Traceback (most recent call last):
  File "<https://builds.apache.org/job/beam_PerformanceTests_WordCountIT_Py37/ws/PerfKitBenchmarker/perfkitbenchmarker/pkb.py",>
line 995, in RunBenchmarkTask
    RunBenchmark(spec, collector)
  File "<https://builds.apache.org/job/beam_PerformanceTests_WordCountIT_Py37/ws/PerfKitBenchmarker/perfkitbenchmarker/pkb.py",>
line 846, in RunBenchmark
    DoRunPhase(spec, collector, detailed_timer)
  File "<https://builds.apache.org/job/beam_PerformanceTests_WordCountIT_Py37/ws/PerfKitBenchmarker/perfkitbenchmarker/pkb.py",>
line 689, in DoRunPhase
    samples = spec.BenchmarkRun(spec)
  File "<https://builds.apache.org/job/beam_PerformanceTests_WordCountIT_Py37/ws/PerfKitBenchmarker/perfkitbenchmarker/linux_benchmarks/beam_integration_benchmark.py",>
line 161, in Run
    job_type=job_type)
  File "<https://builds.apache.org/job/beam_PerformanceTests_WordCountIT_Py37/ws/PerfKitBenchmarker/perfkitbenchmarker/providers/gcp/gcp_dpb_dataflow.py",>
line 96, in SubmitJob
    assert retcode == 0, "Integration Test Failed."
AssertionError: Integration Test Failed.
2020-04-13 18:57:24,162 716b51f3 MainThread beam_integration_benchmark(1/1) ERROR    Benchmark
1/1 beam_integration_benchmark (UID: beam_integration_benchmark0) failed. Execution will continue.
2020-04-13 18:57:24,163 716b51f3 MainThread beam_integration_benchmark(1/1) INFO     Benchmark
run statuses:
---------------------------------------------------------------------------------
Name                        UID                          Status  Failed Substatus
---------------------------------------------------------------------------------
beam_integration_benchmark  beam_integration_benchmark0  FAILED                  
---------------------------------------------------------------------------------
Success rate: 0.00% (0/1)
2020-04-13 18:57:24,163 716b51f3 MainThread beam_integration_benchmark(1/1) INFO     Complete
logs can be found at: <https://builds.apache.org/job/beam_PerformanceTests_WordCountIT_Py37/ws/runs/716b51f3/pkb.log>
2020-04-13 18:57:24,163 716b51f3 MainThread beam_integration_benchmark(1/1) INFO     Completion
statuses can be found at: <https://builds.apache.org/job/beam_PerformanceTests_WordCountIT_Py37/ws/runs/716b51f3/completion_statuses.json>
Build step 'Execute shell' marked build as failure

---------------------------------------------------------------------
To unsubscribe, e-mail: builds-unsubscribe@beam.apache.org
For additional commands, e-mail: builds-help@beam.apache.org


Mime
View raw message