beam-builds mailing list archives

Site index · List index
Message view « Date » · « Thread »
Top « Date » · « Thread »
From Apache Jenkins Server <jenk...@builds.apache.org>
Subject Build failed in Jenkins: beam_PostCommit_SQL #4577
Date Thu, 09 Apr 2020 23:42:34 GMT
See <https://builds.apache.org/job/beam_PostCommit_SQL/4577/display/redirect?page=changes>

Changes:

[github] Revert "[BEAM-9651] Prevent StreamPool and stream initialization


------------------------------------------
[...truncated 22.18 KB...]
Java Compiler Compiler Version 4.0 (Parser Generator)
(type "javacc" with no arguments for help)
Reading from file <https://builds.apache.org/job/beam_PostCommit_SQL/ws/src/sdks/java/extensions/sql/build/generated/fmpp/javacc/Parser.jj>
. . .
Note: UNICODE_INPUT option is specified. Please make sure you create the parser/lexer using
a Reader with the correct character encoding.
Warning: Lookahead adequacy checking not being performed since option LOOKAHEAD is more than
1.  Set option FORCE_LA_CHECK to true to force checking.
File "TokenMgrError.java" does not exist.  Will create one.
File "ParseException.java" does not exist.  Will create one.
File "Token.java" does not exist.  Will create one.
File "SimpleCharStream.java" does not exist.  Will create one.
Parser generated with 0 errors and 1 warnings.

> Task :sdks:java:extensions:sql:processResources
> Task :sdks:java:extensions:sql:processTestResources
> Task :model:pipeline:shadowJar
> Task :model:job-management:shadowJar
> Task :model:fn-execution:shadowJar
> Task :sdks:java:core:compileJava FROM-CACHE
> Task :sdks:java:core:classes
> Task :sdks:java:core:shadowJar
> Task :sdks:java:extensions:protobuf:extractIncludeProto
> Task :sdks:java:extensions:protobuf:generateProto NO-SOURCE
> Task :vendor:sdks-java-extensions-protobuf:compileJava FROM-CACHE
> Task :vendor:sdks-java-extensions-protobuf:classes UP-TO-DATE
> Task :sdks:java:extensions:google-cloud-platform-core:compileJava FROM-CACHE
> Task :sdks:java:extensions:google-cloud-platform-core:classes UP-TO-DATE
> Task :sdks:java:extensions:join-library:compileJava FROM-CACHE
> Task :sdks:java:extensions:join-library:classes UP-TO-DATE
> Task :sdks:java:io:common:compileTestJava FROM-CACHE
> Task :sdks:java:io:common:testClasses UP-TO-DATE
> Task :runners:local-java:compileJava FROM-CACHE
> Task :runners:local-java:classes UP-TO-DATE
> Task :sdks:java:extensions:join-library:jar
> Task :runners:local-java:jar
> Task :sdks:java:io:common:testJar
> Task :sdks:java:extensions:google-cloud-platform-core:jar
> Task :sdks:java:io:mongodb:compileJava FROM-CACHE
> Task :sdks:java:io:mongodb:classes UP-TO-DATE
> Task :sdks:java:io:parquet:compileJava FROM-CACHE
> Task :sdks:java:io:parquet:classes UP-TO-DATE
> Task :sdks:java:io:parquet:jar
> Task :sdks:java:testing:test-utils:compileJava FROM-CACHE
> Task :sdks:java:fn-execution:compileJava FROM-CACHE
> Task :sdks:java:fn-execution:classes UP-TO-DATE
> Task :runners:core-construction-java:compileJava FROM-CACHE
> Task :sdks:java:testing:test-utils:classes UP-TO-DATE
> Task :runners:core-construction-java:classes UP-TO-DATE
> Task :sdks:java:io:mongodb:jar
> Task :vendor:sdks-java-extensions-protobuf:shadowJar
> Task :sdks:java:testing:test-utils:jar
> Task :sdks:java:fn-execution:jar
> Task :sdks:java:testing:test-utils:compileTestJava FROM-CACHE
> Task :sdks:java:testing:test-utils:testClasses UP-TO-DATE
> Task :sdks:java:testing:test-utils:testJar
> Task :runners:core-construction-java:jar
> Task :sdks:java:expansion-service:compileJava FROM-CACHE
> Task :sdks:java:expansion-service:classes UP-TO-DATE
> Task :sdks:java:core:jar
> Task :sdks:java:expansion-service:jar
> Task :runners:core-java:compileJava FROM-CACHE
> Task :runners:core-java:classes UP-TO-DATE
> Task :sdks:java:io:kafka:compileJava FROM-CACHE
> Task :sdks:java:io:kafka:classes UP-TO-DATE
> Task :sdks:java:extensions:protobuf:compileJava FROM-CACHE
> Task :sdks:java:extensions:protobuf:classes UP-TO-DATE
> Task :sdks:java:io:kafka:jar
> Task :sdks:java:extensions:protobuf:jar
> Task :runners:core-java:jar
> Task :sdks:java:harness:compileJava FROM-CACHE
> Task :sdks:java:harness:classes UP-TO-DATE
> Task :sdks:java:io:google-cloud-platform:compileJava FROM-CACHE
> Task :sdks:java:io:google-cloud-platform:classes UP-TO-DATE
> Task :sdks:java:harness:jar
> Task :sdks:java:io:google-cloud-platform:jar
> Task :sdks:java:core:compileTestJava FROM-CACHE
> Task :sdks:java:core:testClasses

> Task :sdks:java:io:mongodb:compileTestJava
Note: <https://builds.apache.org/job/beam_PostCommit_SQL/ws/src/sdks/java/io/mongodb/src/test/java/org/apache/beam/sdk/io/mongodb/MongoDBGridFSIOTest.java>
uses or overrides a deprecated API.
Note: Recompile with -Xlint:deprecation for details.

> Task :sdks:java:io:mongodb:testClasses
> Task :sdks:java:io:mongodb:testJar
> Task :sdks:java:core:shadowTestJar
> Task :sdks:java:extensions:google-cloud-platform-core:compileTestJava FROM-CACHE
> Task :sdks:java:extensions:google-cloud-platform-core:testClasses UP-TO-DATE
> Task :sdks:java:extensions:google-cloud-platform-core:testJar
> Task :sdks:java:harness:shadowJar
> Task :runners:java-fn-execution:compileJava FROM-CACHE
> Task :runners:java-fn-execution:classes UP-TO-DATE
> Task :runners:java-fn-execution:jar
> Task :runners:direct-java:compileJava FROM-CACHE
> Task :runners:direct-java:classes UP-TO-DATE
> Task :runners:direct-java:shadowJar
> Task :sdks:java:io:google-cloud-platform:compileTestJava FROM-CACHE
> Task :sdks:java:io:google-cloud-platform:testClasses UP-TO-DATE
> Task :sdks:java:io:google-cloud-platform:testJar

> Task :sdks:java:extensions:sql:compileJava
Note: Some input files use or override a deprecated API.
Note: Recompile with -Xlint:deprecation for details.
Note: Some input files use unchecked or unsafe operations.
Note: Recompile with -Xlint:unchecked for details.

> Task :sdks:java:extensions:sql:classes

> Task :sdks:java:extensions:sql:compileTestJava
Note: Some input files use or override a deprecated API.
Note: Recompile with -Xlint:deprecation for details.
Note: Some input files use unchecked or unsafe operations.
Note: Recompile with -Xlint:unchecked for details.

> Task :sdks:java:extensions:sql:testClasses

> Task :sdks:java:extensions:sql:integrationTest

org.apache.beam.sdk.extensions.sql.meta.provider.bigquery.BigQueryRowCountIT > testEmptyTable
FAILED
    java.lang.IllegalArgumentException at BigQueryRowCountIT.java:54

org.apache.beam.sdk.extensions.sql.meta.provider.bigquery.BigQueryRowCountIT > testPipelineOptionInjection
FAILED
    java.lang.IllegalArgumentException at BigQueryRowCountIT.java:54

org.apache.beam.sdk.extensions.sql.meta.provider.datastore.DataStoreReadWriteIT > testReadAllSupportedTypes
FAILED
    java.lang.ExceptionInInitializerError
        Caused by: java.lang.IllegalArgumentException at DataStoreReadWriteIT.java:63

org.apache.beam.sdk.extensions.sql.meta.provider.bigquery.BigQueryRowCountIT > testFakeTable
FAILED
    java.lang.IllegalArgumentException at BigQueryRowCountIT.java:54

org.apache.beam.sdk.extensions.sql.meta.provider.datastore.DataStoreReadWriteIT > testDataStoreV1SqlWriteRead_withoutKey
FAILED
    java.lang.NoClassDefFoundError

org.apache.beam.sdk.extensions.sql.meta.provider.datastore.DataStoreReadWriteIT > testDataStoreV1SqlWriteRead
FAILED
    java.lang.NoClassDefFoundError

org.apache.beam.sdk.extensions.sql.meta.provider.bigquery.BigQueryRowCountIT > testNonEmptyTable
FAILED
    java.lang.IllegalArgumentException at BigQueryRowCountIT.java:54

org.apache.beam.sdk.extensions.sql.meta.provider.datastore.DataStoreReadWriteIT > testWriteRead_viaCoreBeamIO
FAILED
    java.lang.NoClassDefFoundError

org.apache.beam.sdk.extensions.sql.meta.provider.bigquery.BigQueryReadWriteIT > testSQLWriteAndRead_withDirectRead
FAILED
    java.lang.IllegalArgumentException at BigQueryReadWriteIT.java:93

org.apache.beam.sdk.extensions.sql.meta.provider.bigquery.BigQueryReadWriteIT > testSQLRead_withDirectRead_withProjectAndFilterPushDown
FAILED
    java.lang.IllegalArgumentException at BigQueryReadWriteIT.java:93

org.apache.beam.sdk.extensions.sql.meta.provider.bigquery.BigQueryReadWriteIT > testSQLWriteAndRead_withExport
FAILED
    java.lang.IllegalArgumentException at BigQueryReadWriteIT.java:93

org.apache.beam.sdk.extensions.sql.meta.provider.bigquery.BigQueryReadWriteIT > testSQLWriteAndRead
FAILED
    java.lang.IllegalArgumentException at BigQueryReadWriteIT.java:93

org.apache.beam.sdk.extensions.sql.meta.provider.bigquery.BigQueryReadWriteIT > testSQLTypes
FAILED
    java.lang.IllegalArgumentException at BigQueryReadWriteIT.java:93

org.apache.beam.sdk.extensions.sql.meta.provider.bigquery.BigQueryReadWriteIT > testSQLWrite
FAILED
    java.lang.IllegalArgumentException at BigQueryReadWriteIT.java:93

org.apache.beam.sdk.extensions.sql.meta.provider.bigquery.BigQueryReadWriteIT > testSQLRead_withDirectRead_withProjectPushDown
FAILED
    java.lang.IllegalArgumentException at BigQueryReadWriteIT.java:93

org.apache.beam.sdk.extensions.sql.meta.provider.bigquery.BigQueryReadWriteIT > testSQLRead_withExport
FAILED
    java.lang.IllegalArgumentException at BigQueryReadWriteIT.java:93

org.apache.beam.sdk.extensions.sql.meta.provider.bigquery.BigQueryReadWriteIT > testInsertSelect
FAILED
    java.lang.IllegalArgumentException at BigQueryReadWriteIT.java:93

org.apache.beam.sdk.extensions.sql.PubsubToBigqueryIT > testSimpleInsert FAILED
    java.lang.IllegalArgumentException at PubsubToBigqueryIT.java:52

org.apache.beam.sdk.extensions.sql.PubsubToBigqueryIT > testSimpleInsertFlat FAILED
    java.lang.IllegalArgumentException at PubsubToBigqueryIT.java:52

org.apache.beam.sdk.extensions.sql.meta.provider.mongodb.MongoDbReadWriteIT > testWriteAndRead
FAILED
    java.lang.IllegalArgumentException at MongoDbReadWriteIT.java:108

org.apache.beam.sdk.extensions.sql.meta.provider.mongodb.MongoDbReadWriteIT > testPredicatePushDown
FAILED
    java.lang.IllegalArgumentException at MongoDbReadWriteIT.java:108

org.apache.beam.sdk.extensions.sql.meta.provider.mongodb.MongoDbReadWriteIT > testProjectPushDown
FAILED
    java.lang.IllegalArgumentException at MongoDbReadWriteIT.java:108

org.apache.beam.sdk.extensions.sql.meta.provider.pubsub.PubsubJsonIT > testSQLInsertJsonRowsToPubsubFlat
FAILED
    java.lang.IllegalArgumentException at PubsubJsonIT.java:99

org.apache.beam.sdk.extensions.sql.meta.provider.pubsub.PubsubJsonIT > testSQLSelectsPayloadContentFlat
FAILED
    java.lang.IllegalArgumentException at PubsubJsonIT.java:99

org.apache.beam.sdk.extensions.sql.meta.provider.pubsub.PubsubJsonIT > testSQLSelectsPayloadContent
FAILED
    java.lang.IllegalArgumentException at PubsubJsonIT.java:99

org.apache.beam.sdk.extensions.sql.meta.provider.pubsub.PubsubJsonIT > testSQLReadAndWriteWithSameFlatTableDefinition
FAILED
    java.lang.IllegalArgumentException at PubsubJsonIT.java:99

org.apache.beam.sdk.extensions.sql.meta.provider.pubsub.PubsubJsonIT > testSQLInsertJsonRowsToPubsubWithTimestampAttributeFlat
FAILED
    java.lang.IllegalArgumentException at PubsubJsonIT.java:99

org.apache.beam.sdk.extensions.sql.meta.provider.pubsub.PubsubJsonIT > testWritesJsonRowsToPubsub
FAILED
    java.lang.IllegalArgumentException at PubsubJsonIT.java:99

32 tests completed, 28 failed, 4 skipped

> Task :sdks:java:extensions:sql:integrationTest FAILED
> Task :sdks:java:extensions:sql:jar
> Task :sdks:java:extensions:sql:jdbc:compileJava FROM-CACHE
> Task :sdks:java:extensions:sql:jdbc:classes
> Task :sdks:java:extensions:sql:zetasql:compileJava FROM-CACHE
> Task :sdks:java:extensions:sql:zetasql:classes UP-TO-DATE
> Task :sdks:java:extensions:sql:zetasql:jar
> Task :sdks:java:extensions:sql:datacatalog:compileJava
> Task :sdks:java:extensions:sql:datacatalog:classes

> Task :sdks:java:extensions:sql:jdbc:compileTestJava
Note: Some input files use or override a deprecated API.
Note: Recompile with -Xlint:deprecation for details.
Note: Some input files use unchecked or unsafe operations.
Note: Recompile with -Xlint:unchecked for details.

> Task :sdks:java:extensions:sql:jdbc:testClasses
> Task :sdks:java:extensions:sql:jdbc:endToEndTest
> Task :sdks:java:extensions:sql:jdbc:postCommit
> Task :sdks:java:extensions:sql:datacatalog:compileTestJava
> Task :sdks:java:extensions:sql:datacatalog:testClasses
> Task :sdks:java:extensions:sql:datacatalog:integrationTest
> Task :sdks:java:extensions:sql:datacatalog:postCommit

FAILURE: Build failed with an exception.

* What went wrong:
Execution failed for task ':sdks:java:extensions:sql:integrationTest'.
> There were failing tests. See the report at: file://<https://builds.apache.org/job/beam_PostCommit_SQL/ws/src/sdks/java/extensions/sql/build/reports/tests/integrationTest/index.html>

* Try:
Run with --stacktrace option to get the stack trace. Run with --info or --debug option to
get more log output. Run with --scan to get full insights.

* Get more help at https://help.gradle.org

Deprecated Gradle features were used in this build, making it incompatible with Gradle 6.0.
Use '--warning-mode all' to show the individual deprecation warnings.
See https://docs.gradle.org/5.2.1/userguide/command_line_interface.html#sec:command_line_warnings

BUILD FAILED in 1m 38s
95 actionable tasks: 66 executed, 29 from cache

Publishing build scan...
https://gradle.com/s/xwvv3kwrjd5o2

Build step 'Invoke Gradle script' changed build result to FAILURE
Build step 'Invoke Gradle script' marked build as failure

---------------------------------------------------------------------
To unsubscribe, e-mail: builds-unsubscribe@beam.apache.org
For additional commands, e-mail: builds-help@beam.apache.org


Mime
View raw message