beam-builds mailing list archives

Site index · List index
Message view « Date » · « Thread »
Top « Date » · « Thread »
From Apache Jenkins Server <jenk...@builds.apache.org>
Subject Build failed in Jenkins: beam_PostCommit_Website_Test #3659
Date Thu, 09 Apr 2020 22:05:58 GMT
See <https://builds.apache.org/job/beam_PostCommit_Website_Test/3659/display/redirect?page=changes>

Changes:

[samuelw] [BEAM-9651] Prevent StreamPool and stream initialization livelock


------------------------------------------
Started by GitHub push by reuvenlax
Running as SYSTEM
[EnvInject] - Loading node environment variables.
Building remotely on websites (git-websites svn-websites) in workspace <https://builds.apache.org/job/beam_PostCommit_Website_Test/ws/>
No credentials specified
Wiping out workspace first.
Cloning the remote Git repository
Cloning repository https://github.com/apache/beam.git
 > git init <https://builds.apache.org/job/beam_PostCommit_Website_Test/ws/src> #
timeout=10
Fetching upstream changes from https://github.com/apache/beam.git
 > git --version # timeout=10
 > git fetch --tags --progress -- https://github.com/apache/beam.git +refs/heads/*:refs/remotes/origin/*
 > git config remote.origin.url https://github.com/apache/beam.git # timeout=10
 > git config --add remote.origin.fetch +refs/heads/*:refs/remotes/origin/* # timeout=10
 > git config remote.origin.url https://github.com/apache/beam.git # timeout=10
Fetching upstream changes from https://github.com/apache/beam.git
 > git fetch --tags --progress -- https://github.com/apache/beam.git +refs/heads/*:refs/remotes/origin/*
+refs/pull/${ghprbPullId}/*:refs/remotes/origin/pr/${ghprbPullId}/*
 > git rev-parse origin/master^{commit} # timeout=10
Checking out Revision 28b081f5a3b3a486d0e1a6375a0b9381a9807e4c (origin/master)
 > git config core.sparsecheckout # timeout=10
 > git checkout -f 28b081f5a3b3a486d0e1a6375a0b9381a9807e4c
Commit message: "Merge pull request #11364: [BEAM-9651] Prevent StreamPool and stream initialization
livelock"
 > git rev-list --no-walk 95a5944de9aa6756e2b6aaf2b97a2d5a5dd99def # timeout=10
No emails were triggered.
[EnvInject] - Executing scripts and injecting environment variables after the SCM step.
[EnvInject] - Injecting as environment variables the properties content 
SPARK_LOCAL_IP=127.0.0.1

[EnvInject] - Variables injected successfully.
[Gradle] - Launching build.
[src] $ <https://builds.apache.org/job/beam_PostCommit_Website_Test/ws/src/gradlew>
--continue --max-workers=12 -Dorg.gradle.jvmargs=-Xms2g -Dorg.gradle.jvmargs=-Xmx4g :website:testWebsite
-PdisableExternal=false
To honour the JVM settings for this build a new JVM will be forked. Please consider using
the daemon: https://docs.gradle.org/5.2.1/userguide/gradle_daemon.html.
Daemon will be stopped at the end of the build stopping after processing
> Task :buildSrc:compileJava NO-SOURCE
> Task :buildSrc:compileGroovy FROM-CACHE
> Task :buildSrc:pluginDescriptors
> Task :buildSrc:processResources
> Task :buildSrc:classes
> Task :buildSrc:jar
> Task :buildSrc:assemble
> Task :buildSrc:spotlessGroovy
> Task :buildSrc:spotlessGroovyCheck
> Task :buildSrc:spotlessGroovyGradle
> Task :buildSrc:spotlessGroovyGradleCheck
> Task :buildSrc:spotlessCheck
> Task :buildSrc:pluginUnderTestMetadata
> Task :buildSrc:compileTestJava NO-SOURCE
> Task :buildSrc:compileTestGroovy NO-SOURCE
> Task :buildSrc:processTestResources NO-SOURCE
> Task :buildSrc:testClasses UP-TO-DATE
> Task :buildSrc:test NO-SOURCE
> Task :buildSrc:validateTaskProperties FROM-CACHE
> Task :buildSrc:check
> Task :buildSrc:build
Configuration on demand is an incubating feature.
> Task :website:setupBuildDir

> Task :website:buildDockerImage
Sending build context to Docker daemon  27.48MB
Step 1/7 : FROM ruby:2.5
 ---> 813c262b2373
Step 2/7 : WORKDIR /ruby
 ---> Using cache
 ---> 5a456fcd2b6c
Step 3/7 : RUN gem install bundler
 ---> Using cache
 ---> f6c6087749fb
Step 4/7 : ADD Gemfile Gemfile.lock /ruby/
 ---> Using cache
 ---> b53cc74da9dd
Step 5/7 : RUN bundle install --deployment --path $GEM_HOME
 ---> Using cache
 ---> d438b28112f9
Step 6/7 : ENV LC_ALL C.UTF-8
 ---> Using cache
 ---> cc482e946d2d
Step 7/7 : CMD sleep 3600
 ---> Using cache
 ---> cf05f5167eca
Successfully built cf05f5167eca
Successfully tagged beam-website:latest

> Task :website:createDockerContainer

> Task :website:startDockerContainer FAILED
Error response from daemon: OCI runtime create failed: container_linux.go:349: starting container
process caused "process_linux.go:449: container init caused \"rootfs_linux.go:58: mounting
\\\"<https://builds.apache.org/job/beam_PostCommit_Website_Test/ws/src\\\"> to rootfs
\\\"/var/lib/docker/165536.165536/overlay2/e5402c1772f5cdc129a12c9a6277892aed2d51e1b1237e2a4f2c1a751b0434e3/merged\\\"
at \\\"/repo\\\" caused \\\"stat <https://builds.apache.org/job/beam_PostCommit_Website_Test/ws/src>:
permission denied\\\"\"": unknown
Error: failed to start containers: 5b90931a5783609bc61c2c2163ed8dbc78f2f5d5caaf5ba7d97ba4cfd9185038

FAILURE: Build failed with an exception.

* What went wrong:
Execution failed for task ':website:startDockerContainer'.
> Process 'command 'docker'' finished with non-zero exit value 1

* Try:
Run with --stacktrace option to get the stack trace. Run with --info or --debug option to
get more log output. Run with --scan to get full insights.

* Get more help at https://help.gradle.org

Deprecated Gradle features were used in this build, making it incompatible with Gradle 6.0.
Use '--warning-mode all' to show the individual deprecation warnings.
See https://docs.gradle.org/5.2.1/userguide/command_line_interface.html#sec:command_line_warnings

BUILD FAILED in 19s
4 actionable tasks: 4 executed

Publishing build scan...
https://gradle.com/s/m32vjwcpgvu2i

Build step 'Invoke Gradle script' changed build result to FAILURE
Build step 'Invoke Gradle script' marked build as failure

---------------------------------------------------------------------
To unsubscribe, e-mail: builds-unsubscribe@beam.apache.org
For additional commands, e-mail: builds-help@beam.apache.org


Mime
View raw message