beam-builds mailing list archives

Site index · List index
Message view « Date » · « Thread »
Top « Date » · « Thread »
From Apache Jenkins Server <jenk...@builds.apache.org>
Subject Build failed in Jenkins: beam_PostCommit_Website_Test #3705
Date Tue, 14 Apr 2020 07:19:08 GMT
See <https://builds.apache.org/job/beam_PostCommit_Website_Test/3705/display/redirect?page=changes>

Changes:

[github] [BEAM-9650] Add PeriodicImpulse Transform and slowly changing side input


------------------------------------------
Started by GitHub push by Ardagan
Running as SYSTEM
[EnvInject] - Loading node environment variables.
Building remotely on websites (git-websites svn-websites) in workspace <https://builds.apache.org/job/beam_PostCommit_Website_Test/ws/>
No credentials specified
Wiping out workspace first.
Cloning the remote Git repository
Cloning repository https://github.com/apache/beam.git
 > git init <https://builds.apache.org/job/beam_PostCommit_Website_Test/ws/src> #
timeout=10
Fetching upstream changes from https://github.com/apache/beam.git
 > git --version # timeout=10
 > git fetch --tags --progress -- https://github.com/apache/beam.git +refs/heads/*:refs/remotes/origin/*
 > git config remote.origin.url https://github.com/apache/beam.git # timeout=10
 > git config --add remote.origin.fetch +refs/heads/*:refs/remotes/origin/* # timeout=10
 > git config remote.origin.url https://github.com/apache/beam.git # timeout=10
Fetching upstream changes from https://github.com/apache/beam.git
 > git fetch --tags --progress -- https://github.com/apache/beam.git +refs/heads/*:refs/remotes/origin/*
+refs/pull/${ghprbPullId}/*:refs/remotes/origin/pr/${ghprbPullId}/*
 > git rev-parse origin/master^{commit} # timeout=10
Checking out Revision 0595f79f653350801bfd940bcb5fb144fe7d469c (origin/master)
 > git config core.sparsecheckout # timeout=10
 > git checkout -f 0595f79f653350801bfd940bcb5fb144fe7d469c
Commit message: "[BEAM-9650] Add PeriodicImpulse Transform and slowly changing side input
documentation (#11182)"
 > git rev-list --no-walk 93362729bdb380e99f1ce14cec1185ddd96d9858 # timeout=10
No emails were triggered.
[EnvInject] - Executing scripts and injecting environment variables after the SCM step.
[EnvInject] - Injecting as environment variables the properties content 
SPARK_LOCAL_IP=127.0.0.1

[EnvInject] - Variables injected successfully.
[Gradle] - Launching build.
[src] $ <https://builds.apache.org/job/beam_PostCommit_Website_Test/ws/src/gradlew>
--continue --max-workers=12 -Dorg.gradle.jvmargs=-Xms2g -Dorg.gradle.jvmargs=-Xmx4g :website:testWebsite
-PdisableExternal=false
To honour the JVM settings for this build a new JVM will be forked. Please consider using
the daemon: https://docs.gradle.org/5.2.1/userguide/gradle_daemon.html.
Daemon will be stopped at the end of the build stopping after processing
> Task :buildSrc:compileJava NO-SOURCE
> Task :buildSrc:compileGroovy FROM-CACHE
> Task :buildSrc:pluginDescriptors
> Task :buildSrc:processResources
> Task :buildSrc:classes
> Task :buildSrc:jar
> Task :buildSrc:assemble
> Task :buildSrc:spotlessGroovy
> Task :buildSrc:spotlessGroovyCheck
> Task :buildSrc:spotlessGroovyGradle
> Task :buildSrc:spotlessGroovyGradleCheck
> Task :buildSrc:spotlessCheck
> Task :buildSrc:pluginUnderTestMetadata
> Task :buildSrc:compileTestJava NO-SOURCE
> Task :buildSrc:compileTestGroovy NO-SOURCE
> Task :buildSrc:processTestResources NO-SOURCE
> Task :buildSrc:testClasses UP-TO-DATE
> Task :buildSrc:test NO-SOURCE
> Task :buildSrc:validateTaskProperties FROM-CACHE
> Task :buildSrc:check
> Task :buildSrc:build
Configuration on demand is an incubating feature.
> Task :website:setupBuildDir

> Task :website:buildDockerImage
Sending build context to Docker daemon  27.48MB
Step 1/7 : FROM ruby:2.5
 ---> 813c262b2373
Step 2/7 : WORKDIR /ruby
 ---> Using cache
 ---> c6f95b3112c8
Step 3/7 : RUN gem install bundler
 ---> Using cache
 ---> 0aa404e9447c
Step 4/7 : ADD Gemfile Gemfile.lock /ruby/
 ---> Using cache
 ---> dd61d6cd6404
Step 5/7 : RUN bundle install --deployment --path $GEM_HOME
 ---> Using cache
 ---> fae843633f5b
Step 6/7 : ENV LC_ALL C.UTF-8
 ---> Using cache
 ---> 743dfe2adf2e
Step 7/7 : CMD sleep 3600
 ---> Using cache
 ---> 8c90338fa22d
Successfully built 8c90338fa22d
Successfully tagged beam-website:latest

> Task :website:createDockerContainer

> Task :website:startDockerContainer
3b91bb28bf306755123d579671a8677ce356c8c0cf0b3c12e800b768023b3d89

> Task :website:setupDockerContainer

> Task :website:buildLocalWebsite
`/` is not writable.
Bundler will use `/tmp/bundler/home/unknown' as your home directory temporarily.
Configuration file: /repo/website/_config.yml
Configuration file: /repo/website/_config_test.yml
Configuration file: /tmp/_config_branch_repo.yml
            Source: /repo/website/src
       Destination: generated-local-content
 Incremental build: enabled
      Generating... 
jekyll 3.6.3 | Error:  Permission denied @ dir_s_mkdir - /repo/build/website/generated-local-content/security

> Task :website:buildLocalWebsite FAILED

> Task :website:stopAndRemoveDockerContainer
3b91bb28bf306755123d579671a8677ce356c8c0cf0b3c12e800b768023b3d89

FAILURE: Build failed with an exception.

* What went wrong:
Execution failed for task ':website:buildLocalWebsite'.
> Process 'command 'docker'' finished with non-zero exit value 1

* Try:
Run with --stacktrace option to get the stack trace. Run with --info or --debug option to
get more log output. Run with --scan to get full insights.

* Get more help at https://help.gradle.org

Deprecated Gradle features were used in this build, making it incompatible with Gradle 6.0.
Use '--warning-mode all' to show the individual deprecation warnings.
See https://docs.gradle.org/5.2.1/userguide/command_line_interface.html#sec:command_line_warnings

BUILD FAILED in 1m 4s
7 actionable tasks: 7 executed

Publishing build scan...
https://gradle.com/s/vx65nskeztyje

Build step 'Invoke Gradle script' changed build result to FAILURE
Build step 'Invoke Gradle script' marked build as failure

---------------------------------------------------------------------
To unsubscribe, e-mail: builds-unsubscribe@beam.apache.org
For additional commands, e-mail: builds-help@beam.apache.org


Mime
View raw message