beam-builds mailing list archives

Site index · List index
Message view « Date » · « Thread »
Top « Date » · « Thread »
From Apache Jenkins Server <jenk...@builds.apache.org>
Subject Build failed in Jenkins: beam_PerformanceTests_Kafka_IO #651
Date Tue, 14 Apr 2020 06:36:14 GMT
See <https://builds.apache.org/job/beam_PerformanceTests_Kafka_IO/651/display/redirect?page=changes>

Changes:

[github] Merge pull request #11389 from Refactor the BCJ and capture controls to

[github] [BEAM-i9751] upgrade zetasql to 2020.04.1 (#11410)


------------------------------------------
Started by timer
Running as SYSTEM
[EnvInject] - Loading node environment variables.
Building remotely on apache-beam-jenkins-3 (beam) in workspace <https://builds.apache.org/job/beam_PerformanceTests_Kafka_IO/ws/>
No credentials specified
Wiping out workspace first.
Cloning the remote Git repository
Cloning repository https://github.com/apache/beam.git
 > git init <https://builds.apache.org/job/beam_PerformanceTests_Kafka_IO/ws/src>
# timeout=10
Fetching upstream changes from https://github.com/apache/beam.git
 > git --version # timeout=10
 > git fetch --tags --progress https://github.com/apache/beam.git +refs/heads/*:refs/remotes/origin/*
 > git config remote.origin.url https://github.com/apache/beam.git # timeout=10
 > git config --add remote.origin.fetch +refs/heads/*:refs/remotes/origin/* # timeout=10
 > git config remote.origin.url https://github.com/apache/beam.git # timeout=10
Fetching upstream changes from https://github.com/apache/beam.git
 > git fetch --tags --progress https://github.com/apache/beam.git +refs/heads/*:refs/remotes/origin/*
+refs/pull/${ghprbPullId}/*:refs/remotes/origin/pr/${ghprbPullId}/*
 > git rev-parse origin/master^{commit} # timeout=10
Checking out Revision 93362729bdb380e99f1ce14cec1185ddd96d9858 (origin/master)
 > git config core.sparsecheckout # timeout=10
 > git checkout -f 93362729bdb380e99f1ce14cec1185ddd96d9858
Commit message: "[BEAM-i9751] upgrade zetasql to 2020.04.1 (#11410)"
 > git rev-list --no-walk 40903f279aefac13c6183b8841c9a6d4c5a86478 # timeout=10
No emails were triggered.
[EnvInject] - Executing scripts and injecting environment variables after the SCM step.
[EnvInject] - Injecting as environment variables the properties content 
SPARK_LOCAL_IP=127.0.0.1

[EnvInject] - Variables injected successfully.
[beam_PerformanceTests_Kafka_IO] $ /bin/bash -xe /tmp/jenkins7499790487098841075.sh
+ cp /home/jenkins/.kube/config <https://builds.apache.org/job/beam_PerformanceTests_Kafka_IO/ws/config-beam-performancetests-kafka-io-651>
[EnvInject] - Injecting environment variables from a build step.
[EnvInject] - Injecting as environment variables the properties content 
KUBECONFIG="<https://builds.apache.org/job/beam_PerformanceTests_Kafka_IO/ws/config-beam-performancetests-kafka-io-651">

[EnvInject] - Variables injected successfully.
[beam_PerformanceTests_Kafka_IO] $ /bin/bash -xe /tmp/jenkins2716529681976750050.sh
+ <https://builds.apache.org/job/beam_PerformanceTests_Kafka_IO/ws/src/.test-infra/kubernetes/kubernetes.sh>
createNamespace beam-performancetests-kafka-io-651
+ KUBECONFIG='"<https://builds.apache.org/job/beam_PerformanceTests_Kafka_IO/ws/config-beam-performancetests-kafka-io-651"'>
+ KUBERNETES_NAMESPACE=default
+ KUBECTL='kubectl --kubeconfig="<https://builds.apache.org/job/beam_PerformanceTests_Kafka_IO/ws/config-beam-performancetests-kafka-io-651">
--namespace=default'
+ createNamespace beam-performancetests-kafka-io-651
+ eval 'kubectl --kubeconfig="<https://builds.apache.org/job/beam_PerformanceTests_Kafka_IO/ws/config-beam-performancetests-kafka-io-651">
create namespace beam-performancetests-kafka-io-651'
++ kubectl --kubeconfig=<https://builds.apache.org/job/beam_PerformanceTests_Kafka_IO/ws/config-beam-performancetests-kafka-io-651>
create namespace beam-performancetests-kafka-io-651
namespace/beam-performancetests-kafka-io-651 created
[EnvInject] - Injecting environment variables from a build step.
[EnvInject] - Injecting as environment variables the properties content 
KUBERNETES_NAMESPACE=beam-performancetests-kafka-io-651

[EnvInject] - Variables injected successfully.
[beam_PerformanceTests_Kafka_IO] $ /bin/bash -xe /tmp/jenkins2392559501518954945.sh
+ <https://builds.apache.org/job/beam_PerformanceTests_Kafka_IO/ws/src/.test-infra/kubernetes/kubernetes.sh>
apply <https://builds.apache.org/job/beam_PerformanceTests_Kafka_IO/ws/src/.test-infra/kubernetes/kafka-cluster>
+ KUBECONFIG='"<https://builds.apache.org/job/beam_PerformanceTests_Kafka_IO/ws/config-beam-performancetests-kafka-io-651"'>
+ KUBERNETES_NAMESPACE=beam-performancetests-kafka-io-651
+ KUBECTL='kubectl --kubeconfig="<https://builds.apache.org/job/beam_PerformanceTests_Kafka_IO/ws/config-beam-performancetests-kafka-io-651">
--namespace=beam-performancetests-kafka-io-651'
+ apply <https://builds.apache.org/job/beam_PerformanceTests_Kafka_IO/ws/src/.test-infra/kubernetes/kafka-cluster>
+ eval 'kubectl --kubeconfig="<https://builds.apache.org/job/beam_PerformanceTests_Kafka_IO/ws/config-beam-performancetests-kafka-io-651">
--namespace=beam-performancetests-kafka-io-651 apply -R -f <https://builds.apache.org/job/beam_PerformanceTests_Kafka_IO/ws/src/.test-infra/kubernetes/kafka-cluster'>
++ kubectl --kubeconfig=<https://builds.apache.org/job/beam_PerformanceTests_Kafka_IO/ws/config-beam-performancetests-kafka-io-651>
--namespace=beam-performancetests-kafka-io-651 apply -R -f <https://builds.apache.org/job/beam_PerformanceTests_Kafka_IO/ws/src/.test-infra/kubernetes/kafka-cluster>
storageclass.storage.k8s.io/kafka-broker unchanged
storageclass.storage.k8s.io/kafka-zookeeper unchanged
clusterrole.rbac.authorization.k8s.io/node-reader unchanged
clusterrolebinding.rbac.authorization.k8s.io/kafka-node-reader configured
role.rbac.authorization.k8s.io/pod-labler created
rolebinding.rbac.authorization.k8s.io/kafka-pod-labler created
configmap/zookeeper-config created
service/pzoo created
service/zookeeper created
statefulset.apps/pzoo created
configmap/broker-config created
service/broker created
service/bootstrap created
statefulset.apps/kafka created
configmap/kafka-config created
job.batch/kafka-config-eff079ec created
Error from server (Invalid): error when creating "<https://builds.apache.org/job/beam_PerformanceTests_Kafka_IO/ws/src/.test-infra/kubernetes/kafka-cluster/04-outside-services/outside-0.yml">:
Service "outside-0" is invalid: spec.ports[0].nodePort: Invalid value: 32400: provided port
is already allocated
Error from server (Invalid): error when creating "<https://builds.apache.org/job/beam_PerformanceTests_Kafka_IO/ws/src/.test-infra/kubernetes/kafka-cluster/04-outside-services/outside-1.yml">:
Service "outside-1" is invalid: spec.ports[0].nodePort: Invalid value: 32401: provided port
is already allocated
Error from server (Invalid): error when creating "<https://builds.apache.org/job/beam_PerformanceTests_Kafka_IO/ws/src/.test-infra/kubernetes/kafka-cluster/04-outside-services/outside-2.yml">:
Service "outside-2" is invalid: spec.ports[0].nodePort: Invalid value: 32402: provided port
is already allocated
Build step 'Execute shell' marked build as failure

---------------------------------------------------------------------
To unsubscribe, e-mail: builds-unsubscribe@beam.apache.org
For additional commands, e-mail: builds-help@beam.apache.org


Mime
View raw message