beam-builds mailing list archives

Site index · List index
Message view « Date » · « Thread »
Top « Date » · « Thread »
From Apache Jenkins Server <jenk...@builds.apache.org>
Subject Build failed in Jenkins: beam_PostRelease_NightlySnapshot #912
Date Fri, 06 Mar 2020 11:00:28 GMT
See <https://builds.apache.org/job/beam_PostRelease_NightlySnapshot/912/display/redirect?page=changes>

Changes:

[git] Remove optionality and add sensible defaults to PubsubIO builders.

[amaliujia] [BEAM-9288] Not bundle conscrypt in gRPC vendor in META-INF/

[iemejia] [BEAM-9450] Update www.apache.org/dist/ links to downloads.apache.org

[iemejia] [BEAM-9450] Convert links available via https to use https

[github] Add integration test for AnnotateVideoWithContext transform (#10986)

[lcwik] [BEAM-9452] Update classgraph to latest version to resolve windows

[hktang] [BEAM-9453] Changed new string creation to use StandardCharsets.UTF_8

[chuck.yang] Use Avro format for file loads to BigQuery

[jkai] [Hotfix] fix rabbitmp spotless check

[github] Revert "[BEAM-6374] Emit PCollection metrics from GoSDK (#10942)"

[github] Merge pull request #11032 from [BEAM-8335] Display rather than logging


------------------------------------------
Started by timer
Running as SYSTEM
[EnvInject] - Loading node environment variables.
Building remotely on apache-beam-jenkins-1 (beam) in workspace <https://builds.apache.org/job/beam_PostRelease_NightlySnapshot/ws/>
No credentials specified
Wiping out workspace first.
Cloning the remote Git repository
Cloning repository https://github.com/apache/beam.git
 > git init <https://builds.apache.org/job/beam_PostRelease_NightlySnapshot/ws/src>
# timeout=10
Fetching upstream changes from https://github.com/apache/beam.git
 > git --version # timeout=10
 > git fetch --tags --progress https://github.com/apache/beam.git +refs/heads/*:refs/remotes/origin/*
 > git config remote.origin.url https://github.com/apache/beam.git # timeout=10
 > git config --add remote.origin.fetch +refs/heads/*:refs/remotes/origin/* # timeout=10
 > git config remote.origin.url https://github.com/apache/beam.git # timeout=10
Fetching upstream changes from https://github.com/apache/beam.git
 > git fetch --tags --progress https://github.com/apache/beam.git +refs/heads/*:refs/remotes/origin/*
+refs/pull/${ghprbPullId}/*:refs/remotes/origin/pr/${ghprbPullId}/*
 > git rev-parse origin/master^{commit} # timeout=10
Checking out Revision 457d4dce27a854b1b42f97565056e4e766b39015 (origin/master)
 > git config core.sparsecheckout # timeout=10
 > git checkout -f 457d4dce27a854b1b42f97565056e4e766b39015
Commit message: "Merge pull request #11032 from [BEAM-8335] Display rather than logging when
is_in_notebook."
 > git rev-list --no-walk 86125712d945373aa761183fbfafa2ca93cce58e # timeout=10
No emails were triggered.
[EnvInject] - Executing scripts and injecting environment variables after the SCM step.
[EnvInject] - Injecting as environment variables the properties content 
SPARK_LOCAL_IP=127.0.0.1

[EnvInject] - Variables injected successfully.
[Gradle] - Launching build.
[src] $ <https://builds.apache.org/job/beam_PostRelease_NightlySnapshot/ws/src/gradlew>
--continue --max-workers=12 -Dorg.gradle.jvmargs=-Xms2g -Dorg.gradle.jvmargs=-Xmx4g -Pver=
-Prepourl= :release:runJavaExamplesValidationTask
Starting a Gradle Daemon (subsequent builds will be faster)
> Task :buildSrc:compileJava NO-SOURCE
> Task :buildSrc:compileGroovy FROM-CACHE
> Task :buildSrc:pluginDescriptors
> Task :buildSrc:processResources
> Task :buildSrc:classes
> Task :buildSrc:jar
> Task :buildSrc:assemble
> Task :buildSrc:spotlessGroovy
> Task :buildSrc:spotlessGroovyCheck
> Task :buildSrc:spotlessGroovyGradle
> Task :buildSrc:spotlessGroovyGradleCheck
> Task :buildSrc:spotlessCheck
> Task :buildSrc:pluginUnderTestMetadata
> Task :buildSrc:compileTestJava NO-SOURCE
> Task :buildSrc:compileTestGroovy NO-SOURCE
> Task :buildSrc:processTestResources NO-SOURCE
> Task :buildSrc:testClasses UP-TO-DATE
> Task :buildSrc:test NO-SOURCE
> Task :buildSrc:validateTaskProperties FROM-CACHE
> Task :buildSrc:check
> Task :buildSrc:build

FAILURE: Build failed with an exception.

* What went wrong:
Could not add entry ':validateTaskProperties' to cache executionHistory.bin (<https://builds.apache.org/job/beam_PostRelease_NightlySnapshot/ws/src/buildSrc/.gradle/5.2.1/executionHistory/executionHistory.bin).>
> java.io.IOException: No space left on device

* Try:
Run with --stacktrace option to get the stack trace. Run with --info or --debug option to
get more log output. Run with --scan to get full insights.

* Get more help at https://help.gradle.org

BUILD FAILED in 8s

FAILURE: Build failed with an exception.

* What went wrong:
Could not update <https://builds.apache.org/job/beam_PostRelease_NightlySnapshot/ws/src/.gradle/5.2.1/fileChanges/last-build.bin>
> No space left on device

* Try:
Run with --stacktrace option to get the stack trace. Run with --info or --debug option to
get more log output. Run with --scan to get full insights.

* Get more help at https://help.gradle.org

BUILD FAILED in 8s
Build step 'Invoke Gradle script' changed build result to FAILURE
Build step 'Invoke Gradle script' marked build as failure

---------------------------------------------------------------------
To unsubscribe, e-mail: builds-unsubscribe@beam.apache.org
For additional commands, e-mail: builds-help@beam.apache.org


Mime
View raw message