beam-builds mailing list archives

Site index · List index
Message view « Date » · « Thread »
Top « Date » · « Thread »
From Apache Jenkins Server <jenk...@builds.apache.org>
Subject Build failed in Jenkins: beam_PostCommit_Java_PVR_Spark_Batch #2406
Date Wed, 18 Mar 2020 00:59:53 GMT
See <https://builds.apache.org/job/beam_PostCommit_Java_PVR_Spark_Batch/2406/display/redirect>

Changes:


------------------------------------------
[...truncated 69.42 KB...]
        Caused by: java.lang.RuntimeException at WithTimestampsTest.java:78
            Caused by: java.util.concurrent.ExecutionException at WithTimestampsTest.java:78
                Caused by: java.lang.RuntimeException
                    Caused by: org.apache.beam.vendor.grpc.v1p26p0.io.grpc.StatusRuntimeException
                        Caused by: org.apache.beam.vendor.grpc.v1p26p0.io.netty.channel.ChannelException
                            Caused by: java.lang.reflect.InvocationTargetException
                                Caused by: org.apache.beam.vendor.grpc.v1p26p0.io.netty.channel.ChannelException
                                    Caused by: java.net.SocketException

org.apache.beam.sdk.transforms.WithTimestampsTest > withTimestampsBackwardsInTimeAndWithAllowedTimestampSkewShouldSucceed
FAILED
    java.lang.RuntimeException at WithTimestampsTest.java:142
        Caused by: java.lang.RuntimeException at WithTimestampsTest.java:142
            Caused by: java.util.concurrent.ExecutionException at WithTimestampsTest.java:142
                Caused by: java.io.FileNotFoundException

org.apache.beam.sdk.transforms.WithTimestampsTest > withTimestampsLambdaShouldApplyTimestamps
FAILED
    java.lang.RuntimeException at WithTimestampsTest.java:205
        Caused by: java.lang.RuntimeException at WithTimestampsTest.java:205
            Caused by: java.util.concurrent.ExecutionException at WithTimestampsTest.java:205
                Caused by: java.io.FileNotFoundException

org.apache.beam.sdk.transforms.ViewTest > testEmptyMapSideInputWithNonDeterministicKeyCoder
FAILED
    java.lang.RuntimeException at ViewTest.java:1211
        Caused by: java.lang.RuntimeException at ViewTest.java:1211
            Caused by: java.util.concurrent.ExecutionException at ViewTest.java:1211
                Caused by: java.lang.RuntimeException
                    Caused by: org.apache.beam.vendor.grpc.v1p26p0.io.grpc.StatusRuntimeException

org.apache.beam.runners.core.metrics.MetricsPusherTest > pushesUserMetrics FAILED
    java.lang.RuntimeException at MetricsPusherTest.java:70
        Caused by: java.lang.RuntimeException at MetricsPusherTest.java:70
            Caused by: java.util.concurrent.ExecutionException at MetricsPusherTest.java:70
                Caused by: java.lang.RuntimeException
                    Caused by: org.apache.beam.vendor.grpc.v1p26p0.io.grpc.StatusRuntimeException

org.apache.beam.sdk.transforms.ViewTest > testMultimapAsEntrySetSideInput FAILED
    java.lang.RuntimeException at ViewTest.java:581
        Caused by: java.lang.RuntimeException at ViewTest.java:581
            Caused by: java.util.concurrent.ExecutionException at ViewTest.java:581
                Caused by: java.lang.RuntimeException
                    Caused by: org.apache.beam.vendor.grpc.v1p26p0.io.grpc.StatusRuntimeException

org.apache.beam.runners.core.metrics.MetricsPusherTest > pushesSystemMetrics FAILED
    java.lang.RuntimeException at MetricsPusherTest.java:91
        Caused by: java.lang.RuntimeException at MetricsPusherTest.java:91
            Caused by: java.util.concurrent.ExecutionException at MetricsPusherTest.java:91
                Caused by: java.lang.RuntimeException
                    Caused by: org.apache.beam.vendor.grpc.v1p26p0.io.grpc.StatusRuntimeException

org.apache.beam.sdk.transforms.ViewTest > testSingletonSideInput FAILED
    java.lang.RuntimeException at ViewTest.java:113
        Caused by: java.lang.RuntimeException at ViewTest.java:113
            Caused by: java.util.concurrent.ExecutionException at ViewTest.java:113
                Caused by: java.lang.RuntimeException
                    Caused by: org.apache.beam.vendor.grpc.v1p26p0.io.grpc.StatusRuntimeException

org.apache.beam.sdk.transforms.KvSwapTest > testKvSwap FAILED
    java.lang.RuntimeException at KvSwapTest.java:77
        Caused by: java.lang.RuntimeException at KvSwapTest.java:77
            Caused by: java.util.concurrent.ExecutionException at KvSwapTest.java:77
                Caused by: java.lang.RuntimeException
                    Caused by: org.apache.beam.vendor.grpc.v1p26p0.io.grpc.StatusRuntimeException
                        Caused by: org.apache.beam.vendor.grpc.v1p26p0.io.netty.channel.ChannelException
                            Caused by: java.lang.reflect.InvocationTargetException
                                Caused by: org.apache.beam.vendor.grpc.v1p26p0.io.netty.channel.ChannelException
                                    Caused by: java.net.SocketException

org.apache.beam.sdk.transforms.ReshuffleTest > testReshuffleAfterSessionsAndGroupByKey
FAILED
    java.lang.RuntimeException at ReshuffleTest.java:169
        Caused by: java.lang.RuntimeException at ReshuffleTest.java:169
            Caused by: java.util.concurrent.ExecutionException at ReshuffleTest.java:169
                Caused by: java.io.FileNotFoundException

org.apache.beam.sdk.transforms.ReshuffleTest > testReshuffleAfterFixedWindows FAILED
    java.lang.RuntimeException at ReshuffleTest.java:231
        Caused by: java.lang.RuntimeException at ReshuffleTest.java:231
            Caused by: java.util.concurrent.ExecutionException at ReshuffleTest.java:231
                Caused by: java.lang.RuntimeException
                    Caused by: org.apache.beam.vendor.grpc.v1p26p0.io.grpc.StatusRuntimeException

org.apache.beam.sdk.transforms.ReshuffleTest > testReshuffleAfterFixedWindowsAndGroupByKey
FAILED
    java.lang.RuntimeException at ReshuffleTest.java:190
        Caused by: java.lang.RuntimeException at ReshuffleTest.java:190
            Caused by: java.util.concurrent.ExecutionException at ReshuffleTest.java:190
                Caused by: java.io.FileNotFoundException

org.apache.beam.sdk.transforms.ReshuffleTest > testReshuffleAfterSlidingWindows FAILED
    java.lang.RuntimeException at ReshuffleTest.java:251
        Caused by: java.lang.RuntimeException at ReshuffleTest.java:251
            Caused by: java.util.concurrent.ExecutionException at ReshuffleTest.java:251
                Caused by: java.io.FileNotFoundException

org.apache.beam.sdk.transforms.ReshuffleTest > testReshufflePreservesTimestamps FAILED
    java.lang.RuntimeException at ReshuffleTest.java:148

org.apache.beam.sdk.transforms.ReshuffleTest > testReshuffleAfterSlidingWindowsAndGroupByKey
FAILED
    java.lang.RuntimeException at ReshuffleTest.java:211
        Caused by: java.lang.RuntimeException at ReshuffleTest.java:211
            Caused by: java.util.concurrent.ExecutionException at ReshuffleTest.java:211
                Caused by: java.lang.RuntimeException
                    Caused by: org.apache.beam.vendor.grpc.v1p26p0.io.grpc.StatusRuntimeException

org.apache.beam.sdk.transforms.ReshuffleTest > testJustReshuffle FAILED
    java.lang.RuntimeException at ReshuffleTest.java:102
        Caused by: java.lang.RuntimeException at ReshuffleTest.java:102
            Caused by: java.util.concurrent.ExecutionException at ReshuffleTest.java:102
                Caused by: java.lang.RuntimeException
                    Caused by: org.apache.beam.vendor.grpc.v1p26p0.io.grpc.StatusRuntimeException

org.apache.beam.sdk.transforms.ParDoTest$TimestampTests > testParDoShiftTimestamp FAILED
    java.lang.RuntimeException at ParDoTest.java:1654
        Caused by: java.lang.RuntimeException at ParDoTest.java:1654
            Caused by: java.util.concurrent.ExecutionException at ParDoTest.java:1654
                Caused by: java.lang.RuntimeException
                    Caused by: org.apache.beam.vendor.grpc.v1p26p0.io.grpc.StatusRuntimeException
                        Caused by: org.apache.beam.vendor.grpc.v1p26p0.io.netty.channel.ChannelException
                            Caused by: java.lang.reflect.InvocationTargetException
                                Caused by: org.apache.beam.vendor.grpc.v1p26p0.io.netty.channel.ChannelException
                                    Caused by: java.net.SocketException

org.apache.beam.sdk.transforms.ParDoTest$TimestampTests > testParDoShiftTimestampUnlimited
FAILED
    java.lang.RuntimeException at ParDoTest.java:1743
        Caused by: java.lang.RuntimeException at ParDoTest.java:1743
            Caused by: java.util.concurrent.ExecutionException at ParDoTest.java:1743
                Caused by: java.io.FileNotFoundException

org.apache.beam.sdk.transforms.CombineTest$BasicTests > testBasicCombineEmpty FAILED
    java.lang.RuntimeException at CombineTest.java:691
        Caused by: java.lang.RuntimeException at CombineTest.java:691
            Caused by: java.util.concurrent.ExecutionException at CombineTest.java:691
                Caused by: java.io.FileNotFoundException

org.apache.beam.sdk.transforms.ParDoSchemaTest > testReadAndWrite FAILED
    java.lang.RuntimeException at ParDoSchemaTest.java:150
        Caused by: java.lang.RuntimeException at ParDoSchemaTest.java:150
            Caused by: java.util.concurrent.ExecutionException at ParDoSchemaTest.java:150
                Caused by: java.lang.RuntimeException
                    Caused by: org.apache.beam.vendor.grpc.v1p26p0.io.grpc.StatusRuntimeException

org.apache.beam.sdk.transforms.ParDoSchemaTest > testSchemasPassedThrough FAILED
    java.lang.RuntimeException at ParDoSchemaTest.java:420
        Caused by: java.lang.RuntimeException at ParDoSchemaTest.java:420
            Caused by: java.util.concurrent.ExecutionException at ParDoSchemaTest.java:420
                Caused by: java.lang.RuntimeException
                    Caused by: org.apache.beam.vendor.grpc.v1p26p0.io.grpc.StatusRuntimeException

org.apache.beam.sdk.transforms.ParDoSchemaTest > testSchemaFieldSelectionNested FAILED
    java.lang.RuntimeException at ParDoSchemaTest.java:633
        Caused by: java.lang.RuntimeException at ParDoSchemaTest.java:633
            Caused by: java.util.concurrent.ExecutionException at ParDoSchemaTest.java:633
                Caused by: java.lang.RuntimeException
                    Caused by: org.apache.beam.vendor.grpc.v1p26p0.io.grpc.StatusRuntimeException
                        Caused by: org.apache.beam.vendor.grpc.v1p26p0.io.netty.channel.ChannelException
                            Caused by: java.lang.reflect.InvocationTargetException
                                Caused by: org.apache.beam.vendor.grpc.v1p26p0.io.netty.channel.ChannelException
                                    Caused by: java.net.SocketException

org.apache.beam.sdk.transforms.ParDoSchemaTest > testSchemaFieldSelectionUnboxing FAILED
    java.lang.RuntimeException at ParDoSchemaTest.java:542
        Caused by: java.lang.RuntimeException at ParDoSchemaTest.java:542
            Caused by: java.util.concurrent.ExecutionException at ParDoSchemaTest.java:542
                Caused by: java.io.FileNotFoundException

org.apache.beam.sdk.transforms.ParDoSchemaTest > testSchemaFieldDescriptorSelectionUnboxing
FAILED
    java.lang.RuntimeException at ParDoSchemaTest.java:583
        Caused by: java.lang.RuntimeException at ParDoSchemaTest.java:583
            Caused by: java.util.concurrent.ExecutionException at ParDoSchemaTest.java:583
                Caused by: java.io.FileNotFoundException

org.apache.beam.sdk.transforms.ParDoSchemaTest > testInferredSchemaPipeline FAILED
    java.lang.RuntimeException at ParDoSchemaTest.java:405
        Caused by: java.lang.RuntimeException at ParDoSchemaTest.java:405
            Caused by: java.util.concurrent.ExecutionException at ParDoSchemaTest.java:405
                Caused by: java.io.FileNotFoundException

org.apache.beam.sdk.transforms.ParDoSchemaTest > testFieldAccessSchemaPipeline FAILED
    java.lang.RuntimeException at ParDoSchemaTest.java:327
        Caused by: java.lang.RuntimeException at ParDoSchemaTest.java:327
            Caused by: java.util.concurrent.ExecutionException at ParDoSchemaTest.java:327
                Caused by: java.io.FileNotFoundException

org.apache.beam.sdk.transforms.ParDoSchemaTest > testSimpleSchemaPipeline FAILED
    java.lang.RuntimeException at ParDoSchemaTest.java:96
        Caused by: java.lang.RuntimeException at ParDoSchemaTest.java:96
            Caused by: java.util.concurrent.ExecutionException at ParDoSchemaTest.java:96
                Caused by: java.io.FileNotFoundException

org.apache.beam.sdk.transforms.ParDoSchemaTest > testSchemaConversionPipeline FAILED
    java.lang.RuntimeException at ParDoSchemaTest.java:453
        Caused by: java.lang.RuntimeException at ParDoSchemaTest.java:453
            Caused by: java.util.concurrent.ExecutionException at ParDoSchemaTest.java:453
                Caused by: java.io.FileNotFoundException

org.apache.beam.sdk.transforms.ParDoSchemaTest > testReadAndWriteWithSchemaRegistry FAILED
    java.lang.RuntimeException at ParDoSchemaTest.java:292
        Caused by: java.lang.RuntimeException at ParDoSchemaTest.java:292
            Caused by: java.util.concurrent.ExecutionException at ParDoSchemaTest.java:292
                Caused by: java.io.FileNotFoundException

org.apache.beam.sdk.transforms.ParDoSchemaTest > testReadAndWriteMultiOutput FAILED
    java.lang.RuntimeException at ParDoSchemaTest.java:247

org.apache.beam.sdk.transforms.ParDoSchemaTest > testNestedSchema FAILED
    java.lang.RuntimeException at ParDoSchemaTest.java:492
        Caused by: java.lang.RuntimeException at ParDoSchemaTest.java:492
            Caused by: java.util.concurrent.ExecutionException at ParDoSchemaTest.java:492
                Caused by: java.lang.RuntimeException
                    Caused by: org.apache.beam.vendor.grpc.v1p26p0.io.grpc.StatusRuntimeException

org.apache.beam.sdk.io.CountingSourceTest > testUnboundedSourceSplits FAILED
    java.lang.RuntimeException at CountingSourceTest.java:246
        Caused by: java.lang.RuntimeException at CountingSourceTest.java:246
            Caused by: java.util.concurrent.ExecutionException at CountingSourceTest.java:246
                Caused by: java.lang.RuntimeException
                    Caused by: org.apache.beam.vendor.grpc.v1p26p0.io.grpc.StatusRuntimeException

org.apache.beam.sdk.io.CountingSourceTest > testBoundedSourceSplits FAILED
    java.lang.RuntimeException at CountingSourceTest.java:121
        Caused by: java.lang.RuntimeException at CountingSourceTest.java:121
            Caused by: java.util.concurrent.ExecutionException at CountingSourceTest.java:121
                Caused by: java.io.FileNotFoundException

199 tests completed, 132 failed, 3 skipped

> Task :runners:spark:job-server:validatesPortableRunnerBatch FAILED

FAILURE: Build failed with an exception.

* What went wrong:
Execution failed for task ':runners:spark:job-server:validatesPortableRunnerBatch'.
> There were failing tests. See the report at: file://<https://builds.apache.org/job/beam_PostCommit_Java_PVR_Spark_Batch/ws/src/runners/spark/job-server/build/reports/tests/validatesPortableRunnerBatch/index.html>

* Try:
Run with --stacktrace option to get the stack trace. Run with --info or --debug option to
get more log output. Run with --scan to get full insights.

* Get more help at https://help.gradle.org

Deprecated Gradle features were used in this build, making it incompatible with Gradle 6.0.
Use '--warning-mode all' to show the individual deprecation warnings.
See https://docs.gradle.org/5.2.1/userguide/command_line_interface.html#sec:command_line_warnings

BUILD FAILED in 46m 35s
62 actionable tasks: 42 executed, 20 from cache

Publishing build scan...
https://gradle.com/s/faof75yqq7c26

Build step 'Invoke Gradle script' changed build result to FAILURE
Build step 'Invoke Gradle script' marked build as failure

---------------------------------------------------------------------
To unsubscribe, e-mail: builds-unsubscribe@beam.apache.org
For additional commands, e-mail: builds-help@beam.apache.org


Mime
View raw message