beam-builds mailing list archives

Site index · List index
Message view « Date » · « Thread »
Top « Date » · « Thread »
From Apache Jenkins Server <jenk...@builds.apache.org>
Subject Build failed in Jenkins: beam_PreCommit_Java_Cron #2539
Date Sun, 22 Mar 2020 06:45:39 GMT
See <https://builds.apache.org/job/beam_PreCommit_Java_Cron/2539/display/redirect>

Changes:


------------------------------------------
[...truncated 477.29 KB...]
SLF4J: Defaulting to no-operation (NOP) logger implementation
SLF4J: See http://www.slf4j.org/codes.html#StaticLoggerBinder for further details.

> Task :runners:samza:job-server:shadowDistTar
> Task :sdks:java:expansion-service:test
> Task :sdks:java:expansion-service:check
> Task :sdks:java:expansion-service:build
> Task :sdks:java:fn-execution:assemble
> Task :sdks:java:fn-execution:analyzeClassesDependencies SKIPPED
> Task :sdks:java:fn-execution:compileTestJava FROM-CACHE
> Task :sdks:java:fn-execution:testClasses UP-TO-DATE
> Task :sdks:java:fn-execution:analyzeTestClassesDependencies SKIPPED
> Task :sdks:java:fn-execution:analyzeDependencies SKIPPED
> Task :vendor:sdks-java-extensions-protobuf:test NO-SOURCE
> Task :vendor:sdks-java-extensions-protobuf:validateShadedJarDoesntLeakNonProjectClasses
> Task :vendor:sdks-java-extensions-protobuf:check
> Task :vendor:sdks-java-extensions-protobuf:build
> Task :sdks:java:extensions:google-cloud-platform-core:assemble
> Task :sdks:java:extensions:google-cloud-platform-core:analyzeClassesDependencies SKIPPED
> Task :sdks:java:extensions:google-cloud-platform-core:analyzeTestClassesDependencies
SKIPPED
> Task :sdks:java:extensions:google-cloud-platform-core:analyzeDependencies SKIPPED
> Task :sdks:java:fn-execution:checkstyleMain
> Task :sdks:java:extensions:google-cloud-platform-core:checkstyleMain
> Task :sdks:java:fn-execution:checkstyleTest
> Task :sdks:java:extensions:google-cloud-platform-core:checkstyleTest
> Task :runners:spark:check
> Task :runners:spark:build
> Task :runners:spark:buildDependents
> Task :sdks:java:extensions:protobuf:assemble
> Task :sdks:java:extensions:protobuf:analyzeClassesDependencies SKIPPED
> Task :sdks:java:extensions:protobuf:extractIncludeTestProto
> Task :sdks:java:extensions:protobuf:generateTestProto
> Task :sdks:java:extensions:protobuf:compileTestJava FROM-CACHE
> Task :sdks:java:extensions:protobuf:testClasses
> Task :sdks:java:extensions:protobuf:analyzeTestClassesDependencies SKIPPED
> Task :sdks:java:extensions:protobuf:analyzeDependencies SKIPPED
> Task :sdks:java:core:checkstyleMain
> Task :sdks:java:io:elasticsearch-tests:elasticsearch-tests-6:check
> Task :sdks:java:io:elasticsearch-tests:elasticsearch-tests-6:build
> Task :sdks:java:io:elasticsearch-tests:elasticsearch-tests-6:buildDependents
> Task :sdks:java:io:common:analyzeTestClassesDependencies SKIPPED
> Task :sdks:java:io:common:analyzeDependencies SKIPPED
> Task :sdks:java:io:common:checkstyleTest
> Task :sdks:java:extensions:protobuf:checkstyleMain
> Task :sdks:java:fn-execution:javadoc
> Task :sdks:java:extensions:protobuf:checkstyleTest
> Task :sdks:java:extensions:google-cloud-platform-core:javadoc
> Task :runners:samza:job-server:shadowDistZip
> Task :runners:samza:job-server:assemble
> Task :runners:samza:job-server:analyzeClassesDependencies SKIPPED
> Task :runners:samza:job-server:analyzeTestClassesDependencies SKIPPED
> Task :runners:samza:job-server:analyzeDependencies SKIPPED
> Task :runners:samza:job-server:checkstyleMain NO-SOURCE
> Task :runners:samza:job-server:checkstyleTest NO-SOURCE
> Task :runners:samza:job-server:javadoc NO-SOURCE
> Task :runners:samza:job-server:spotbugsMain NO-SOURCE
> Task :runners:samza:job-server:test NO-SOURCE
> Task :runners:samza:job-server:check UP-TO-DATE
> Task :runners:samza:job-server:build
> Task :runners:samza:job-server:buildDependents
> Task :runners:samza:buildDependents
> Task :sdks:java:io:elasticsearch:assemble
> Task :sdks:java:io:elasticsearch:analyzeClassesDependencies SKIPPED
> Task :sdks:java:io:elasticsearch:compileTestJava NO-SOURCE
> Task :sdks:java:io:elasticsearch:testClasses UP-TO-DATE
> Task :sdks:java:io:elasticsearch:analyzeTestClassesDependencies SKIPPED
> Task :sdks:java:io:elasticsearch:analyzeDependencies SKIPPED
> Task :sdks:java:io:elasticsearch:checkstyleMain
> Task :sdks:java:io:elasticsearch:checkstyleTest NO-SOURCE
[main] INFO org.gradle.internal.nativeintegration.services.NativeServices - Initialized native
services in: /home/jenkins/.gradle/native

> Task :sdks:java:extensions:google-cloud-platform-core:spotbugsMain
[ant:checkstyle] SLF4J: Class path contains multiple SLF4J bindings.
[ant:checkstyle] 
[ant:checkstyle] SLF4J: Found binding in [jar:file:/home/jenkins/.gradle/caches/modules-2/files-2.1/org.slf4j/slf4j-simple/1.7.25/8dacf9514f0c707cbbcdd6fd699e8940d42fb54e/slf4j-simple-1.7.25.jar!/org/slf4j/impl/StaticLoggerBinder.class]
[ant:checkstyle] SLF4J: Found binding in [jar:file:/home/jenkins/.gradle/wrapper/dists/gradle-5.2.1-all/bviwmvmbexq6idcscbicws5me/gradle-5.2.1/lib/gradle-logging-5.2.1.jar!/org/slf4j/impl/StaticLoggerBinder.class]
[ant:checkstyle] SLF4J: See http://www.slf4j.org/codes.html#multiple_bindings for an explanation.
[ant:checkstyle] SLF4J: Actual binding is of type [org.slf4j.impl.SimpleLoggerFactory]
[ant:checkstyle] 

> Task :runners:extensions-java:metrics:test
> Task :runners:extensions-java:metrics:check
> Task :runners:extensions-java:metrics:build
> Task :runners:extensions-java:metrics:buildDependents
> Task :sdks:java:io:hadoop-common:assemble
> Task :sdks:java:io:hadoop-common:analyzeClassesDependencies SKIPPED
> Task :sdks:java:io:hadoop-common:compileTestJava FROM-CACHE
> Task :sdks:java:io:hadoop-common:testClasses UP-TO-DATE
> Task :sdks:java:io:hadoop-common:analyzeTestClassesDependencies SKIPPED
> Task :sdks:java:io:hadoop-common:analyzeDependencies SKIPPED

> Task :sdks:java:fn-execution:spotbugsMain
SLF4J: Failed to load class "org.slf4j.impl.StaticLoggerBinder".
SLF4J: Defaulting to no-operation (NOP) logger implementation
SLF4J: See http://www.slf4j.org/codes.html#StaticLoggerBinder for further details.

> Task :sdks:java:io:hadoop-common:checkstyleMain
[main] INFO org.gradle.internal.nativeintegration.services.NativeServices - Initialized native
services in: /home/jenkins/.gradle/native
> Task :sdks:java:io:hadoop-common:checkstyleTest

> Task :sdks:java:extensions:google-cloud-platform-core:spotbugsMain
SLF4J: Failed to load class "org.slf4j.impl.StaticLoggerBinder".
SLF4J: Defaulting to no-operation (NOP) logger implementation
SLF4J: See http://www.slf4j.org/codes.html#StaticLoggerBinder for further details.

> Task :sdks:java:extensions:protobuf:javadoc
> Task :sdks:java:io:elasticsearch-tests:elasticsearch-tests-5:check
> Task :sdks:java:io:elasticsearch-tests:elasticsearch-tests-5:build
> Task :sdks:java:io:elasticsearch-tests:elasticsearch-tests-5:buildDependents
> Task :sdks:java:extensions:sql:hcatalog:compileJava FROM-CACHE
> Task :sdks:java:extensions:sql:hcatalog:classes UP-TO-DATE
> Task :sdks:java:io:elasticsearch:javadoc
> Task :sdks:java:io:hadoop-common:javadoc
[main] INFO org.gradle.internal.nativeintegration.services.NativeServices - Initialized native
services in: /home/jenkins/.gradle/native

> Task :sdks:java:extensions:protobuf:spotbugsMain
SLF4J: Failed to load class "org.slf4j.impl.StaticLoggerBinder".
SLF4J: Defaulting to no-operation (NOP) logger implementation
SLF4J: See http://www.slf4j.org/codes.html#StaticLoggerBinder for further details.

[main] INFO org.gradle.internal.nativeintegration.services.NativeServices - Initialized native
services in: /home/jenkins/.gradle/native

> Task :sdks:java:extensions:sql:hcatalog:javadoc

> Task :sdks:java:io:elasticsearch:spotbugsMain
SLF4J: Failed to load class "org.slf4j.impl.StaticLoggerBinder".
SLF4J: Defaulting to no-operation (NOP) logger implementation
SLF4J: See http://www.slf4j.org/codes.html#StaticLoggerBinder for further details.

[main] INFO org.gradle.internal.nativeintegration.services.NativeServices - Initialized native
services in: /home/jenkins/.gradle/native

> Task :sdks:java:io:hadoop-common:spotbugsMain
SLF4J: Failed to load class "org.slf4j.impl.StaticLoggerBinder".
SLF4J: Defaulting to no-operation (NOP) logger implementation
SLF4J: See http://www.slf4j.org/codes.html#StaticLoggerBinder for further details.

> Task :sdks:java:harness:test
> Task :sdks:java:io:common:test
> Task :sdks:java:io:elasticsearch-tests:elasticsearch-tests-7:check
> Task :sdks:java:io:elasticsearch-tests:elasticsearch-tests-7:build
> Task :sdks:java:io:elasticsearch-tests:elasticsearch-tests-7:buildDependents
> Task :sdks:java:io:elasticsearch-tests:elasticsearch-tests-common:buildDependents
> Task :sdks:java:io:common:check
> Task :sdks:java:io:common:build
> Task :sdks:java:core:checkstyleTest

> Task :sdks:java:io:elasticsearch:spotbugsMain
The following classes needed for analysis were missing:
  com.google.auto.value.AutoValue$Builder
  com.google.auto.value.AutoValue

> Task :sdks:java:io:elasticsearch:test NO-SOURCE
> Task :sdks:java:io:elasticsearch:check
> Task :sdks:java:io:elasticsearch:build
> Task :sdks:java:io:elasticsearch:buildDependents
> Task :sdks:java:extensions:sql:jdbc:shadowJarTest
> Task :sdks:java:io:hadoop-common:test
> Task :sdks:java:io:hadoop-common:check
> Task :sdks:java:io:hadoop-common:build
> Task :sdks:java:io:hadoop-common:buildDependents
> Task :sdks:java:harness:check
> Task :sdks:java:harness:build
> Task :sdks:java:fn-execution:test

org.apache.beam.sdk.fn.splittabledofn.WatermarkEstimatorsTest > testThreadSafeWatermarkEstimator
FAILED
    java.lang.AssertionError at WatermarkEstimatorsTest.java:102

63 tests completed, 1 failed, 2 skipped

> Task :sdks:java:fn-execution:test FAILED
> Task :sdks:java:extensions:protobuf:test
> Task :sdks:java:extensions:protobuf:check
> Task :sdks:java:extensions:protobuf:build
> Task :sdks:java:extensions:google-cloud-platform-core:test
> Task :sdks:java:extensions:google-cloud-platform-core:check
> Task :sdks:java:extensions:google-cloud-platform-core:build
> Task :sdks:java:core:javadoc
> Task :sdks:java:javadoc:allJavadoc
[main] INFO org.gradle.internal.nativeintegration.services.NativeServices - Initialized native
services in: /home/jenkins/.gradle/native

> Task :sdks:java:core:spotbugsMain
SLF4J: Failed to load class "org.slf4j.impl.StaticLoggerBinder".
SLF4J: Defaulting to no-operation (NOP) logger implementation
SLF4J: See http://www.slf4j.org/codes.html#StaticLoggerBinder for further details.

> Task :sdks:java:extensions:sql:jdbc:preCommit
> Task :runners:flink:1.9:check
> Task :runners:flink:1.9:build
> Task :runners:flink:1.9:buildDependents
> Task :runners:flink:1.10:test

> Task :sdks:java:core:spotbugsMain
The following classes needed for analysis were missing:
  com.google.auto.value.AutoValue$Builder
  com.google.auto.value.AutoValue

> Task :sdks:java:core:test
> Task :sdks:java:core:validateShadedJarDoesntLeakNonProjectClasses
> Task :sdks:java:core:check
> Task :sdks:java:core:build
> Task :sdks:java:core:buildNeeded
> Task :runners:flink:1.10:check
> Task :runners:flink:1.10:build
> Task :runners:flink:1.10:buildDependents
> Task :sdks:java:testing:nexmark:check
> Task :sdks:java:testing:nexmark:build
> Task :sdks:java:testing:nexmark:buildDependents
> Task :sdks:java:extensions:sql:buildDependents
> Task :sdks:java:io:google-cloud-platform:buildDependents
> Task :sdks:java:io:kafka:buildDependents
> Task :sdks:java:extensions:join-library:buildDependents
> Task :sdks:java:io:mongodb:buildDependents
> Task :sdks:java:extensions:protobuf:buildDependents
> Task :sdks:java:io:synthetic:buildDependents
> Task :sdks:java:testing:test-utils:buildDependents
> Task :sdks:java:io:common:buildDependents
> Task :runners:direct-java:buildDependents
> Task :runners:java-fn-execution:buildDependents
> Task :runners:local-java:buildDependents
> Task :sdks:java:harness:buildDependents
> Task :sdks:java:expansion-service:buildDependents
> Task :vendor:sdks-java-extensions-protobuf:buildDependents
> Task :runners:core-java:buildDependents
> Task :sdks:java:extensions:google-cloud-platform-core:buildDependents
> Task :runners:core-construction-java:buildDependents

FAILURE: Build failed with an exception.

* What went wrong:
Execution failed for task ':sdks:java:fn-execution:test'.
> There were failing tests. See the report at: file://<https://builds.apache.org/job/beam_PreCommit_Java_Cron/ws/src/sdks/java/fn-execution/build/reports/tests/test/index.html>

* Try:
Run with --stacktrace option to get the stack trace. Run with --info or --debug option to
get more log output. Run with --scan to get full insights.

* Get more help at https://help.gradle.org

Deprecated Gradle features were used in this build, making it incompatible with Gradle 6.0.
Use '--warning-mode all' to show the individual deprecation warnings.
See https://docs.gradle.org/5.2.1/userguide/command_line_interface.html#sec:command_line_warnings

BUILD FAILED in 36m 13s
856 actionable tasks: 709 executed, 147 from cache

Publishing build scan...
https://gradle.com/s/2gshnsbeyv74o

Build step 'Invoke Gradle script' changed build result to FAILURE
Build step 'Invoke Gradle script' marked build as failure

---------------------------------------------------------------------
To unsubscribe, e-mail: builds-unsubscribe@beam.apache.org
For additional commands, e-mail: builds-help@beam.apache.org


Mime
View raw message