beam-builds mailing list archives

Site index · List index
Message view « Date » · « Thread »
Top « Date » · « Thread »
From Apache Jenkins Server <jenk...@builds.apache.org>
Subject Build failed in Jenkins: beam_PostCommit_Java_ValidatesRunner_PortabilityApi_Dataflow_Java11 #308
Date Sat, 07 Mar 2020 05:02:13 GMT
See <https://builds.apache.org/job/beam_PostCommit_Java_ValidatesRunner_PortabilityApi_Dataflow_Java11/308/display/redirect?page=changes>

Changes:

[chadrik] [BEAM-9274] Support running yapf in a git pre-commit hook

[lcwik] [BEAM-9464] Fix WithKeys to respect parameterized types

[ankurgoenka] [BEAM-9465] Fire repeatedly in reshuffle


------------------------------------------
[...truncated 50.76 KB...]
Note: Recompile with -Xlint:unchecked for details.

> Task :sdks:java:harness:classes
> Task :sdks:java:harness:jar

> Task :sdks:java:io:google-cloud-platform:compileJava
Note: Some input files use or override a deprecated API.
Note: Recompile with -Xlint:deprecation for details.
Note: Some input files use unchecked or unsafe operations.
Note: Recompile with -Xlint:unchecked for details.

> Task :sdks:java:io:google-cloud-platform:classes
> Task :sdks:java:io:google-cloud-platform:jar

> Task :sdks:java:core:compileTestJava
Note: Some input files use or override a deprecated API.
Note: Recompile with -Xlint:deprecation for details.
Note: Some input files use unchecked or unsafe operations.
Note: Recompile with -Xlint:unchecked for details.

> Task :sdks:java:core:testClasses
> Task :sdks:java:core:shadowTestJar

> Task :runners:google-cloud-dataflow-java:compileJava
Note: Some input files use or override a deprecated API.
Note: Recompile with -Xlint:deprecation for details.
Note: Some input files use unchecked or unsafe operations.
Note: Recompile with -Xlint:unchecked for details.

> Task :runners:google-cloud-dataflow-java:classes
> Task :runners:google-cloud-dataflow-java:jar
> Task :sdks:java:harness:shadowJar
> Task :sdks:java:container:copyDockerfileDependencies

> Task :sdks:java:extensions:google-cloud-platform-core:compileTestJava
Note: Some input files use or override a deprecated API.
Note: Recompile with -Xlint:deprecation for details.

> Task :sdks:java:extensions:google-cloud-platform-core:testClasses
> Task :sdks:java:extensions:google-cloud-platform-core:testJar

> Task :runners:java-fn-execution:compileJava
Note: Some input files use or override a deprecated API.
Note: Recompile with -Xlint:deprecation for details.
Note: Some input files use unchecked or unsafe operations.
Note: Recompile with -Xlint:unchecked for details.

> Task :sdks:go:resolveBuildDependencies
Resolving google.golang.org/api: commit='386d4e5f4f92f86e6aec85985761bba4b938a2d5', urls=[https://code.googlesource.com/google-api-go-client]

> Task :runners:java-fn-execution:classes
> Task :runners:java-fn-execution:jar

> Task :sdks:go:resolveBuildDependencies
Resolving google.golang.org/genproto: commit='2b5a72b8730b0b16380010cfe5286c42108d88e7', urls=[https://github.com/google/go-genproto]
Resolving google.golang.org/grpc: commit='7646b5360d049a7ca31e9133315db43456f39e2e', urls=[https://github.com/grpc/grpc-go]
Resolving cached github.com/coreos/etcd: commit='11214aa33bf5a47d3d9d8dafe0f6b97237dfe921',
urls=[https://github.com/coreos/etcd.git, git@github.com:coreos/etcd.git]
Resolving cached github.com/coreos/etcd: commit='11214aa33bf5a47d3d9d8dafe0f6b97237dfe921',
urls=[https://github.com/coreos/etcd.git, git@github.com:coreos/etcd.git]

> Task :sdks:go:installDependencies

> Task :runners:direct-java:compileJava
Note: Some input files use or override a deprecated API.
Note: Recompile with -Xlint:deprecation for details.
Note: Some input files use unchecked or unsafe operations.
Note: Recompile with -Xlint:unchecked for details.

> Task :runners:direct-java:classes
> Task :runners:direct-java:shadowJar
> Task :sdks:go:buildLinuxAmd64
> Task :sdks:go:goBuild

> Task :sdks:java:container:resolveBuildDependencies
Resolving ./github.com/apache/beam/sdks/go@<https://builds.apache.org/job/beam_PostCommit_Java_ValidatesRunner_PortabilityApi_Dataflow_Java11/ws/src/sdks/go>

> Task :sdks:java:container:installDependencies

> Task :runners:google-cloud-dataflow-java:worker:compileJava
Note: Some input files use or override a deprecated API.
Note: Recompile with -Xlint:deprecation for details.
Note: Some input files use unchecked or unsafe operations.
Note: Recompile with -Xlint:unchecked for details.

> Task :runners:google-cloud-dataflow-java:worker:classes
> Task :sdks:java:container:buildLinuxAmd64
> Task :sdks:java:container:goBuild
> Task :sdks:java:container:dockerPrepare

> Task :sdks:java:io:google-cloud-platform:compileTestJava
Note: Some input files use or override a deprecated API.
Note: Recompile with -Xlint:deprecation for details.
Note: Some input files use unchecked or unsafe operations.
Note: Recompile with -Xlint:unchecked for details.

> Task :sdks:java:io:google-cloud-platform:testClasses
> Task :sdks:java:io:google-cloud-platform:testJar

> Task :sdks:java:container:docker
Sending build context to Docker daemon  129.4MB
Step 1/9 : FROM openjdk:11
11: Pulling from library/openjdk
Digest: sha256:4c95a73f4808fec0f9c9ddf24570bb0b6e3a2ea47d4e00af9d566654d44ea08c
Status: Downloaded newer image for openjdk:11
 ---> d29dd615eaf4
Step 2/9 : MAINTAINER "Apache Beam <dev@beam.apache.org>"
 ---> Running in 923f5942808f
Removing intermediate container 923f5942808f
 ---> 84c14355f448
Step 3/9 : ADD target/slf4j-api.jar /opt/apache/beam/jars/
 ---> 739ca0ee0445
Step 4/9 : ADD target/slf4j-jdk14.jar /opt/apache/beam/jars/
 ---> 3bbfd46e0698
Step 5/9 : ADD target/beam-sdks-java-harness.jar /opt/apache/beam/jars/

> Task :runners:google-cloud-dataflow-java:compileTestJava
Note: Some input files use or override a deprecated API.
Note: Recompile with -Xlint:deprecation for details.
Note: Some input files use unchecked or unsafe operations.
Note: Recompile with -Xlint:unchecked for details.

> Task :runners:google-cloud-dataflow-java:testClasses
> Task :runners:google-cloud-dataflow-java:testJar

> Task :sdks:java:container:docker
 ---> 6f6c63db267f
Step 6/9 : ADD target/beam-sdks-java-io-kafka.jar /opt/apache/beam/jars/
 ---> e78b263a328e
Step 7/9 : ADD target/kafka-clients.jar /opt/apache/beam/jars/
 ---> 08031feebade
Step 8/9 : ADD target/linux_amd64/boot /opt/apache/beam/

> Task :runners:google-cloud-dataflow-java:worker:shadowJar

> Task :sdks:java:container:docker
 ---> e2e634691a6e
Step 9/9 : ENTRYPOINT ["/opt/apache/beam/boot"]
 ---> Running in 4aed2850a590
Removing intermediate container 4aed2850a590
 ---> 43d4ef98aad1
Successfully built 43d4ef98aad1
Successfully tagged apache/beam_java_sdk:2.21.0.dev

> Task :runners:google-cloud-dataflow-java:buildAndPushDockerContainer
WARNING: `gcloud docker` will not be supported for Docker client versions above 18.03.

As an alternative, use `gcloud auth configure-docker` to configure `docker` to
use `gcloud` as a credential helper, then use `docker` as you would for non-GCR
registries, e.g. `docker pull gcr.io/project-id/my-image`. Add
`--verbosity=error` to silence this warning: `gcloud docker
--verbosity=error -- pull gcr.io/project-id/my-image`.

See: https://cloud.google.com/container-registry/docs/support/deprecation-notices#gcloud-docker

The push refers to repository [us.gcr.io/apache-beam-testing/java-postcommit-it/java]
896a3691f260: Preparing
cae058006e6e: Preparing
efcb4e41539c: Preparing
06987794cc9a: Preparing
6cb274a83b5c: Preparing
9584e2c1cdba: Preparing
4186db990701: Preparing
5b5fbf48ec75: Preparing
832f129ebea4: Preparing
6670e930ed33: Preparing
c7f27a4eb870: Preparing
e70dfb4c3a48: Preparing
1c76bd0dc325: Preparing
5b5fbf48ec75: Waiting
e70dfb4c3a48: Waiting
1c76bd0dc325: Waiting
832f129ebea4: Waiting
6670e930ed33: Waiting
c7f27a4eb870: Waiting
9584e2c1cdba: Waiting
4186db990701: Waiting
6cb274a83b5c: Pushed
efcb4e41539c: Pushed
cae058006e6e: Pushed
4186db990701: Layer already exists
5b5fbf48ec75: Layer already exists
6670e930ed33: Layer already exists
832f129ebea4: Layer already exists
c7f27a4eb870: Layer already exists
e70dfb4c3a48: Layer already exists
1c76bd0dc325: Layer already exists
9584e2c1cdba: Pushed
896a3691f260: Pushed
06987794cc9a: Pushed
20200307025305: digest: sha256:61e777c862032c0bfdd3a439a05ea251b6100c4e22dcdfefc67a804addf7d019
size: 3055

> Task :runners:google-cloud-dataflow-java:validatesRunnerFnApiWorkerTest

org.apache.beam.sdk.transforms.ParDoTest$TimerFamilyTests > testTimerWithMultipleTimerFamilyUnbounded
FAILED
    java.lang.RuntimeException at ParDoTest.java:4770

org.apache.beam.sdk.transforms.ParDoTest$TimerFamilyTests > testTimerWithMultipleTimerFamilyBounded
FAILED
    java.lang.RuntimeException at ParDoTest.java:4770

org.apache.beam.sdk.transforms.ParDoTest$TimerFamilyTests > testTimerFamilyAndTimerBounded
FAILED
    java.lang.RuntimeException at ParDoTest.java:4831

org.apache.beam.sdk.transforms.ParDoTest$TimerFamilyTests > testTimerFamilyAndTimerUnbounded
FAILED
    java.lang.RuntimeException at ParDoTest.java:4831

org.apache.beam.sdk.transforms.ParDoTest$TimerFamilyTests > testTimerFamilyEventTimeBounded
FAILED
    java.lang.RuntimeException at ParDoTest.java:4708

org.apache.beam.sdk.transforms.ParDoTest$TimerFamilyTests > testTimerFamilyEventTimeUnbounded
FAILED
    java.lang.RuntimeException at ParDoTest.java:4708

157 tests completed, 6 failed, 3 skipped

> Task :runners:google-cloud-dataflow-java:validatesRunnerFnApiWorkerTest FAILED

> Task :runners:google-cloud-dataflow-java:cleanUpDockerImages
Untagged: us.gcr.io/apache-beam-testing/java-postcommit-it/java:20200307025305
Untagged: us.gcr.io/apache-beam-testing/java-postcommit-it/java@sha256:61e777c862032c0bfdd3a439a05ea251b6100c4e22dcdfefc67a804addf7d019
Digests:
- us.gcr.io/apache-beam-testing/java-postcommit-it/java@sha256:61e777c862032c0bfdd3a439a05ea251b6100c4e22dcdfefc67a804addf7d019
  Associated tags:
 - 20200307025305
Tags:
- us.gcr.io/apache-beam-testing/java-postcommit-it/java:20200307025305
Deleted [us.gcr.io/apache-beam-testing/java-postcommit-it/java:20200307025305].
Deleted [us.gcr.io/apache-beam-testing/java-postcommit-it/java@sha256:61e777c862032c0bfdd3a439a05ea251b6100c4e22dcdfefc67a804addf7d019].

FAILURE: Build failed with an exception.

* What went wrong:
Execution failed for task ':runners:google-cloud-dataflow-java:validatesRunnerFnApiWorkerTest'.
> There were failing tests. See the report at: file://<https://builds.apache.org/job/beam_PostCommit_Java_ValidatesRunner_PortabilityApi_Dataflow_Java11/ws/src/runners/google-cloud-dataflow-java/build/reports/tests/validatesRunnerFnApiWorkerTest/index.html>

* Try:
Run with --stacktrace option to get the stack trace. Run with --info or --debug option to
get more log output. Run with --scan to get full insights.

* Get more help at https://help.gradle.org

Deprecated Gradle features were used in this build, making it incompatible with Gradle 6.0.
Use '--warning-mode all' to show the individual deprecation warnings.
See https://docs.gradle.org/5.2.1/userguide/command_line_interface.html#sec:command_line_warnings

BUILD FAILED in 2h 9m 17s
99 actionable tasks: 93 executed, 5 from cache, 1 up-to-date

Publishing build scan...
https://gradle.com/s/xcdrvk35wnva6

Build step 'Invoke Gradle script' changed build result to FAILURE
Build step 'Invoke Gradle script' marked build as failure

---------------------------------------------------------------------
To unsubscribe, e-mail: builds-unsubscribe@beam.apache.org
For additional commands, e-mail: builds-help@beam.apache.org


Mime
View raw message