beam-builds mailing list archives

Site index · List index
Message view « Date » · « Thread »
Top « Date » · « Thread »
From Apache Jenkins Server <jenk...@builds.apache.org>
Subject Build failed in Jenkins: beam_PostCommit_Java_ValidatesRunner_PortabilityApi_Dataflow_Java11 #382
Date Wed, 18 Mar 2020 02:25:51 GMT
See <https://builds.apache.org/job/beam_PostCommit_Java_ValidatesRunner_PortabilityApi_Dataflow_Java11/382/display/redirect?page=changes>

Changes:

[kcweaver] [BEAM-8866] Use unique temp dir for output of portable word count tests.


------------------------------------------
[...truncated 44.67 KB...]
> Task :sdks:java:io:kafka:compileJava
Note: Some input files use unchecked or unsafe operations.
Note: Recompile with -Xlint:unchecked for details.

> Task :sdks:java:io:kafka:classes
> Task :sdks:java:io:kafka:jar

> Task :sdks:go:resolveBuildDependencies
Resolving github.com/rcrowley/go-metrics: commit='8732c616f52954686704c8645fe1a9d59e9df7c1',
urls=[https://github.com/rcrowley/go-metrics.git, git@github.com:rcrowley/go-metrics.git]
Resolving github.com/cpuguy83/go-md2man: commit='dc9f53734905c233adfc09fd4f063dce63ce3daf',
urls=[https://github.com/cpuguy83/go-md2man.git, git@github.com:cpuguy83/go-md2man.git]
Resolving cached github.com/cpuguy83/go-md2man: commit='dc9f53734905c233adfc09fd4f063dce63ce3daf',
urls=[https://github.com/cpuguy83/go-md2man.git, git@github.com:cpuguy83/go-md2man.git]
Resolving cached github.com/coreos/etcd: commit='11214aa33bf5a47d3d9d8dafe0f6b97237dfe921',
urls=[https://github.com/coreos/etcd.git, git@github.com:coreos/etcd.git]
Resolving cached github.com/coreos/etcd: commit='11214aa33bf5a47d3d9d8dafe0f6b97237dfe921',
urls=[https://github.com/coreos/etcd.git, git@github.com:coreos/etcd.git]
Resolving github.com/spf13/afero: commit='bb8f1927f2a9d3ab41c9340aa034f6b803f4359c', urls=[https://github.com/spf13/afero.git,
git@github.com:spf13/afero.git]
Resolving github.com/spf13/cast: commit='acbeb36b902d72a7a4c18e8f3241075e7ab763e4', urls=[https://github.com/spf13/cast.git,
git@github.com:spf13/cast.git]
Resolving github.com/spf13/cobra: commit='93959269ad99e80983c9ba742a7e01203a4c0e4f', urls=[https://github.com/spf13/cobra.git,
git@github.com:spf13/cobra.git]
Resolving github.com/spf13/jwalterweatherman: commit='7c0cea34c8ece3fbeb2b27ab9b59511d360fb394',
urls=[https://github.com/spf13/jwalterweatherman.git, git@github.com:spf13/jwalterweatherman.git]
Resolving cached github.com/coreos/etcd: commit='11214aa33bf5a47d3d9d8dafe0f6b97237dfe921',
urls=[https://github.com/coreos/etcd.git, git@github.com:coreos/etcd.git]
Resolving github.com/spf13/viper: commit='aafc9e6bc7b7bb53ddaa75a5ef49a17d6e654be5', urls=[https://github.com/spf13/viper.git,
git@github.com:spf13/viper.git]
Resolving github.com/stathat/go: commit='74669b9f388d9d788c97399a0824adbfee78400e', urls=[https://github.com/stathat/go.git,
git@github.com:stathat/go.git]
Resolving cached github.com/coreos/etcd: commit='11214aa33bf5a47d3d9d8dafe0f6b97237dfe921',
urls=[https://github.com/coreos/etcd.git, git@github.com:coreos/etcd.git]
Resolving cached github.com/coreos/etcd: commit='11214aa33bf5a47d3d9d8dafe0f6b97237dfe921',
urls=[https://github.com/coreos/etcd.git, git@github.com:coreos/etcd.git]
Resolving cached github.com/coreos/etcd: commit='11214aa33bf5a47d3d9d8dafe0f6b97237dfe921',
urls=[https://github.com/coreos/etcd.git, git@github.com:coreos/etcd.git]
Resolving cached github.com/coreos/etcd: commit='11214aa33bf5a47d3d9d8dafe0f6b97237dfe921',
urls=[https://github.com/coreos/etcd.git, git@github.com:coreos/etcd.git]
Resolving github.com/xordataexchange/crypt: commit='b2862e3d0a775f18c7cfe02273500ae307b61218',
urls=[https://github.com/xordataexchange/crypt.git, git@github.com:xordataexchange/crypt.git]
Resolving go.opencensus.io: commit='aa2b39d1618ef56ba156f27cfcdae9042f68f0bc', urls=[https://github.com/census-instrumentation/opencensus-go]

> Task :sdks:java:testing:test-utils:compileTestJava
> Task :sdks:java:testing:test-utils:testClasses
> Task :sdks:java:testing:test-utils:testJar
> Task :sdks:java:harness:shadowJar

> Task :sdks:go:resolveBuildDependencies
Resolving golang.org/x/crypto: commit='d9133f5469342136e669e85192a26056b587f503', urls=[https://go.googlesource.com/crypto]

> Task :sdks:java:container:copyDockerfileDependencies

> Task :sdks:java:extensions:google-cloud-platform-core:compileTestJava
Note: Some input files use or override a deprecated API.
Note: Recompile with -Xlint:deprecation for details.

> Task :sdks:java:extensions:google-cloud-platform-core:testClasses
> Task :sdks:java:extensions:google-cloud-platform-core:testJar

> Task :sdks:go:resolveBuildDependencies
Resolving golang.org/x/debug: commit='95515998a8a4bd7448134b2cb5971dbeb12e0b77', urls=[https://go.googlesource.com/debug]

> Task :runners:java-fn-execution:compileJava FROM-CACHE
> Task :runners:java-fn-execution:classes UP-TO-DATE
> Task :runners:java-fn-execution:jar
> Task :runners:direct-java:compileJava FROM-CACHE
> Task :runners:direct-java:classes UP-TO-DATE
> Task :runners:direct-java:shadowJar

> Task :sdks:go:resolveBuildDependencies
Resolving golang.org/x/net: commit='2fb46b16b8dda405028c50f7c7f0f9dd1fa6bfb1', urls=[https://go.googlesource.com/net]
Resolving golang.org/x/oauth2: commit='a032972e28060ca4f5644acffae3dfc268cc09db', urls=[https://go.googlesource.com/oauth2]
Resolving golang.org/x/sync: commit='fd80eb99c8f653c847d294a001bdf2a3a6f768f5', urls=[https://go.googlesource.com/sync]

> Task :sdks:java:io:google-cloud-platform:compileJava
Note: Some input files use or override a deprecated API.
Note: Recompile with -Xlint:deprecation for details.
Note: Some input files use unchecked or unsafe operations.
Note: Recompile with -Xlint:unchecked for details.

> Task :sdks:java:io:google-cloud-platform:classes
> Task :sdks:java:io:google-cloud-platform:jar

> Task :sdks:go:resolveBuildDependencies
Resolving golang.org/x/sys: commit='37707fdb30a5b38865cfb95e5aab41707daec7fd', urls=[https://go.googlesource.com/sys]
Resolving cached github.com/coreos/etcd: commit='11214aa33bf5a47d3d9d8dafe0f6b97237dfe921',
urls=[https://github.com/coreos/etcd.git, git@github.com:coreos/etcd.git]
Resolving cached github.com/coreos/etcd: commit='11214aa33bf5a47d3d9d8dafe0f6b97237dfe921',
urls=[https://github.com/coreos/etcd.git, git@github.com:coreos/etcd.git]

> Task :runners:google-cloud-dataflow-java:compileJava
Note: Some input files use or override a deprecated API.
Note: Recompile with -Xlint:deprecation for details.
Note: Some input files use unchecked or unsafe operations.
Note: Recompile with -Xlint:unchecked for details.

> Task :runners:google-cloud-dataflow-java:classes
> Task :runners:google-cloud-dataflow-java:jar

> Task :sdks:java:io:google-cloud-platform:compileTestJava
Note: Some input files use or override a deprecated API.
Note: Recompile with -Xlint:deprecation for details.
Note: Some input files use unchecked or unsafe operations.
Note: Recompile with -Xlint:unchecked for details.

> Task :sdks:java:io:google-cloud-platform:testClasses
> Task :sdks:java:io:google-cloud-platform:testJar

> Task :runners:google-cloud-dataflow-java:compileTestJava
Note: Some input files use or override a deprecated API.
Note: Recompile with -Xlint:deprecation for details.
Note: Some input files use unchecked or unsafe operations.
Note: Recompile with -Xlint:unchecked for details.

> Task :runners:google-cloud-dataflow-java:testClasses
> Task :runners:google-cloud-dataflow-java:testJar

> Task :runners:google-cloud-dataflow-java:worker:compileJava
Note: Some input files use or override a deprecated API.
Note: Recompile with -Xlint:deprecation for details.
Note: Some input files use unchecked or unsafe operations.
Note: Recompile with -Xlint:unchecked for details.

> Task :runners:google-cloud-dataflow-java:worker:classes
> Task :runners:google-cloud-dataflow-java:worker:shadowJar

> Task :sdks:go:resolveBuildDependencies
Resolving google.golang.org/api: commit='386d4e5f4f92f86e6aec85985761bba4b938a2d5', urls=[https://code.googlesource.com/google-api-go-client]
Resolving google.golang.org/genproto: commit='2b5a72b8730b0b16380010cfe5286c42108d88e7', urls=[https://github.com/google/go-genproto]
Resolving google.golang.org/grpc: commit='7646b5360d049a7ca31e9133315db43456f39e2e', urls=[https://github.com/grpc/grpc-go]
Resolving cached github.com/coreos/etcd: commit='11214aa33bf5a47d3d9d8dafe0f6b97237dfe921',
urls=[https://github.com/coreos/etcd.git, git@github.com:coreos/etcd.git]
Resolving cached github.com/coreos/etcd: commit='11214aa33bf5a47d3d9d8dafe0f6b97237dfe921',
urls=[https://github.com/coreos/etcd.git, git@github.com:coreos/etcd.git]

> Task :sdks:go:installDependencies
> Task :sdks:go:buildLinuxAmd64
> Task :sdks:go:goBuild

> Task :sdks:java:container:resolveBuildDependencies
Resolving ./github.com/apache/beam/sdks/go@<https://builds.apache.org/job/beam_PostCommit_Java_ValidatesRunner_PortabilityApi_Dataflow_Java11/ws/src/sdks/go>

> Task :sdks:java:container:installDependencies
> Task :sdks:java:container:buildLinuxAmd64
> Task :sdks:java:container:goBuild
> Task :sdks:java:container:dockerPrepare
> Task :sdks:java:container:docker

> Task :runners:google-cloud-dataflow-java:buildAndPushDockerContainer
WARNING: `gcloud docker` will not be supported for Docker client versions above 18.03.

As an alternative, use `gcloud auth configure-docker` to configure `docker` to
use `gcloud` as a credential helper, then use `docker` as you would for non-GCR
registries, e.g. `docker pull gcr.io/project-id/my-image`. Add
`--verbosity=error` to silence this warning: `gcloud docker
--verbosity=error -- pull gcr.io/project-id/my-image`.

See: https://cloud.google.com/container-registry/docs/support/deprecation-notices#gcloud-docker

The push refers to repository [us.gcr.io/apache-beam-testing/java-postcommit-it/java]
ef8655b49084: Preparing
a334a5a643b3: Preparing
b7682511285b: Preparing
5c4166959f3e: Preparing
95fa8e7523ff: Preparing
09c8f13014c6: Preparing
4186db990701: Preparing
5b5fbf48ec75: Preparing
832f129ebea4: Preparing
6670e930ed33: Preparing
c7f27a4eb870: Preparing
e70dfb4c3a48: Preparing
1c76bd0dc325: Preparing
832f129ebea4: Waiting
5b5fbf48ec75: Waiting
6670e930ed33: Waiting
09c8f13014c6: Waiting
c7f27a4eb870: Waiting
4186db990701: Waiting
e70dfb4c3a48: Waiting
b7682511285b: Pushed
95fa8e7523ff: Pushed
a334a5a643b3: Pushed
4186db990701: Layer already exists
5b5fbf48ec75: Layer already exists
6670e930ed33: Layer already exists
832f129ebea4: Layer already exists
c7f27a4eb870: Layer already exists
e70dfb4c3a48: Layer already exists
1c76bd0dc325: Layer already exists
09c8f13014c6: Pushed
ef8655b49084: Pushed
5c4166959f3e: Pushed
20200318002321: digest: sha256:5005c29535da7a981a1562d1f2b0262b8f90cc9d12c133a75d134a24fb016bfa
size: 3055

> Task :runners:google-cloud-dataflow-java:validatesRunnerFnApiWorkerTest

org.apache.beam.sdk.transforms.ParDoTest$TimerFamilyTests > testTimerWithMultipleTimerFamilyUnbounded
FAILED
    java.lang.RuntimeException at ParDoTest.java:4770

org.apache.beam.sdk.transforms.ParDoTest$TimerFamilyTests > testTimerWithMultipleTimerFamilyBounded
FAILED
    java.lang.RuntimeException at ParDoTest.java:4770

org.apache.beam.sdk.transforms.ParDoTest$TimerFamilyTests > testTimerFamilyAndTimerBounded
FAILED
    java.lang.RuntimeException at ParDoTest.java:4831

org.apache.beam.sdk.transforms.ParDoTest$TimerFamilyTests > testTimerFamilyAndTimerUnbounded
FAILED
    java.lang.RuntimeException at ParDoTest.java:4831

org.apache.beam.sdk.transforms.ParDoTest$TimerFamilyTests > testTimerFamilyEventTimeBounded
FAILED
    java.lang.RuntimeException at ParDoTest.java:4708

org.apache.beam.sdk.transforms.ParDoTest$TimerFamilyTests > testTimerFamilyEventTimeUnbounded
FAILED
    java.lang.RuntimeException at ParDoTest.java:4708

157 tests completed, 6 failed, 3 skipped

> Task :runners:google-cloud-dataflow-java:validatesRunnerFnApiWorkerTest FAILED

> Task :runners:google-cloud-dataflow-java:cleanUpDockerImages
Untagged: us.gcr.io/apache-beam-testing/java-postcommit-it/java:20200318002321
Untagged: us.gcr.io/apache-beam-testing/java-postcommit-it/java@sha256:5005c29535da7a981a1562d1f2b0262b8f90cc9d12c133a75d134a24fb016bfa
Deleted: sha256:43c5d007242dbb6535c947fdf966d8a0c6950888215e0256ba1cf5b10478c9b6
Deleted: sha256:cd60f53683c3da70f4c30ee28e4e1347044b6e38a29131dae09d5ba06088a7fd
Deleted: sha256:4659fc4f6068b689ced3d4629b9091e1c954c9d7eaa301edd12996ba9ad69f06
Deleted: sha256:c49c9a1863e597daf0c2e377b58c3777e30032ab8c5e747aebdf06e74d17564d
Deleted: sha256:be4fbd13778a605f888c421c49d1771b8560a649bdfdfdb0f236b5aa62f9a346
Deleted: sha256:f7690eccfffce6e21fbe8f482c9e762f90d4115be3f7a6544d00d4e05ee331a1
Deleted: sha256:1b8473e771a35ed125537aff4a0e739484d0d889e05735855e5d4c792442fe02
Deleted: sha256:e94395c22be2299ae24ff326d456d31d470f1c2d0ffd9aa862c1d8698f0ea4cd
Deleted: sha256:ef03dfa9d40e0375ff17b1825e72dade31ee4dc40f3f282ae5c7c81ba97dea06
Deleted: sha256:b212e5b554010a958a89452ca69795fb11122394be2d113bf3ca5a6e7c838798
Deleted: sha256:3514c0ab8a35a3502d58def774227b82de5a97b6435c14cf8375d1aa5ac399f6
Deleted: sha256:f84690de94d05212793a334fbb41ceb370666e2a2f7f7e79a7b7f2442f606a68
Deleted: sha256:4a33d9221266d4557110ed22874e6e46a925eaf31938cf66eb188a4cf14c0aff
Deleted: sha256:a641af52865904e9d0fa3ce5530636c328a29570f6633bacfd0b9bf402a8723a
Digests:
- us.gcr.io/apache-beam-testing/java-postcommit-it/java@sha256:5005c29535da7a981a1562d1f2b0262b8f90cc9d12c133a75d134a24fb016bfa
  Associated tags:
 - 20200318002321
Tags:
- us.gcr.io/apache-beam-testing/java-postcommit-it/java:20200318002321
Deleted [us.gcr.io/apache-beam-testing/java-postcommit-it/java:20200318002321].
Deleted [us.gcr.io/apache-beam-testing/java-postcommit-it/java@sha256:5005c29535da7a981a1562d1f2b0262b8f90cc9d12c133a75d134a24fb016bfa].

FAILURE: Build failed with an exception.

* What went wrong:
Execution failed for task ':runners:google-cloud-dataflow-java:validatesRunnerFnApiWorkerTest'.
> There were failing tests. See the report at: file://<https://builds.apache.org/job/beam_PostCommit_Java_ValidatesRunner_PortabilityApi_Dataflow_Java11/ws/src/runners/google-cloud-dataflow-java/build/reports/tests/validatesRunnerFnApiWorkerTest/index.html>

* Try:
Run with --stacktrace option to get the stack trace. Run with --info or --debug option to
get more log output. Run with --scan to get full insights.

* Get more help at https://help.gradle.org

Deprecated Gradle features were used in this build, making it incompatible with Gradle 6.0.
Use '--warning-mode all' to show the individual deprecation warnings.
See https://docs.gradle.org/5.2.1/userguide/command_line_interface.html#sec:command_line_warnings

BUILD FAILED in 2h 2m 44s
99 actionable tasks: 82 executed, 16 from cache, 1 up-to-date

Publishing build scan...
https://gradle.com/s/jwvih7ijwxi32

Build step 'Invoke Gradle script' changed build result to FAILURE
Build step 'Invoke Gradle script' marked build as failure

---------------------------------------------------------------------
To unsubscribe, e-mail: builds-unsubscribe@beam.apache.org
For additional commands, e-mail: builds-help@beam.apache.org


Mime
View raw message