beam-builds mailing list archives

Site index · List index
Message view « Date » · « Thread »
Top « Date » · « Thread »
From Apache Jenkins Server <jenk...@builds.apache.org>
Subject Build failed in Jenkins: beam_PostCommit_Java_PortabilityApi #4481
Date Tue, 24 Mar 2020 21:57:27 GMT
See <https://builds.apache.org/job/beam_PostCommit_Java_PortabilityApi/4481/display/redirect?page=changes>

Changes:

[github] Merge pull request #11163 from [BEAM-9548] Add better error handling to


------------------------------------------
[...truncated 38.42 KB...]
> Task :sdks:java:extensions:protobuf:generateProto NO-SOURCE
> Task :sdks:java:io:common:compileTestJava FROM-CACHE
> Task :sdks:java:io:common:testClasses UP-TO-DATE
> Task :sdks:java:io:common:testJar
> Task :runners:local-java:compileJava FROM-CACHE
> Task :runners:local-java:classes UP-TO-DATE
> Task :runners:local-java:jar
> Task :vendor:sdks-java-extensions-protobuf:compileJava FROM-CACHE
> Task :vendor:sdks-java-extensions-protobuf:classes UP-TO-DATE
> Task :sdks:java:extensions:google-cloud-platform-core:compileJava FROM-CACHE
> Task :sdks:java:extensions:google-cloud-platform-core:classes UP-TO-DATE
> Task :runners:core-construction-java:compileJava FROM-CACHE
> Task :runners:core-construction-java:classes UP-TO-DATE
> Task :sdks:java:extensions:google-cloud-platform-core:jar
> Task :sdks:java:fn-execution:compileJava FROM-CACHE
> Task :sdks:java:fn-execution:classes UP-TO-DATE
> Task :sdks:java:fn-execution:jar
> Task :sdks:java:testing:test-utils:compileJava FROM-CACHE
> Task :sdks:java:testing:test-utils:classes UP-TO-DATE
> Task :sdks:java:testing:test-utils:jar
> Task :sdks:java:testing:test-utils:compileTestJava FROM-CACHE
> Task :sdks:java:testing:test-utils:testClasses UP-TO-DATE
> Task :sdks:java:testing:test-utils:testJar
> Task :vendor:sdks-java-extensions-protobuf:shadowJar
> Task :runners:core-construction-java:jar
> Task :sdks:java:expansion-service:compileJava FROM-CACHE
> Task :sdks:java:expansion-service:classes UP-TO-DATE
> Task :sdks:java:expansion-service:jar
> Task :sdks:java:extensions:protobuf:compileJava FROM-CACHE
> Task :sdks:java:extensions:protobuf:classes UP-TO-DATE
> Task :sdks:java:extensions:protobuf:jar
> Task :sdks:java:io:kafka:compileJava FROM-CACHE
> Task :sdks:java:io:kafka:classes UP-TO-DATE
> Task :runners:core-java:compileJava FROM-CACHE
> Task :runners:core-java:classes UP-TO-DATE
> Task :sdks:java:io:kafka:jar
> Task :runners:core-java:jar
> Task :sdks:java:io:google-cloud-platform:compileJava FROM-CACHE
> Task :sdks:java:io:google-cloud-platform:classes UP-TO-DATE
> Task :sdks:java:harness:compileJava FROM-CACHE
> Task :sdks:java:harness:classes UP-TO-DATE
> Task :sdks:java:io:google-cloud-platform:jar
> Task :sdks:java:core:compileTestJava FROM-CACHE
> Task :sdks:java:core:testClasses
> Task :examples:java:compileJava FROM-CACHE
> Task :examples:java:classes UP-TO-DATE
> Task :runners:google-cloud-dataflow-java:compileJava FROM-CACHE
> Task :runners:google-cloud-dataflow-java:classes
> Task :examples:java:jar
> Task :runners:google-cloud-dataflow-java:jar
> Task :examples:java:compileTestJava FROM-CACHE
> Task :examples:java:testClasses
> Task :examples:java:testJar

> Task :sdks:go:resolveBuildDependencies
Resolving golang.org/x/net: commit='2fb46b16b8dda405028c50f7c7f0f9dd1fa6bfb1', urls=[https://go.googlesource.com/net]
Resolving golang.org/x/oauth2: commit='a032972e28060ca4f5644acffae3dfc268cc09db', urls=[https://go.googlesource.com/oauth2]
Resolving golang.org/x/sync: commit='fd80eb99c8f653c847d294a001bdf2a3a6f768f5', urls=[https://go.googlesource.com/sync]

> Task :sdks:java:core:shadowTestJar

> Task :sdks:go:resolveBuildDependencies
Resolving golang.org/x/sys: commit='37707fdb30a5b38865cfb95e5aab41707daec7fd', urls=[https://go.googlesource.com/sys]
Resolving cached github.com/coreos/etcd: commit='11214aa33bf5a47d3d9d8dafe0f6b97237dfe921',
urls=[https://github.com/coreos/etcd.git, git@github.com:coreos/etcd.git]
Resolving cached github.com/coreos/etcd: commit='11214aa33bf5a47d3d9d8dafe0f6b97237dfe921',
urls=[https://github.com/coreos/etcd.git, git@github.com:coreos/etcd.git]

> Task :sdks:java:extensions:google-cloud-platform-core:compileTestJava FROM-CACHE
> Task :sdks:java:extensions:google-cloud-platform-core:testClasses UP-TO-DATE
> Task :sdks:java:extensions:google-cloud-platform-core:testJar
> Task :sdks:java:harness:shadowJar
> Task :sdks:java:harness:jar
> Task :sdks:java:container:copyDockerfileDependencies
> Task :runners:java-fn-execution:compileJava FROM-CACHE
> Task :runners:java-fn-execution:classes UP-TO-DATE
> Task :runners:java-fn-execution:jar
> Task :runners:direct-java:compileJava FROM-CACHE
> Task :runners:direct-java:classes UP-TO-DATE
> Task :runners:google-cloud-dataflow-java:worker:compileJava FROM-CACHE
> Task :runners:google-cloud-dataflow-java:worker:classes
> Task :runners:direct-java:shadowJar
> Task :sdks:java:io:google-cloud-platform:compileTestJava FROM-CACHE
> Task :sdks:java:io:google-cloud-platform:testClasses UP-TO-DATE
> Task :sdks:java:io:google-cloud-platform:testJar
> Task :runners:google-cloud-dataflow-java:worker:shadowJar

> Task :sdks:go:resolveBuildDependencies
Resolving google.golang.org/api: commit='386d4e5f4f92f86e6aec85985761bba4b938a2d5', urls=[https://code.googlesource.com/google-api-go-client]
Resolving google.golang.org/genproto: commit='2b5a72b8730b0b16380010cfe5286c42108d88e7', urls=[https://github.com/google/go-genproto]
Resolving google.golang.org/grpc: commit='7646b5360d049a7ca31e9133315db43456f39e2e', urls=[https://github.com/grpc/grpc-go]
Resolving cached github.com/coreos/etcd: commit='11214aa33bf5a47d3d9d8dafe0f6b97237dfe921',
urls=[https://github.com/coreos/etcd.git, git@github.com:coreos/etcd.git]
Resolving cached github.com/coreos/etcd: commit='11214aa33bf5a47d3d9d8dafe0f6b97237dfe921',
urls=[https://github.com/coreos/etcd.git, git@github.com:coreos/etcd.git]

> Task :sdks:go:installDependencies
> Task :sdks:go:buildLinuxAmd64
> Task :sdks:go:goBuild

> Task :sdks:java:container:resolveBuildDependencies
Resolving ./github.com/apache/beam/sdks/go@<https://builds.apache.org/job/beam_PostCommit_Java_PortabilityApi/ws/src/sdks/go>

> Task :sdks:java:container:installDependencies
> Task :sdks:java:container:buildLinuxAmd64
> Task :sdks:java:container:goBuild
> Task :sdks:java:container:dockerPrepare
> Task :sdks:java:container:docker

> Task :runners:google-cloud-dataflow-java:buildAndPushDockerContainer
WARNING: `gcloud docker` will not be supported for Docker client versions above 18.03.

As an alternative, use `gcloud auth configure-docker` to configure `docker` to
use `gcloud` as a credential helper, then use `docker` as you would for non-GCR
registries, e.g. `docker pull gcr.io/project-id/my-image`. Add
`--verbosity=error` to silence this warning: `gcloud docker
--verbosity=error -- pull gcr.io/project-id/my-image`.

See: https://cloud.google.com/container-registry/docs/support/deprecation-notices#gcloud-docker

The push refers to repository [us.gcr.io/apache-beam-testing/java-postcommit-it/java]
42d6bbf345d4: Preparing
e6d9103120b6: Preparing
7480cbc65700: Preparing
e3379306fed3: Preparing
f53bad2c7236: Preparing
ea025842fc2e: Preparing
c4ed97d518c9: Preparing
f84d3ffae0bf: Preparing
ac3e2c206c49: Preparing
3663b7fed4c9: Preparing
832f129ebea4: Preparing
6670e930ed33: Preparing
c7f27a4eb870: Preparing
e70dfb4c3a48: Preparing
1c76bd0dc325: Preparing
f84d3ffae0bf: Waiting
ac3e2c206c49: Waiting
c7f27a4eb870: Waiting
ea025842fc2e: Waiting
e70dfb4c3a48: Waiting
c4ed97d518c9: Waiting
1c76bd0dc325: Waiting
3663b7fed4c9: Waiting
832f129ebea4: Waiting
6670e930ed33: Waiting
42d6bbf345d4: Pushed
f53bad2c7236: Pushed
e6d9103120b6: Pushed
e3379306fed3: Pushed
ac3e2c206c49: Layer already exists
3663b7fed4c9: Layer already exists
832f129ebea4: Layer already exists
6670e930ed33: Layer already exists
c7f27a4eb870: Layer already exists
e70dfb4c3a48: Layer already exists
1c76bd0dc325: Layer already exists
c4ed97d518c9: Pushed
f84d3ffae0bf: Pushed
7480cbc65700: Pushed
ea025842fc2e: Pushed
20200324211621: digest: sha256:2cf8ac1fb9c2cd8c1593c1ea6027e0b28aab05c0b875e48e65a9b42dfe8e7576
size: 3470

> Task :runners:google-cloud-dataflow-java:coreSDKJavaFnApiWorkerIntegrationTest NO-SOURCE
> Task :runners:google-cloud-dataflow-java:examplesJavaFnApiWorkerIntegrationTest

org.apache.beam.examples.cookbook.BigQueryTornadoesIT > testE2EBigQueryTornadoesWithExport
FAILED
    java.lang.RuntimeException at BigQueryTornadoesIT.java:68

org.apache.beam.examples.cookbook.BigQueryTornadoesIT > testE2eBigQueryTornadoesWithStorageApi
FAILED
    java.lang.RuntimeException at BigQueryTornadoesIT.java:68

2 tests completed, 2 failed

> Task :runners:google-cloud-dataflow-java:examplesJavaFnApiWorkerIntegrationTest FAILED
> Task :runners:google-cloud-dataflow-java:googleCloudPlatformFnApiWorkerIntegrationTest

org.apache.beam.sdk.io.gcp.bigquery.BigQueryTimePartitioningClusteringIT > testE2EBigQueryClusteringTableFunction
FAILED
    java.lang.RuntimeException at BigQueryTimePartitioningClusteringIT.java:199

org.apache.beam.sdk.io.gcp.bigquery.BigQueryToTableIT > testNewTypesQueryWithReshuffle
FAILED
    java.lang.RuntimeException at BigQueryToTableIT.java:118

org.apache.beam.sdk.io.gcp.bigquery.BigQueryTimePartitioningClusteringIT > testE2EBigQueryClusteringDynamicDestinations
FAILED
    java.lang.RuntimeException at BigQueryTimePartitioningClusteringIT.java:222

org.apache.beam.sdk.io.gcp.bigquery.BigQueryToTableIT > testLegacyQueryWithoutReshuffle
FAILED
    java.lang.RuntimeException at BigQueryToTableIT.java:118

org.apache.beam.sdk.io.gcp.bigquery.BigQueryTimePartitioningClusteringIT > testE2EBigQueryTimePartitioning
FAILED
    java.lang.RuntimeException at BigQueryTimePartitioningClusteringIT.java:145

org.apache.beam.sdk.io.gcp.bigquery.BigQueryToTableIT > testNewTypesQueryWithoutReshuffle
FAILED
    java.lang.RuntimeException at BigQueryToTableIT.java:118

org.apache.beam.sdk.io.gcp.bigquery.BigQueryTimePartitioningClusteringIT > testE2EBigQueryClustering
FAILED
    java.lang.RuntimeException at BigQueryTimePartitioningClusteringIT.java:170

org.apache.beam.sdk.io.gcp.bigquery.BigQueryToTableIT > testStandardQueryWithoutCustom
FAILED
    java.lang.RuntimeException at BigQueryToTableIT.java:118

13 tests completed, 8 failed

> Task :runners:google-cloud-dataflow-java:googleCloudPlatformFnApiWorkerIntegrationTest
FAILED

> Task :runners:google-cloud-dataflow-java:cleanUpDockerImages
Untagged: us.gcr.io/apache-beam-testing/java-postcommit-it/java:20200324211621
Untagged: us.gcr.io/apache-beam-testing/java-postcommit-it/java@sha256:2cf8ac1fb9c2cd8c1593c1ea6027e0b28aab05c0b875e48e65a9b42dfe8e7576
Digests:
- us.gcr.io/apache-beam-testing/java-postcommit-it/java@sha256:2cf8ac1fb9c2cd8c1593c1ea6027e0b28aab05c0b875e48e65a9b42dfe8e7576
  Associated tags:
 - 20200324211621
Tags:
- us.gcr.io/apache-beam-testing/java-postcommit-it/java:20200324211621
Deleted [us.gcr.io/apache-beam-testing/java-postcommit-it/java:20200324211621].
Deleted [us.gcr.io/apache-beam-testing/java-postcommit-it/java@sha256:2cf8ac1fb9c2cd8c1593c1ea6027e0b28aab05c0b875e48e65a9b42dfe8e7576].

FAILURE: Build completed with 2 failures.

1: Task failed with an exception.
-----------
* What went wrong:
Execution failed for task ':runners:google-cloud-dataflow-java:examplesJavaFnApiWorkerIntegrationTest'.
> There were failing tests. See the report at: file://<https://builds.apache.org/job/beam_PostCommit_Java_PortabilityApi/ws/src/runners/google-cloud-dataflow-java/build/reports/tests/examplesJavaFnApiWorkerIntegrationTest/index.html>

* Try:
Run with --stacktrace option to get the stack trace. Run with --info or --debug option to
get more log output. Run with --scan to get full insights.
==============================================================================

2: Task failed with an exception.
-----------
* What went wrong:
Execution failed for task ':runners:google-cloud-dataflow-java:googleCloudPlatformFnApiWorkerIntegrationTest'.
> There were failing tests. See the report at: file://<https://builds.apache.org/job/beam_PostCommit_Java_PortabilityApi/ws/src/runners/google-cloud-dataflow-java/build/reports/tests/googleCloudPlatformFnApiWorkerIntegrationTest/index.html>

* Try:
Run with --stacktrace option to get the stack trace. Run with --info or --debug option to
get more log output. Run with --scan to get full insights.
==============================================================================

* Get more help at https://help.gradle.org

Deprecated Gradle features were used in this build, making it incompatible with Gradle 6.0.
Use '--warning-mode all' to show the individual deprecation warnings.
See https://docs.gradle.org/5.2.1/userguide/command_line_interface.html#sec:command_line_warnings

BUILD FAILED in 42m 29s
103 actionable tasks: 73 executed, 29 from cache, 1 up-to-date

Publishing build scan...
https://gradle.com/s/pzausxddfeo2s

Build step 'Invoke Gradle script' changed build result to FAILURE
Build step 'Invoke Gradle script' marked build as failure

---------------------------------------------------------------------
To unsubscribe, e-mail: builds-unsubscribe@beam.apache.org
For additional commands, e-mail: builds-help@beam.apache.org


Mime
View raw message