beam-builds mailing list archives

Site index · List index
Message view « Date » · « Thread »
Top « Date » · « Thread »
From Apache Jenkins Server <jenk...@builds.apache.org>
Subject Build failed in Jenkins: beam_PostCommit_Java_ValidatesRunner_Dataflow_Java11 #393
Date Wed, 18 Mar 2020 01:27:21 GMT
See <https://builds.apache.org/job/beam_PostCommit_Java_ValidatesRunner_Dataflow_Java11/393/display/redirect?page=changes>

Changes:

[kcweaver] [BEAM-8866] Use unique temp dir for output of portable word count tests.


------------------------------------------
[...truncated 1022.08 KB...]
[214.870s][warning][os,thread] Failed to start thread - pthread_create failed (EAGAIN) for
attributes: stacksize: 1024k, guardsize: 0k, detached.
[214.870s][warning][os,thread] Failed to start thread - pthread_create failed (EAGAIN) for
attributes: stacksize: 1024k, guardsize: 0k, detached.
[214.871s][warning][os,thread] Failed to start thread - pthread_create failed (EAGAIN) for
attributes: stacksize: 1024k, guardsize: 0k, detached.
[214.741s][warning][os,thread] Failed to start thread - pthread_create failed (EAGAIN) for
attributes: stacksize: 1024k, guardsize: 0k, detached.
[215.843s][warning][os,thread] Failed to start thread - pthread_create failed (EAGAIN) for
attributes: stacksize: 1024k, guardsize: 0k, detached.
[214.871s][warning][os,thread] Failed to start thread - pthread_create failed (EAGAIN) for
attributes: stacksize: 1024k, guardsize: 0k, detached.
[214.872s][warning][os,thread] Failed to start thread - pthread_create failed (EAGAIN) for
attributes: stacksize: 1024k, guardsize: 0k, detached.
[214.872s][warning][os,thread] Failed to start thread - pthread_create failed (EAGAIN) for
attributes: stacksize: 1024k, guardsize: 0k, detached.
[223.889s][warning][os,thread] Failed to start thread - pthread_create failed (EAGAIN) for
attributes: stacksize: 1024k, guardsize: 0k, detached.
[214.874s][warning][os,thread] Failed to start thread - pthread_create failed (EAGAIN) for
attributes: stacksize: 1024k, guardsize: 0k, detached.
[214.874s][warning][os,thread] Failed to start thread - pthread_create failed (EAGAIN) for
attributes: stacksize: 1024k, guardsize: 0k, detached.
[214.875s][warning][os,thread] Failed to start thread - pthread_create failed (EAGAIN) for
attributes: stacksize: 1024k, guardsize: 0k, detached.
[214.875s][warning][os,thread] Failed to start thread - pthread_create failed (EAGAIN) for
attributes: stacksize: 1024k, guardsize: 0k, detached.
[224.992s][warning][os,thread] Failed to start thread - pthread_create failed (EAGAIN) for
attributes: stacksize: 1024k, guardsize: 0k, detached.
[214.750s][warning][os,thread] Failed to start thread - pthread_create failed (EAGAIN) for
attributes: stacksize: 1024k, guardsize: 0k, detached.
[214.750s][warning][os,thread] Failed to start thread - pthread_create failed (EAGAIN) for
attributes: stacksize: 1024k, guardsize: 0k, detached.
[214.750s][warning][os,thread] Failed to start thread - pthread_create failed (EAGAIN) for
attributes: stacksize: 1024k, guardsize: 0k, detached.
[223.904s][warning][os,thread] Failed to start thread - pthread_create failed (EAGAIN) for
attributes: stacksize: 1024k, guardsize: 0k, detached.
[224.781s][warning][os,thread] Failed to start thread - pthread_create failed (EAGAIN) for
attributes: stacksize: 1024k, guardsize: 0k, detached.
[224.781s][warning][os,thread] Failed to start thread - pthread_create failed (EAGAIN) for
attributes: stacksize: 1024k, guardsize: 0k, detached.
[224.782s][warning][os,thread] Failed to start thread - pthread_create failed (EAGAIN) for
attributes: stacksize: 1024k, guardsize: 0k, detached.
[224.782s][warning][os,thread] Failed to start thread - pthread_create failed (EAGAIN) for
attributes: stacksize: 1024k, guardsize: 0k, detached.
[224.782s][warning][os,thread] Failed to start thread - pthread_create failed (EAGAIN) for
attributes: stacksize: 1024k, guardsize: 0k, detached.
[224.782s][warning][os,thread] Failed to start thread - pthread_create failed (EAGAIN) for
attributes: stacksize: 1024k, guardsize: 0k, detached.
[224.782s][warning][os,thread] Failed to start thread - pthread_create failed (EAGAIN) for
attributes: stacksize: 1024k, guardsize: 0k, detached.
[224.783s][warning][os,thread] Failed to start thread - pthread_create failed (EAGAIN) for
attributes: stacksize: 1024k, guardsize: 0k, detached.
[224.783s][warning][os,thread] Failed to start thread - pthread_create failed (EAGAIN) for
attributes: stacksize: 1024k, guardsize: 0k, detached.
[224.783s][warning][os,thread] Failed to start thread - pthread_create failed (EAGAIN) for
attributes: stacksize: 1024k, guardsize: 0k, detached.
[224.783s][warning][os,thread] Failed to start thread - pthread_create failed (EAGAIN) for
attributes: stacksize: 1024k, guardsize: 0k, detached.
[224.783s][warning][os,thread] Failed to start thread - pthread_create failed (EAGAIN) for
attributes: stacksize: 1024k, guardsize: 0k, detached.
[224.784s][warning][os,thread] Failed to start thread - pthread_create failed (EAGAIN) for
attributes: stacksize: 1024k, guardsize: 0k, detached.
[224.784s][warning][os,thread] Failed to start thread - pthread_create failed (EAGAIN) for
attributes: stacksize: 1024k, guardsize: 0k, detached.
[224.785s][warning][os,thread] Failed to start thread - pthread_create failed (EAGAIN) for
attributes: stacksize: 1024k, guardsize: 0k, detached.
[224.785s][warning][os,thread] Failed to start thread - pthread_create failed (EAGAIN) for
attributes: stacksize: 1024k, guardsize: 0k, detached.
[224.786s][warning][os,thread] Failed to start thread - pthread_create failed (EAGAIN) for
attributes: stacksize: 1024k, guardsize: 0k, detached.
[225.012s][warning][os,thread] Failed to start thread - pthread_create failed (EAGAIN) for
attributes: stacksize: 1024k, guardsize: 0k, detached.
[223.912s][warning][os,thread] Failed to start thread - pthread_create failed (EAGAIN) for
attributes: stacksize: 1024k, guardsize: 0k, detached.
[223.913s][warning][os,thread] Failed to start thread - pthread_create failed (EAGAIN) for
attributes: stacksize: 1024k, guardsize: 0k, detached.
[224.813s][warning][os,thread] Failed to start thread - pthread_create failed (EAGAIN) for
attributes: stacksize: 1024k, guardsize: 0k, detached.
[225.039s][warning][os,thread] Failed to start thread - pthread_create failed (EAGAIN) for
attributes: stacksize: 1024k, guardsize: 0k, detached.
[224.814s][warning][os,thread] Failed to start thread - pthread_create failed (EAGAIN) for
attributes: stacksize: 1024k, guardsize: 0k, detached.
[224.815s][warning][os,thread] Failed to start thread - pthread_create failed (EAGAIN) for
attributes: stacksize: 1024k, guardsize: 0k, detached.
[225.039s][warning][os,thread] Failed to start thread - pthread_create failed (EAGAIN) for
attributes: stacksize: 1024k, guardsize: 0k, detached.
[225.040s][warning][os,thread] Failed to start thread - pthread_create failed (EAGAIN) for
attributes: stacksize: 1024k, guardsize: 0k, detached.
[224.815s][warning][os,thread] Failed to start thread - pthread_create failed (EAGAIN) for
attributes: stacksize: 1024k, guardsize: 0k, detached.
[224.816s][warning][os,thread] Failed to start thread - pthread_create failed (EAGAIN) for
attributes: stacksize: 1024k, guardsize: 0k, detached.
[225.041s][warning][os,thread] Failed to start thread - pthread_create failed (EAGAIN) for
attributes: stacksize: 1024k, guardsize: 0k, detached.
[224.817s][warning][os,thread] Failed to start thread - pthread_create failed (EAGAIN) for
attributes: stacksize: 1024k, guardsize: 0k, detached.
[224.817s][warning][os,thread] Failed to start thread - pthread_create failed (EAGAIN) for
attributes: stacksize: 1024k, guardsize: 0k, detached.
[224.818s][warning][os,thread] Failed to start thread - pthread_create failed (EAGAIN) for
attributes: stacksize: 1024k, guardsize: 0k, detached.
[224.834s][warning][os,thread] Failed to start thread - pthread_create failed (EAGAIN) for
attributes: stacksize: 1024k, guardsize: 0k, detached.
[225.060s][warning][os,thread] Failed to start thread - pthread_create failed (EAGAIN) for
attributes: stacksize: 1024k, guardsize: 0k, detached.
[224.836s][warning][os,thread] Failed to start thread - pthread_create failed (EAGAIN) for
attributes: stacksize: 1024k, guardsize: 0k, detached.
[225.061s][warning][os,thread] Failed to start thread - pthread_create failed (EAGAIN) for
attributes: stacksize: 1024k, guardsize: 0k, detached.
[215.916s][warning][os,thread] Failed to start thread - pthread_create failed (EAGAIN) for
attributes: stacksize: 1024k, guardsize: 0k, detached.
[215.916s][warning][os,thread] Failed to start thread - pthread_create failed (EAGAIN) for
attributes: stacksize: 1024k, guardsize: 0k, detached.
[214.848s][warning][os,thread] Failed to start thread - pthread_create failed (EAGAIN) for
attributes: stacksize: 1024k, guardsize: 0k, detached.
[214.848s][warning][os,thread] Failed to start thread - pthread_create failed (EAGAIN) for
attributes: stacksize: 1024k, guardsize: 0k, detached.
[215.952s][warning][os,thread] Failed to start thread - pthread_create failed (EAGAIN) for
attributes: stacksize: 1024k, guardsize: 0k, detached.
[215.952s][warning][os,thread] Failed to start thread - pthread_create failed (EAGAIN) for
attributes: stacksize: 1024k, guardsize: 0k, detached.
[214.850s][warning][os,thread] Failed to start thread - pthread_create failed (EAGAIN) for
attributes: stacksize: 1024k, guardsize: 0k, detached.
[214.850s][warning][os,thread] Failed to start thread - pthread_create failed (EAGAIN) for
attributes: stacksize: 1024k, guardsize: 0k, detached.
[223.996s][warning][os,thread] Failed to start thread - pthread_create failed (EAGAIN) for
attributes: stacksize: 1024k, guardsize: 0k, detached.
[223.996s][warning][os,thread] Failed to start thread - pthread_create failed (EAGAIN) for
attributes: stacksize: 1024k, guardsize: 0k, detached.
[214.981s][warning][os,thread] Failed to start thread - pthread_create failed (EAGAIN) for
attributes: stacksize: 1024k, guardsize: 0k, detached.
[225.097s][warning][os,thread] Failed to start thread - pthread_create failed (EAGAIN) for
attributes: stacksize: 1024k, guardsize: 0k, detached.
[225.098s][warning][os,thread] Failed to start thread - pthread_create failed (EAGAIN) for
attributes: stacksize: 1024k, guardsize: 0k, detached.
[223.998s][warning][os,thread] Failed to start thread - pthread_create failed (EAGAIN) for
attributes: stacksize: 1024k, guardsize: 0k, detached.
[223.998s][warning][os,thread] Failed to start thread - pthread_create failed (EAGAIN) for
attributes: stacksize: 1024k, guardsize: 0k, detached.
[225.102s][warning][os,thread] Failed to start thread - pthread_create failed (EAGAIN) for
attributes: stacksize: 1024k, guardsize: 0k, detached.

org.apache.beam.sdk.testing.PAssertTest > testGlobalWindowContainsInAnyOrder FAILED
    java.lang.OutOfMemoryError at PAssertTest.java:406
[224.899s][warning][os,thread] Failed to start thread - pthread_create failed (EAGAIN) for
attributes: stacksize: 1024k, guardsize: 0k, detached.
[224.899s][warning][os,thread] Failed to start thread - pthread_create failed (EAGAIN) for
attributes: stacksize: 1024k, guardsize: 0k, detached.
[215.979s][warning][os,thread] Failed to start thread - pthread_create failed (EAGAIN) for
attributes: stacksize: 1024k, guardsize: 0k, detached.
[224.910s][warning][os,thread] Failed to start thread - pthread_create failed (EAGAIN) for
attributes: stacksize: 1024k, guardsize: 0k, detached.
[224.911s][warning][os,thread] Failed to start thread - pthread_create failed (EAGAIN) for
attributes: stacksize: 1024k, guardsize: 0k, detached.
[224.913s][warning][os,thread] Failed to start thread - pthread_create failed (EAGAIN) for
attributes: stacksize: 1024k, guardsize: 0k, detached.
[224.914s][warning][os,thread] Failed to start thread - pthread_create failed (EAGAIN) for
attributes: stacksize: 1024k, guardsize: 0k, detached.
[224.914s][warning][os,thread] Failed to start thread - pthread_create failed (EAGAIN) for
attributes: stacksize: 1024k, guardsize: 0k, detached.
[215.025s][warning][os,thread] Failed to start thread - pthread_create failed (EAGAIN) for
attributes: stacksize: 1024k, guardsize: 0k, detached.
[215.025s][warning][os,thread] Failed to start thread - pthread_create failed (EAGAIN) for
attributes: stacksize: 1024k, guardsize: 0k, detached.
[224.046s][warning][os,thread] Failed to start thread - pthread_create failed (EAGAIN) for
attributes: stacksize: 1024k, guardsize: 0k, detached.
[224.048s][warning][os,thread] Failed to start thread - pthread_create failed (EAGAIN) for
attributes: stacksize: 1024k, guardsize: 0k, detached.
[224.048s][warning][os,thread] Failed to start thread - pthread_create failed (EAGAIN) for
attributes: stacksize: 1024k, guardsize: 0k, detached.
[215.031s][warning][os,thread] Failed to start thread - pthread_create failed (EAGAIN) for
attributes: stacksize: 1024k, guardsize: 0k, detached.
[215.031s][warning][os,thread] Failed to start thread - pthread_create failed (EAGAIN) for
attributes: stacksize: 1024k, guardsize: 0k, detached.
[215.032s][warning][os,thread] Failed to start thread - pthread_create failed (EAGAIN) for
attributes: stacksize: 1024k, guardsize: 0k, detached.
[224.049s][warning][os,thread] Failed to start thread - pthread_create failed (EAGAIN) for
attributes: stacksize: 1024k, guardsize: 0k, detached.
[224.050s][warning][os,thread] Failed to start thread - pthread_create failed (EAGAIN) for
attributes: stacksize: 1024k, guardsize: 0k, detached.
[224.926s][warning][os,thread] Failed to start thread - pthread_create failed (EAGAIN) for
attributes: stacksize: 1024k, guardsize: 0k, detached.
[224.926s][warning][os,thread] Failed to start thread - pthread_create failed (EAGAIN) for
attributes: stacksize: 1024k, guardsize: 0k, detached.
[215.038s][warning][os,thread] Failed to start thread - pthread_create failed (EAGAIN) for
attributes: stacksize: 1024k, guardsize: 0k, detached.
[215.038s][warning][os,thread] Failed to start thread - pthread_create failed (EAGAIN) for
attributes: stacksize: 1024k, guardsize: 0k, detached.
[215.039s][warning][os,thread] Failed to start thread - pthread_create failed (EAGAIN) for
attributes: stacksize: 1024k, guardsize: 0k, detached.
[215.040s][warning][os,thread] Failed to start thread - pthread_create failed (EAGAIN) for
attributes: stacksize: 1024k, guardsize: 0k, detached.
[215.040s][warning][os,thread] Failed to start thread - pthread_create failed (EAGAIN) for
attributes: stacksize: 1024k, guardsize: 0k, detached.
[215.041s][warning][os,thread] Failed to start thread - pthread_create failed (EAGAIN) for
attributes: stacksize: 1024k, guardsize: 0k, detached.
[215.041s][warning][os,thread] Failed to start thread - pthread_create failed (EAGAIN) for
attributes: stacksize: 1024k, guardsize: 0k, detached.
[215.041s][warning][os,thread] Failed to start thread - pthread_create failed (EAGAIN) for
attributes: stacksize: 1024k, guardsize: 0k, detached.
[215.042s][warning][os,thread] Failed to start thread - pthread_create failed (EAGAIN) for
attributes: stacksize: 1024k, guardsize: 0k, detached.
[215.042s][warning][os,thread] Failed to start thread - pthread_create failed (EAGAIN) for
attributes: stacksize: 1024k, guardsize: 0k, detached.
[224.058s][warning][os,thread] Failed to start thread - pthread_create failed (EAGAIN) for
attributes: stacksize: 1024k, guardsize: 0k, detached.
[224.059s][warning][os,thread] Failed to start thread - pthread_create failed (EAGAIN) for
attributes: stacksize: 1024k, guardsize: 0k, detached.
[224.060s][warning][os,thread] Failed to start thread - pthread_create failed (EAGAIN) for
attributes: stacksize: 1024k, guardsize: 0k, detached.
[215.044s][warning][os,thread] Failed to start thread - pthread_create failed (EAGAIN) for
attributes: stacksize: 1024k, guardsize: 0k, detached.
[224.936s][warning][os,thread] Failed to start thread - pthread_create failed (EAGAIN) for
attributes: stacksize: 1024k, guardsize: 0k, detached.
[215.044s][warning][os,thread] Failed to start thread - pthread_create failed (EAGAIN) for
attributes: stacksize: 1024k, guardsize: 0k, detached.
[224.937s][warning][os,thread] Failed to start thread - pthread_create failed (EAGAIN) for
attributes: stacksize: 1024k, guardsize: 0k, detached.
[215.045s][warning][os,thread] Failed to start thread - pthread_create failed (EAGAIN) for
attributes: stacksize: 1024k, guardsize: 0k, detached.
[224.937s][warning][os,thread] Failed to start thread - pthread_create failed (EAGAIN) for
attributes: stacksize: 1024k, guardsize: 0k, detached.
[215.046s][warning][os,thread] Failed to start thread - pthread_create failed (EAGAIN) for
attributes: stacksize: 1024k, guardsize: 0k, detached.
[214.916s][warning][os,thread] Failed to start thread - pthread_create failed (EAGAIN) for
attributes: stacksize: 1024k, guardsize: 0k, detached.
[224.938s][warning][os,thread] Failed to start thread - pthread_create failed (EAGAIN) for
attributes: stacksize: 1024k, guardsize: 0k, detached.
[214.916s][warning][os,thread] Failed to start thread - pthread_create failed (EAGAIN) for
attributes: stacksize: 1024k, guardsize: 0k, detached.
[215.046s][warning][os,thread] Failed to start thread - pthread_create failed (EAGAIN) for
attributes: stacksize: 1024k, guardsize: 0k, detached.
[215.047s][warning][os,thread] Failed to start thread - pthread_create failed (EAGAIN) for
attributes: stacksize: 1024k, guardsize: 0k, detached.
[214.917s][warning][os,thread] Failed to start thread - pthread_create failed (EAGAIN) for
attributes: stacksize: 1024k, guardsize: 0k, detached.
[215.047s][warning][os,thread] Failed to start thread - pthread_create failed (EAGAIN) for
attributes: stacksize: 1024k, guardsize: 0k, detached.
[214.918s][warning][os,thread] Failed to start thread - pthread_create failed (EAGAIN) for
attributes: stacksize: 1024k, guardsize: 0k, detached.
[225.165s][warning][os,thread] Failed to start thread - pthread_create failed (EAGAIN) for
attributes: stacksize: 1024k, guardsize: 0k, detached.
[225.165s][warning][os,thread] Failed to start thread - pthread_create failed (EAGAIN) for
attributes: stacksize: 1024k, guardsize: 0k, detached.
[214.918s][warning][os,thread] Failed to start thread - pthread_create failed (EAGAIN) for
attributes: stacksize: 1024k, guardsize: 0k, detached.
[225.165s][warning][os,thread] Failed to start thread - pthread_create failed (EAGAIN) for
attributes: stacksize: 1024k, guardsize: 0k, detached.
[225.165s][warning][os,thread] Failed to start thread - pthread_create failed (EAGAIN) for
attributes: stacksize: 1024k, guardsize: 0k, detached.
[215.048s][warning][os,thread] Failed to start thread - pthread_create failed (EAGAIN) for
attributes: stacksize: 1024k, guardsize: 0k, detached.
[214.919s][warning][os,thread] Failed to start thread - pthread_create failed (EAGAIN) for
attributes: stacksize: 1024k, guardsize: 0k, detached.
[224.060s][warning][os,thread] Failed to start thread - pthread_create failed (EAGAIN) for
attributes: stacksize: 1024k, guardsize: 0k, detached.
[224.061s][warning][os,thread] Failed to start thread - pthread_create failed (EAGAIN) for
attributes: stacksize: 1024k, guardsize: 0k, detached.
[224.061s][warning][os,thread] Failed to start thread - pthread_create failed (EAGAIN) for
attributes: stacksize: 1024k, guardsize: 0k, detached.
[224.062s][warning][os,thread] Failed to start thread - pthread_create failed (EAGAIN) for
attributes: stacksize: 1024k, guardsize: 0k, detached.
[224.062s][warning][os,thread] Failed to start thread - pthread_create failed (EAGAIN) for
attributes: stacksize: 1024k, guardsize: 0k, detached.
[224.063s][warning][os,thread] Failed to start thread - pthread_create failed (EAGAIN) for
attributes: stacksize: 1024k, guardsize: 0k, detached.
[224.064s][warning][os,thread] Failed to start thread - pthread_create failed (EAGAIN) for
attributes: stacksize: 1024k, guardsize: 0k, detached.
[225.166s][warning][os,thread] Failed to start thread - pthread_create failed (EAGAIN) for
attributes: stacksize: 1024k, guardsize: 0k, detached.
[225.166s][warning][os,thread] Failed to start thread - pthread_create failed (EAGAIN) for
attributes: stacksize: 1024k, guardsize: 0k, detached.
[225.166s][warning][os,thread] Failed to start thread - pthread_create failed (EAGAIN) for
attributes: stacksize: 1024k, guardsize: 0k, detached.
[225.166s][warning][os,thread] Failed to start thread - pthread_create failed (EAGAIN) for
attributes: stacksize: 1024k, guardsize: 0k, detached.
[224.939s][warning][os,thread] Failed to start thread - pthread_create failed (EAGAIN) for
attributes: stacksize: 1024k, guardsize: 0k, detached.
[224.064s][warning][os,thread] Failed to start thread - pthread_create failed (EAGAIN) for
attributes: stacksize: 1024k, guardsize: 0k, detached.
[224.064s][warning][os,thread] Failed to start thread - pthread_create failed (EAGAIN) for
attributes: stacksize: 1024k, guardsize: 0k, detached.
[215.048s][warning][os,thread] Failed to start thread - pthread_create failed (EAGAIN) for
attributes: stacksize: 1024k, guardsize: 0k, detached.
[225.167s][warning][os,thread] Failed to start thread - pthread_create failed (EAGAIN) for
attributes: stacksize: 1024k, guardsize: 0k, detached.
[225.167s][warning][os,thread] Failed to start thread - pthread_create failed (EAGAIN) for
attributes: stacksize: 1024k, guardsize: 0k, detached.
[225.167s][warning][os,thread] Failed to start thread - pthread_create failed (EAGAIN) for
attributes: stacksize: 1024k, guardsize: 0k, detached.
[225.167s][warning][os,thread] Failed to start thread - pthread_create failed (EAGAIN) for
attributes: stacksize: 1024k, guardsize: 0k, detached.
[224.941s][warning][os,thread] Failed to start thread - pthread_create failed (EAGAIN) for
attributes: stacksize: 1024k, guardsize: 0k, detached.
[224.941s][warning][os,thread] Failed to start thread - pthread_create failed (EAGAIN) for
attributes: stacksize: 1024k, guardsize: 0k, detached.
[224.942s][warning][os,thread] Failed to start thread - pthread_create failed (EAGAIN) for
attributes: stacksize: 1024k, guardsize: 0k, detached.
[224.942s][warning][os,thread] Failed to start thread - pthread_create failed (EAGAIN) for
attributes: stacksize: 1024k, guardsize: 0k, detached.
[224.943s][warning][os,thread] Failed to start thread - pthread_create failed (EAGAIN) for
attributes: stacksize: 1024k, guardsize: 0k, detached.
[224.943s][warning][os,thread] Failed to start thread - pthread_create failed (EAGAIN) for
attributes: stacksize: 1024k, guardsize: 0k, detached.
[224.943s][warning][os,thread] Failed to start thread - pthread_create failed (EAGAIN) for
attributes: stacksize: 1024k, guardsize: 0k, detached.
[225.168s][warning][os,thread] Failed to start thread - pthread_create failed (EAGAIN) for
attributes: stacksize: 1024k, guardsize: 0k, detached.
[225.168s][warning][os,thread] Failed to start thread - pthread_create failed (EAGAIN) for
attributes: stacksize: 1024k, guardsize: 0k, detached.
[224.068s][warning][os,thread] Failed to start thread - pthread_create failed (EAGAIN) for
attributes: stacksize: 1024k, guardsize: 0k, detached.
[224.068s][warning][os,thread] Failed to start thread - pthread_create failed (EAGAIN) for
attributes: stacksize: 1024k, guardsize: 0k, detached.
[225.169s][warning][os,thread] Failed to start thread - pthread_create failed (EAGAIN) for
attributes: stacksize: 1024k, guardsize: 0k, detached.
[215.061s][warning][os,thread] Failed to start thread - pthread_create failed (EAGAIN) for
attributes: stacksize: 1024k, guardsize: 0k, detached.
[216.033s][warning][os,thread] Failed to start thread - pthread_create failed (EAGAIN) for
attributes: stacksize: 1024k, guardsize: 0k, detached.
[224.956s][warning][os,thread] Failed to start thread - pthread_create failed (EAGAIN) for
attributes: stacksize: 1024k, guardsize: 0k, detached.
[224.960s][warning][os,thread] Failed to start thread - pthread_create failed (EAGAIN) for
attributes: stacksize: 1024k, guardsize: 0k, detached.
[224.960s][warning][os,thread] Failed to start thread - pthread_create failed (EAGAIN) for
attributes: stacksize: 1024k, guardsize: 0k, detached.
[224.960s][warning][os,thread] Failed to start thread - pthread_create failed (EAGAIN) for
attributes: stacksize: 1024k, guardsize: 0k, detached.
[215.076s][warning][os,thread] Failed to start thread - pthread_create failed (EAGAIN) for
attributes: stacksize: 1024k, guardsize: 0k, detached.
[215.076s][warning][os,thread] Failed to start thread - pthread_create failed (EAGAIN) for
attributes: stacksize: 1024k, guardsize: 0k, detached.
[215.077s][warning][os,thread] Failed to start thread - pthread_create failed (EAGAIN) for
attributes: stacksize: 1024k, guardsize: 0k, detached.
[215.077s][warning][os,thread] Failed to start thread - pthread_create failed (EAGAIN) for
attributes: stacksize: 1024k, guardsize: 0k, detached.

org.apache.beam.sdk.transforms.FlattenTest > testFlattenMultiplePCollectionsHavingMultipleConsumers
FAILED
    java.lang.RuntimeException at FlattenTest.java:347
        Caused by: java.lang.OutOfMemoryError
[216.176s][warning][os,thread] Failed to start thread - pthread_create failed (EAGAIN) for
attributes: stacksize: 1024k, guardsize: 0k, detached.
[216.176s][warning][os,thread] Failed to start thread - pthread_create failed (EAGAIN) for
attributes: stacksize: 1024k, guardsize: 0k, detached.
[224.219s][warning][os,thread] Failed to start thread - pthread_create failed (EAGAIN) for
attributes: stacksize: 1024k, guardsize: 0k, detached.
[224.220s][warning][os,thread] Failed to start thread - pthread_create failed (EAGAIN) for
attributes: stacksize: 1024k, guardsize: 0k, detached.
[225.100s][warning][os,thread] Failed to start thread - pthread_create failed (EAGAIN) for
attributes: stacksize: 1024k, guardsize: 0k, detached.
[225.100s][warning][os,thread] Failed to start thread - pthread_create failed (EAGAIN) for
attributes: stacksize: 1024k, guardsize: 0k, detached.
[225.100s][warning][os,thread] Failed to start thread - pthread_create failed (EAGAIN) for
attributes: stacksize: 1024k, guardsize: 0k, detached.
[225.101s][warning][os,thread] Failed to start thread - pthread_create failed (EAGAIN) for
attributes: stacksize: 1024k, guardsize: 0k, detached.
[225.101s][warning][os,thread] Failed to start thread - pthread_create failed (EAGAIN) for
attributes: stacksize: 1024k, guardsize: 0k, detached.
[225.102s][warning][os,thread] Failed to start thread - pthread_create failed (EAGAIN) for
attributes: stacksize: 1024k, guardsize: 0k, detached.
[225.103s][warning][os,thread] Failed to start thread - pthread_create failed (EAGAIN) for
attributes: stacksize: 1024k, guardsize: 0k, detached.
[225.103s][warning][os,thread] Failed to start thread - pthread_create failed (EAGAIN) for
attributes: stacksize: 1024k, guardsize: 0k, detached.
[215.213s][warning][os,thread] Failed to start thread - pthread_create failed (EAGAIN) for
attributes: stacksize: 1024k, guardsize: 0k, detached.
[215.214s][warning][os,thread] Failed to start thread - pthread_create failed (EAGAIN) for
attributes: stacksize: 1024k, guardsize: 0k, detached.
[215.214s][warning][os,thread] Failed to start thread - pthread_create failed (EAGAIN) for
attributes: stacksize: 1024k, guardsize: 0k, detached.

org.apache.beam.sdk.transforms.ReshuffleTest > testReshufflePreservesTimestamps FAILED
    java.lang.RuntimeException at ReshuffleTest.java:148
        Caused by: java.lang.OutOfMemoryError

org.apache.beam.sdk.testing.PAssertTest > testEmptyFalseDefaultReasonString FAILED
    java.lang.AssertionError at PAssertTest.java:501
[215.190s][warning][os,thread] Failed to start thread - pthread_create failed (EAGAIN) for
attributes: stacksize: 1024k, guardsize: 0k, detached.
[215.192s][warning][os,thread] Failed to start thread - pthread_create failed (EAGAIN) for
attributes: stacksize: 1024k, guardsize: 0k, detached.
[216.294s][warning][os,thread] Failed to start thread - pthread_create failed (EAGAIN) for
attributes: stacksize: 1024k, guardsize: 0k, detached.
[215.193s][warning][os,thread] Failed to start thread - pthread_create failed (EAGAIN) for
attributes: stacksize: 1024k, guardsize: 0k, detached.
[215.193s][warning][os,thread] Failed to start thread - pthread_create failed (EAGAIN) for
attributes: stacksize: 1024k, guardsize: 0k, detached.
[215.194s][warning][os,thread] Failed to start thread - pthread_create failed (EAGAIN) for
attributes: stacksize: 1024k, guardsize: 0k, detached.

org.apache.beam.sdk.transforms.ParDoSchemaTest > testInferredSchemaPipeline FAILED
    java.lang.RuntimeException at ParDoSchemaTest.java:405
        Caused by: java.lang.OutOfMemoryError

org.apache.beam.sdk.transforms.CombineTest$WindowingTests > testSlidingWindowsCombineWithContext
FAILED
    java.lang.RuntimeException at CombineTest.java:1214
        Caused by: java.lang.OutOfMemoryError

org.apache.beam.sdk.transforms.ViewTest > testWindowedMultimapSideInputWithNonDeterministicKeyCoder
FAILED
    java.lang.RuntimeException at ViewTest.java:797
        Caused by: java.lang.OutOfMemoryError

org.apache.beam.sdk.transforms.CombineTest$BasicTests > testBinaryCombinePerKeyLambda FAILED
    java.lang.RuntimeException at CombineTest.java:925
        Caused by: java.lang.OutOfMemoryError

org.apache.beam.sdk.transforms.ParDoTest$StateTests > testRequiresTimeSortedInput FAILED
    java.lang.RuntimeException at ParDoTest.java:2621
        Caused by: java.lang.OutOfMemoryError

224 tests completed, 174 failed, 2 skipped

> Task :runners:google-cloud-dataflow-java:validatesRunnerLegacyWorkerTest FAILED

FAILURE: Build failed with an exception.

* What went wrong:
Execution failed for task ':runners:google-cloud-dataflow-java:validatesRunnerLegacyWorkerTest'.
> There were failing tests. See the report at: file://<https://builds.apache.org/job/beam_PostCommit_Java_ValidatesRunner_Dataflow_Java11/ws/src/runners/google-cloud-dataflow-java/build/reports/tests/validatesRunnerLegacyWorkerTest/index.html>

* Try:
Run with --stacktrace option to get the stack trace. Run with --info or --debug option to
get more log output. Run with --scan to get full insights.

* Get more help at https://help.gradle.org

Deprecated Gradle features were used in this build, making it incompatible with Gradle 6.0.
Use '--warning-mode all' to show the individual deprecation warnings.
See https://docs.gradle.org/5.2.1/userguide/command_line_interface.html#sec:command_line_warnings

BUILD FAILED in 1h 7m 29s
1 actionable task: 1 executed

Publishing build scan...
https://gradle.com/s/x5uj4fu6odlei

Build step 'Invoke Gradle script' changed build result to FAILURE
Build step 'Invoke Gradle script' marked build as failure

---------------------------------------------------------------------
To unsubscribe, e-mail: builds-unsubscribe@beam.apache.org
For additional commands, e-mail: builds-help@beam.apache.org


Mime
View raw message