beam-builds mailing list archives

Site index · List index
Message view « Date » · « Thread »
Top « Date » · « Thread »
From Apache Jenkins Server <jenk...@builds.apache.org>
Subject Build failed in Jenkins: beam_PostCommit_PortableJar_Flink #1557
Date Thu, 05 Mar 2020 09:59:09 GMT
See <https://builds.apache.org/job/beam_PostCommit_PortableJar_Flink/1557/display/redirect?page=changes>

Changes:

[github] Update lostluck's info on the Go SDK roadmap

[github] Switch contact email to apache.org.


------------------------------------------
[...truncated 93.21 KB...]
	at sun.reflect.NativeMethodAccessorImpl.invoke0(Native Method)
	at sun.reflect.NativeMethodAccessorImpl.invoke(NativeMethodAccessorImpl.java:62)
	at sun.reflect.DelegatingMethodAccessorImpl.invoke(DelegatingMethodAccessorImpl.java:43)
	at java.lang.reflect.Method.invoke(Method.java:498)
	at org.gradle.internal.dispatch.ReflectionDispatch.dispatch(ReflectionDispatch.java:35)
	at org.gradle.internal.dispatch.ReflectionDispatch.dispatch(ReflectionDispatch.java:24)
	at org.gradle.internal.event.DefaultListenerManager$ListenerDetails.dispatch(DefaultListenerManager.java:376)
	at org.gradle.internal.event.DefaultListenerManager$ListenerDetails.dispatch(DefaultListenerManager.java:358)
	at org.gradle.internal.event.AbstractBroadcastDispatch.dispatch(AbstractBroadcastDispatch.java:58)
	at org.gradle.internal.event.DefaultListenerManager$EventBroadcast$ListenerDispatch.dispatch(DefaultListenerManager.java:346)
	at org.gradle.internal.event.DefaultListenerManager$EventBroadcast.dispatch(DefaultListenerManager.java:157)
	at org.gradle.internal.event.DefaultListenerManager$EventBroadcast.dispatch(DefaultListenerManager.java:131)
	at org.gradle.internal.dispatch.ProxyDispatchAdapter$DispatchingInvocationHandler.invoke(ProxyDispatchAdapter.java:93)
	at com.sun.proxy.$Proxy1.onExpirationEvent(Unknown Source)
	at org.gradle.launcher.daemon.server.Daemon$DaemonExpirationPeriodicCheck.run(Daemon.java:271)
	at org.gradle.internal.concurrent.ExecutorPolicy$CatchAndRecordFailures.onExecute(ExecutorPolicy.java:63)
	at org.gradle.internal.concurrent.ManagedExecutorImpl$1.run(ManagedExecutorImpl.java:46)
	at java.util.concurrent.Executors$RunnableAdapter.call(Executors.java:511)
	at java.util.concurrent.FutureTask.runAndReset(FutureTask.java:308)
	at java.util.concurrent.ScheduledThreadPoolExecutor$ScheduledFutureTask.access$301(ScheduledThreadPoolExecutor.java:180)
	at java.util.concurrent.ScheduledThreadPoolExecutor$ScheduledFutureTask.run(ScheduledThreadPoolExecutor.java:294)
	at java.util.concurrent.ThreadPoolExecutor.runWorker(ThreadPoolExecutor.java:1149)
	at java.util.concurrent.ThreadPoolExecutor$Worker.run(ThreadPoolExecutor.java:624)
	at org.gradle.internal.concurrent.ThreadFactoryImpl$ManagedThreadRunnable.run(ThreadFactoryImpl.java:55)
	at java.lang.Thread.run(Thread.java:748)
Caused by: java.io.IOException: No space left on device
	at java.io.FileOutputStream.writeBytes(Native Method)
	at java.io.FileOutputStream.write(FileOutputStream.java:326)
	at java.io.BufferedOutputStream.flushBuffer(BufferedOutputStream.java:82)
	at java.io.BufferedOutputStream.flush(BufferedOutputStream.java:140)
	at java.io.DataOutputStream.flush(DataOutputStream.java:123)
	at java.io.FilterOutputStream.close(FilterOutputStream.java:158)
	at org.gradle.internal.serialize.OutputStreamBackedEncoder.close(OutputStreamBackedEncoder.java:62)
	at org.gradle.cache.internal.SimpleStateCache.serialize(SimpleStateCache.java:123)
	... 37 more
	Suppressed: java.io.IOException: No space left on device
		at java.io.FileOutputStream.writeBytes(Native Method)
		at java.io.FileOutputStream.write(FileOutputStream.java:326)
		at java.io.BufferedOutputStream.flushBuffer(BufferedOutputStream.java:82)
		at java.io.BufferedOutputStream.flush(BufferedOutputStream.java:140)
		at java.io.FilterOutputStream.close(FilterOutputStream.java:158)
		at java.io.FilterOutputStream.close(FilterOutputStream.java:159)
		... 39 more

> Task :sdks:go:resolveBuildDependencies FAILED
Resolving google.golang.org/api: commit='386d4e5f4f92f86e6aec85985761bba4b938a2d5', urls=[https://code.googlesource.com/google-api-go-client]
Exception in serializing dependency cache, skip.
Exception in serializing dependency cache, skip.
Failed to execute org.gradle.cache.internal.AsyncCacheAccessDecoratedCache$2@119aaacb.
org.gradle.api.UncheckedIOException: Could not add entry ':sdks:go:resolveBuildDependencies'
to cache executionHistory.bin (<https://builds.apache.org/job/beam_PostCommit_PortableJar_Flink/ws/src/.gradle/5.2.1/executionHistory/executionHistory.bin).>
	at org.gradle.cache.internal.btree.BTreePersistentIndexedCache.put(BTreePersistentIndexedCache.java:160)
	at org.gradle.cache.internal.DefaultMultiProcessSafePersistentIndexedCache$2.run(DefaultMultiProcessSafePersistentIndexedCache.java:72)
	at org.gradle.cache.internal.DefaultFileLockManager$DefaultFileLock.doWriteAction(DefaultFileLockManager.java:207)
	at org.gradle.cache.internal.DefaultFileLockManager$DefaultFileLock.writeFile(DefaultFileLockManager.java:197)
	at org.gradle.cache.internal.DefaultCacheAccess$UnitOfWorkFileAccess.writeFile(DefaultCacheAccess.java:412)
	at org.gradle.cache.internal.DefaultMultiProcessSafePersistentIndexedCache.put(DefaultMultiProcessSafePersistentIndexedCache.java:70)
	at org.gradle.cache.internal.AsyncCacheAccessDecoratedCache$2.run(AsyncCacheAccessDecoratedCache.java:64)
	at org.gradle.internal.concurrent.ExecutorPolicy$CatchAndRecordFailures.onExecute(ExecutorPolicy.java:63)
	at org.gradle.cache.internal.CacheAccessWorker$2.run(CacheAccessWorker.java:179)
	at org.gradle.internal.Factories$1.create(Factories.java:25)
	at org.gradle.cache.internal.DefaultCacheAccess.useCache(DefaultCacheAccess.java:223)
	at org.gradle.cache.internal.DefaultCacheAccess.useCache(DefaultCacheAccess.java:204)
	at org.gradle.cache.internal.CacheAccessWorker.flushOperations(CacheAccessWorker.java:174)
	at org.gradle.cache.internal.CacheAccessWorker.run(CacheAccessWorker.java:144)
	at org.gradle.internal.concurrent.ExecutorPolicy$CatchAndRecordFailures.onExecute(ExecutorPolicy.java:63)
	at org.gradle.internal.concurrent.ManagedExecutorImpl$1.run(ManagedExecutorImpl.java:46)
	at java.util.concurrent.ThreadPoolExecutor.runWorker(ThreadPoolExecutor.java:1149)
	at java.util.concurrent.ThreadPoolExecutor$Worker.run(ThreadPoolExecutor.java:624)
	at org.gradle.internal.concurrent.ThreadFactoryImpl$ManagedThreadRunnable.run(ThreadFactoryImpl.java:55)
	at java.lang.Thread.run(Thread.java:748)
Caused by: org.gradle.api.UncheckedIOException: java.io.IOException: No space left on device
	at org.gradle.cache.internal.btree.FileBackedBlockStore.write(FileBackedBlockStore.java:118)
	at org.gradle.cache.internal.btree.CachingBlockStore.flush(CachingBlockStore.java:60)
	at org.gradle.cache.internal.btree.FreeListBlockStore.flush(FreeListBlockStore.java:92)
	at org.gradle.cache.internal.btree.StateCheckBlockStore.flush(StateCheckBlockStore.java:76)
	at org.gradle.cache.internal.btree.BTreePersistentIndexedCache.put(BTreePersistentIndexedCache.java:158)
	... 19 more
Caused by: java.io.IOException: No space left on device
	at java.io.RandomAccessFile.writeBytes(Native Method)
	at java.io.RandomAccessFile.write(RandomAccessFile.java:525)
	at org.gradle.internal.io.RandomAccessFileOutputStream.write(RandomAccessFileOutputStream.java:46)
	at java.io.BufferedOutputStream.flushBuffer(BufferedOutputStream.java:82)
	at java.io.BufferedOutputStream.write(BufferedOutputStream.java:126)
	at com.google.common.io.CountingOutputStream.write(CountingOutputStream.java:53)
	at java.io.DataOutputStream.write(DataOutputStream.java:107)
	at org.gradle.internal.io.StreamByteBuffer$StreamByteBufferChunk.writeTo(StreamByteBuffer.java:356)
	at org.gradle.internal.io.StreamByteBuffer.writeTo(StreamByteBuffer.java:104)
	at org.gradle.cache.internal.btree.BTreePersistentIndexedCache$DataBlock.write(BTreePersistentIndexedCache.java:700)
	at org.gradle.cache.internal.btree.FileBackedBlockStore$BlockImpl.write(FileBackedBlockStore.java:192)
	at org.gradle.cache.internal.btree.FileBackedBlockStore.write(FileBackedBlockStore.java:114)
	... 23 more

> Task :sdks:go:installDependencies FAILED
> Task :sdks:python:container:installDependencies FAILED

FAILURE: Build completed with 5 failures.

1: Task failed with an exception.
-----------
* Where:
Build file '<https://builds.apache.org/job/beam_PostCommit_PortableJar_Flink/ws/src/sdks/python/build.gradle'>
line: 46

* What went wrong:
Execution failed for task ':sdks:python:sdist'.
> Process 'command 'sh'' finished with non-zero exit value 1

* Try:
Run with --stacktrace option to get the stack trace. Run with --info or --debug option to
get more log output. Run with --scan to get full insights.
==============================================================================

2: Task failed with an exception.
-----------
* What went wrong:
Execution failed for task ':runners:java-fn-execution:compileJava'.
> Could not resolve all dependencies for configuration ':runners:java-fn-execution:compileClasspath'.
   > java.io.IOException: No space left on device

* Try:
Run with --stacktrace option to get the stack trace. Run with --info or --debug option to
get more log output. Run with --scan to get full insights.
==============================================================================

3: Task failed with an exception.
-----------
* What went wrong:
Execution failed for task ':sdks:go:resolveBuildDependencies'.
> Exception in resolution, message is:
  Cannot resolve dependency:google.golang.org/genproto: commit='2b5a72b8730b0b16380010cfe5286c42108d88e7',
urls=[https://github.com/google/go-genproto]
  Resolution stack is:
  +- github.com/apache/beam/sdks/go


* Try:
Run with --stacktrace option to get the stack trace. Run with --info or --debug option to
get more log output. Run with --scan to get full insights.
==============================================================================

4: Task failed with an exception.
-----------
* What went wrong:
Execution failed for task ':sdks:go:installDependencies'.
> java.io.IOException: Unable to create directory <https://builds.apache.org/job/beam_PostCommit_PortableJar_Flink/ws/src/sdks/go/vendor>

* Try:
Run with --stacktrace option to get the stack trace. Run with --info or --debug option to
get more log output. Run with --scan to get full insights.
==============================================================================

5: Task failed with an exception.
-----------
* What went wrong:
Execution failed for task ':sdks:python:container:installDependencies'.
> java.io.IOException: Unable to create directory <https://builds.apache.org/job/beam_PostCommit_PortableJar_Flink/ws/src/sdks/python/container/vendor>

* Try:
Run with --stacktrace option to get the stack trace. Run with --info or --debug option to
get more log output. Run with --scan to get full insights.
==============================================================================

* Get more help at https://help.gradle.org

Deprecated Gradle features were used in this build, making it incompatible with Gradle 6.0.
Use '--warning-mode all' to show the individual deprecation warnings.
See https://docs.gradle.org/5.2.1/userguide/command_line_interface.html#sec:command_line_warnings

BUILD FAILED in 1m 36s
63 actionable tasks: 45 executed, 16 from cache, 2 up-to-date

A build scan cannot be produced as an error occurred spooling the build data.
Please report this problem via https://gradle.com/scans/help/plugin and include the following
via copy/paste:

----------
Gradle version: 5.2.1
Plugin version: 2.3

java.lang.IllegalStateException: java.io.IOException: No space left on device
	at com.gradle.scan.a.e.b.flush(SourceFile:233)
	at com.gradle.scan.a.e.b.close(SourceFile:244)
	at com.gradle.scan.a.e.c.close(SourceFile:66)
	at com.gradle.scan.plugin.internal.n.a(SourceFile:78)
	at com.gradle.scan.plugin.internal.e.c.c.b(SourceFile:125)
	at com.gradle.scan.plugin.internal.e.c.c.a(SourceFile:117)
	at com.gradle.scan.plugin.internal.o.a$a.a(SourceFile:30)
	at com.gradle.scan.plugin.internal.o.a$a.a(SourceFile:19)
	at com.gradle.scan.plugin.internal.o.a.c(SourceFile:60)
Caused by: java.io.IOException: No space left on device
	at com.gradle.scan.a.e.b.flush(SourceFile:231)
	... 8 more

----------

Could not stop Service ExecutionHistoryCacheAccess at ExecutionServices.createCacheAccess().
org.gradle.api.UncheckedIOException: Could not add entry ':sdks:java:harness:shadowJar' to
cache executionHistory.bin (<https://builds.apache.org/job/beam_PostCommit_PortableJar_Flink/ws/src/.gradle/5.2.1/executionHistory/executionHistory.bin).>
	at org.gradle.cache.internal.btree.BTreePersistentIndexedCache.put(BTreePersistentIndexedCache.java:160)
	at org.gradle.cache.internal.DefaultMultiProcessSafePersistentIndexedCache$2.run(DefaultMultiProcessSafePersistentIndexedCache.java:72)
	at org.gradle.cache.internal.DefaultFileLockManager$DefaultFileLock.doWriteAction(DefaultFileLockManager.java:207)
	at org.gradle.cache.internal.DefaultFileLockManager$DefaultFileLock.writeFile(DefaultFileLockManager.java:197)
	at org.gradle.cache.internal.DefaultCacheAccess$UnitOfWorkFileAccess.writeFile(DefaultCacheAccess.java:412)
	at org.gradle.cache.internal.DefaultMultiProcessSafePersistentIndexedCache.put(DefaultMultiProcessSafePersistentIndexedCache.java:70)
	at org.gradle.cache.internal.AsyncCacheAccessDecoratedCache$2.run(AsyncCacheAccessDecoratedCache.java:64)
	at org.gradle.internal.concurrent.ExecutorPolicy$CatchAndRecordFailures.onExecute(ExecutorPolicy.java:63)
	at org.gradle.cache.internal.CacheAccessWorker$2.run(CacheAccessWorker.java:179)
	at org.gradle.internal.Factories$1.create(Factories.java:25)
	at org.gradle.cache.internal.DefaultCacheAccess.useCache(DefaultCacheAccess.java:223)
	at org.gradle.cache.internal.DefaultCacheAccess.useCache(DefaultCacheAccess.java:204)
	at org.gradle.cache.internal.CacheAccessWorker.flushOperations(CacheAccessWorker.java:174)
	at org.gradle.cache.internal.CacheAccessWorker.run(CacheAccessWorker.java:144)
	at org.gradle.internal.concurrent.ExecutorPolicy$CatchAndRecordFailures.onExecute(ExecutorPolicy.java:63)
	at org.gradle.internal.concurrent.ManagedExecutorImpl$1.run(ManagedExecutorImpl.java:46)
	at java.util.concurrent.ThreadPoolExecutor.runWorker(ThreadPoolExecutor.java:1149)
	at java.util.concurrent.ThreadPoolExecutor$Worker.run(ThreadPoolExecutor.java:624)
	at org.gradle.internal.concurrent.ThreadFactoryImpl$ManagedThreadRunnable.run(ThreadFactoryImpl.java:55)
	at java.lang.Thread.run(Thread.java:748)
Caused by: org.gradle.api.UncheckedIOException: java.io.IOException: No space left on device
	at org.gradle.cache.internal.btree.FileBackedBlockStore.write(FileBackedBlockStore.java:118)
	at org.gradle.cache.internal.btree.CachingBlockStore.flush(CachingBlockStore.java:60)
	at org.gradle.cache.internal.btree.FreeListBlockStore.flush(FreeListBlockStore.java:92)
	at org.gradle.cache.internal.btree.StateCheckBlockStore.flush(StateCheckBlockStore.java:76)
	at org.gradle.cache.internal.btree.BTreePersistentIndexedCache.put(BTreePersistentIndexedCache.java:158)
	... 19 more
Caused by: java.io.IOException: No space left on device
	at java.io.RandomAccessFile.writeBytes(Native Method)
	at java.io.RandomAccessFile.write(RandomAccessFile.java:525)
	at org.gradle.internal.io.RandomAccessFileOutputStream.write(RandomAccessFileOutputStream.java:46)
	at java.io.BufferedOutputStream.flushBuffer(BufferedOutputStream.java:82)
	at java.io.BufferedOutputStream.write(BufferedOutputStream.java:126)
	at com.google.common.io.CountingOutputStream.write(CountingOutputStream.java:53)
	at java.io.DataOutputStream.write(DataOutputStream.java:107)
	at org.gradle.internal.io.StreamByteBuffer$StreamByteBufferChunk.writeTo(StreamByteBuffer.java:356)
	at org.gradle.internal.io.StreamByteBuffer.writeTo(StreamByteBuffer.java:104)
	at org.gradle.cache.internal.btree.BTreePersistentIndexedCache$DataBlock.write(BTreePersistentIndexedCache.java:700)
	at org.gradle.cache.internal.btree.FileBackedBlockStore$BlockImpl.write(FileBackedBlockStore.java:192)
	at org.gradle.cache.internal.btree.FileBackedBlockStore.write(FileBackedBlockStore.java:114)
	... 23 more

FAILURE: Build failed with an exception.

* What went wrong:
Could not add entry '<https://builds.apache.org/job/beam_PostCommit_PortableJar_Flink/ws/src/sdks/java/harness/build/libs/beam-sdks-java-harness-2.21.0-SNAPSHOT.jar'>
to cache outputFiles.bin (<https://builds.apache.org/job/beam_PostCommit_PortableJar_Flink/ws/src/.gradle/buildOutputCleanup/outputFiles.bin).>
> java.io.IOException: No space left on device

* Try:
Run with --stacktrace option to get the stack trace. Run with --info or --debug option to
get more log output. Run with --scan to get full insights.

* Get more help at https://help.gradle.org

Deprecated Gradle features were used in this build, making it incompatible with Gradle 6.0.
Use '--warning-mode all' to show the individual deprecation warnings.
See https://docs.gradle.org/5.2.1/userguide/command_line_interface.html#sec:command_line_warnings

BUILD FAILED in 1m 37s
Build step 'Invoke Gradle script' changed build result to FAILURE
Build step 'Invoke Gradle script' marked build as failure

---------------------------------------------------------------------
To unsubscribe, e-mail: builds-unsubscribe@beam.apache.org
For additional commands, e-mail: builds-help@beam.apache.org


Mime
View raw message