beam-builds mailing list archives

Site index · List index
Message view « Date » · « Thread »
Top « Date » · « Thread »
From Apache Jenkins Server <>
Subject Build failed in Jenkins: beam_PostCommit_PortableJar_Spark #985
Date Wed, 25 Mar 2020 23:39:01 GMT
See <>


[daniel.o.programmer] [BEAM-3301] Fix another bug in DoFn validation, in exec.

[...truncated 63.02 KB...]
Docker version 18.09.4, build d14af54

# Verify container has already been built
docker images --format "{{.Repository}}:{{.Tag}}" | grep $PYTHON_CONTAINER_IMAGE

# Set up Python environment
virtualenv -p python$PYTHON_VERSION $ENV_DIR
Using base prefix '/usr'
New python executable in <>
Also creating executable in <>
Installing setuptools, pip, wheel...
Running virtualenv with interpreter /usr/bin/python3.7
. $ENV_DIR/bin/activate
# This file must be used with "source bin/activate" *from bash*
# you cannot run it directly

deactivate () {
    unset -f pydoc >/dev/null 2>&1

    # reset old environment variables
    # ! [ -z ${VAR+_} ] returns true if VAR is declared at all
    if ! [ -z "${_OLD_VIRTUAL_PATH+_}" ] ; then
        export PATH
        unset _OLD_VIRTUAL_PATH
    if ! [ -z "${_OLD_VIRTUAL_PYTHONHOME+_}" ] ; then
        export PYTHONHOME

    # This should detect bash and zsh, which have a hash command that must
    # be called to get it to forget past commands.  Without forgetting
    # past commands the $PATH changes we made may not be respected
    if [ -n "${BASH-}" ] || [ -n "${ZSH_VERSION-}" ] ; then
        hash -r 2>/dev/null

    if ! [ -z "${_OLD_VIRTUAL_PS1+_}" ] ; then
        export PS1
        unset _OLD_VIRTUAL_PS1

    unset VIRTUAL_ENV
    if [ ! "${1-}" = "nondestructive" ] ; then
    # Self destruct!
        unset -f deactivate

# unset irrelevant variables
deactivate nondestructive


export PATH

# unset PYTHONHOME if set
if ! [ -z "${PYTHONHOME+_}" ] ; then
    unset PYTHONHOME

if [ -z "${VIRTUAL_ENV_DISABLE_PROMPT-}" ] ; then
    if [ "x" != x ] ; then
        PS1="(`basename \"$VIRTUAL_ENV\"`) ${PS1-}"
    export PS1
basename "$VIRTUAL_ENV"

# Make sure to unalias pydoc if it's already there
alias pydoc 2>/dev/null >/dev/null && unalias pydoc || true

pydoc () {
    python -m pydoc "$@"

# This should detect bash and zsh, which have a hash command that must
# be called to get it to forget past commands.  Without forgetting
# past commands the $PATH changes we made may not be respected
if [ -n "${BASH-}" ] || [ -n "${ZSH_VERSION-}" ] ; then
    hash -r 2>/dev/null
pip install --retries 10 -e $PYTHON_ROOT_DIR
Obtaining file://<>
Processing /home/jenkins/.cache/pip/wheels/50/24/4d/4580ca4a299f1ad6fd63443e6e584cb21e9a07988e4aa8daac/crcmod-1.7-cp37-cp37m-linux_x86_64.whl
Processing /home/jenkins/.cache/pip/wheels/59/b1/91/f02e76c732915c4015ab4010f3015469866c1eb9b14058d8e7/dill-
Collecting fastavro<0.22,>=0.21.4
  Using cached fastavro-0.21.24-cp37-cp37m-manylinux1_x86_64.whl (1.2 MB)
Processing /home/jenkins/.cache/pip/wheels/8b/99/a0/81daf51dcd359a9377b110a8a886b3895921802d2fc1b2397e/future-0.18.2-cp37-none-any.whl
Collecting grpcio<2,>=1.12.1
  Using cached grpcio-1.27.2-cp37-cp37m-manylinux2010_x86_64.whl (2.7 MB)
Processing /home/jenkins/.cache/pip/wheels/fe/a7/05/23e3699975fc20f8a30e00ac1e515ab8c61168e982abe4ce70/hdfs-2.5.8-cp37-none-any.whl
Processing /home/jenkins/.cache/pip/wheels/6d/41/4b/2b369d6e2b7eaebcdd423516d3fb659c7658c16a2be8fd04ec/httplib2-0.12.0-cp37-none-any.whl
Collecting mock<3.0.0,>=1.0.1
  Using cached mock-2.0.0-py2.py3-none-any.whl (56 kB)
Collecting numpy<2,>=1.14.3
  Using cached numpy-1.18.2-cp37-cp37m-manylinux1_x86_64.whl (20.2 MB)
Collecting pymongo<4.0.0,>=3.8.0
  Using cached pymongo-3.10.1-cp37-cp37m-manylinux2014_x86_64.whl (462 kB)
Processing /home/jenkins/.cache/pip/wheels/48/f7/87/b932f09c6335dbcf45d916937105a372ab14f353a9ca431d7d/oauth2client-3.0.0-cp37-none-any.whl
Collecting protobuf<4,>=3.5.0.post1
  Using cached protobuf-3.11.3-cp37-cp37m-manylinux1_x86_64.whl (1.3 MB)
Collecting pydot<2,>=1.2.0
  Using cached pydot-1.4.1-py2.py3-none-any.whl (19 kB)
Collecting python-dateutil<3,>=2.8.0
  Using cached python_dateutil-2.8.1-py2.py3-none-any.whl (227 kB)
Collecting pytz>=2018.3
  Using cached pytz-2019.3-py2.py3-none-any.whl (509 kB)
Collecting typing-extensions<3.8.0,>=3.7.0
  Using cached typing_extensions- (20 kB)
Processing /home/jenkins/.cache/pip/wheels/bc/49/5f/fdb5b9d85055c478213e0158ac122b596816149a02d82e0ab1/avro_python3-
Collecting pyarrow<0.16.0,>=0.15.1
  Using cached pyarrow-0.15.1-cp37-cp37m-manylinux2010_x86_64.whl (59.2 MB)
Collecting six>=1.5.2
  Using cached six-1.14.0-py2.py3-none-any.whl (10 kB)
Processing /home/jenkins/.cache/pip/wheels/9b/04/dd/7daf4150b6d9b12949298737de9431a324d4b797ffd63f526e/docopt-0.6.2-py2.py3-none-any.whl
Collecting requests>=2.7.0
  Using cached requests-2.23.0-py2.py3-none-any.whl (58 kB)
Collecting pbr>=0.11
  Using cached pbr-5.4.4-py2.py3-none-any.whl (110 kB)
Collecting rsa>=3.1.4
  Using cached rsa-4.0-py2.py3-none-any.whl (38 kB)
Collecting pyasn1>=0.1.7
  Using cached pyasn1-0.4.8-py2.py3-none-any.whl (77 kB)
Collecting pyasn1-modules>=0.0.5
  Using cached pyasn1_modules-0.2.8-py2.py3-none-any.whl (155 kB)
Requirement already satisfied: setuptools in ./build/gradleenv/-2047437407/lib/python3.7/site-packages
(from protobuf<4,>=3.5.0.post1->apache-beam==2.21.0.dev0) (46.1.3)
Collecting pyparsing>=2.1.4
  Using cached pyparsing-2.4.6-py2.py3-none-any.whl (67 kB)
Collecting certifi>=2017.4.17
  Using cached certifi-2019.11.28-py2.py3-none-any.whl (156 kB)
Collecting urllib3!=1.25.0,!=1.25.1,<1.26,>=1.21.1
  Using cached urllib3-1.25.8-py2.py3-none-any.whl (125 kB)
Collecting chardet<4,>=3.0.2
  Using cached chardet-3.0.4-py2.py3-none-any.whl (133 kB)
Collecting idna<3,>=2.5
  Using cached idna-2.9-py2.py3-none-any.whl (58 kB)
Installing collected packages: crcmod, dill, fastavro, future, six, grpcio, docopt, certifi,
urllib3, chardet, idna, requests, hdfs, httplib2, pbr, mock, numpy, pymongo, pyasn1, rsa,
pyasn1-modules, oauth2client, protobuf, pyparsing, pydot, python-dateutil, pytz, typing-extensions,
avro-python3, pyarrow, apache-beam
  Running develop for apache-beam
Successfully installed apache-beam avro-python3- certifi-2019.11.28 chardet-3.0.4 crcmod-1.7
dill- docopt-0.6.2 fastavro-0.21.24 future-0.18.2 grpcio-1.27.2 hdfs-2.5.8 httplib2-0.12.0
idna-2.9 mock-2.0.0 numpy-1.18.2 oauth2client-3.0.0 pbr-5.4.4 protobuf-3.11.3 pyarrow-0.15.1
pyasn1-0.4.8 pyasn1-modules-0.2.8 pydot-1.4.1 pymongo-3.10.1 pyparsing-2.4.6 python-dateutil-2.8.1
pytz-2019.3 requests-2.23.0 rsa-4.0 six-1.14.0 typing-extensions- urllib3-1.25.8

import apache_beam as beam
from apache_beam.options.pipeline_options import PipelineOptions
from apache_beam.options.pipeline_options import SetupOptions
from apache_beam.testing.util import assert_that
from apache_beam.testing.util import equal_to
from apache_beam.transforms import Create
from apache_beam.transforms import Map

# To test that our main session is getting plumbed through artifact staging
# correctly, create a global variable. If the main session is not plumbed
# through properly, global_var will be undefined and the pipeline will fail.
global_var = 1

pipeline_options = PipelineOptions()
pipeline_options.view_as(SetupOptions).save_main_session = True
pipeline = beam.Pipeline(options=pipeline_options)
pcoll = (pipeline
         | Create([0, 1, 2])
         | Map(lambda x: x + global_var))
assert_that(pcoll, equal_to([1, 2, 3]))

result =

if [[ "$RUNNER" = "FlinkRunner" ]]; then

# Create the jar
OUTPUT_JAR=flink-test-$(date +%Y%m%d-%H%M%S).jar
date +%Y%m%d-%H%M%S
(python -c "$PIPELINE_PY" \
  --runner "$RUNNER" \
  --output_executable_path $OUTPUT_JAR \
  --parallelism 1 \
  --sdk_worker_parallelism 1 \
  --environment_type DOCKER \
  --environment_config=$PYTHON_CONTAINER_IMAGE \
) || TEST_EXIT_CODE=$? # don't fail fast here; clean up before exiting
WARNING:apache_beam.options.pipeline_options:Discarding unparseable args: ['--parallelism',
ERROR:root:java.lang.IllegalArgumentException: Expected exactly one jar on sun.misc.Launcher$AppClassLoader@1b6d3586
Traceback (most recent call last):
  File "<string>", line 24, in <module>
  File "<",>
line 545, in wait_until_finish
    (self._job_id, self._state, self._last_error_message()))
RuntimeError: Pipeline BeamApp-jenkins-0325233858-d2c40a52_d9973b48-10f8-4a30-b0f9-ad4901c9c98a
failed in state FAILED: java.lang.IllegalArgumentException: Expected exactly one jar on sun.misc.Launcher$AppClassLoader@1b6d3586

if [[ "$TEST_EXIT_CODE" -eq 0 ]]; then
  # Execute the jar
  java -jar $OUTPUT_JAR || TEST_EXIT_CODE=$?

rm -rf $ENV_DIR

if [[ "$TEST_EXIT_CODE" -eq 0 ]]; then
  echo ">>> SUCCESS"
  echo ">>> FAILURE"

> Task :runners:spark:job-server:testJavaJarCreatorPy37 FAILED

FAILURE: Build failed with an exception.

* Where:
Build file '<'>
line: 160

* What went wrong:
Execution failed for task ':runners:spark:job-server:testJavaJarCreatorPy37'.
> Process 'command 'sh'' finished with non-zero exit value 1

* Try:
Run with --stacktrace option to get the stack trace. Run with --info or --debug option to
get more log output. Run with --scan to get full insights.

* Get more help at

Deprecated Gradle features were used in this build, making it incompatible with Gradle 6.0.
Use '--warning-mode all' to show the individual deprecation warnings.

BUILD FAILED in 8m 39s
64 actionable tasks: 49 executed, 14 from cache, 1 up-to-date

Publishing build scan...

Build step 'Invoke Gradle script' changed build result to FAILURE
Build step 'Invoke Gradle script' marked build as failure

To unsubscribe, e-mail:
For additional commands, e-mail:

View raw message