beam-builds mailing list archives

Site index · List index
Message view « Date » · « Thread »
Top « Date » · « Thread »
From Apache Jenkins Server <jenk...@builds.apache.org>
Subject Build failed in Jenkins: beam_PreCommit_Java_Cron #2570
Date Mon, 30 Mar 2020 00:41:59 GMT
See <https://builds.apache.org/job/beam_PreCommit_Java_Cron/2570/display/redirect>

Changes:


------------------------------------------
[...truncated 496.74 KB...]
> Task :sdks:java:io:elasticsearch-tests:elasticsearch-tests-2:check
> Task :sdks:java:io:elasticsearch-tests:elasticsearch-tests-2:build
> Task :sdks:java:io:elasticsearch-tests:elasticsearch-tests-2:buildDependents
> Task :runners:local-java:test
> Task :runners:local-java:check
> Task :runners:local-java:build
> Task :sdks:java:fn-execution:assemble
> Task :sdks:java:fn-execution:analyzeClassesDependencies SKIPPED
> Task :sdks:java:fn-execution:compileTestJava FROM-CACHE
> Task :sdks:java:fn-execution:testClasses UP-TO-DATE
> Task :sdks:java:fn-execution:analyzeTestClassesDependencies SKIPPED
> Task :sdks:java:fn-execution:analyzeDependencies SKIPPED
> Task :sdks:java:core:packageTests
> Task :sdks:java:core:assemble
> Task :sdks:java:core:analyzeClassesDependencies SKIPPED
> Task :sdks:java:core:analyzeTestClassesDependencies SKIPPED
> Task :sdks:java:core:analyzeDependencies SKIPPED
> Task :sdks:java:fn-execution:checkstyleMain
> Task :sdks:java:fn-execution:checkstyleTest
> Task :sdks:java:fn-execution:javadoc
> Task :vendor:sdks-java-extensions-protobuf:test NO-SOURCE
> Task :vendor:sdks-java-extensions-protobuf:validateShadedJarDoesntLeakNonProjectClasses
> Task :vendor:sdks-java-extensions-protobuf:check
> Task :vendor:sdks-java-extensions-protobuf:build
> Task :sdks:java:extensions:google-cloud-platform-core:assemble
> Task :sdks:java:extensions:google-cloud-platform-core:analyzeClassesDependencies SKIPPED
> Task :sdks:java:extensions:google-cloud-platform-core:analyzeTestClassesDependencies
SKIPPED
> Task :sdks:java:extensions:google-cloud-platform-core:analyzeDependencies SKIPPED
> Task :sdks:java:extensions:google-cloud-platform-core:checkstyleMain
> Task :sdks:java:expansion-service:test
> Task :sdks:java:expansion-service:check
> Task :sdks:java:expansion-service:build
> Task :sdks:java:extensions:protobuf:assemble
> Task :sdks:java:extensions:protobuf:analyzeClassesDependencies SKIPPED
> Task :sdks:java:extensions:google-cloud-platform-core:checkstyleTest
[main] INFO org.gradle.internal.nativeintegration.services.NativeServices - Initialized native
services in: /home/jenkins/.gradle/native
> Task :sdks:java:extensions:protobuf:extractIncludeTestProto
> Task :sdks:java:extensions:protobuf:generateTestProto

> Task :sdks:java:fn-execution:spotbugsMain
SLF4J: Failed to load class "org.slf4j.impl.StaticLoggerBinder".
SLF4J: Defaulting to no-operation (NOP) logger implementation
SLF4J: See http://www.slf4j.org/codes.html#StaticLoggerBinder for further details.

> Task :sdks:java:extensions:protobuf:compileTestJava FROM-CACHE
> Task :sdks:java:extensions:protobuf:testClasses
> Task :sdks:java:extensions:protobuf:analyzeTestClassesDependencies SKIPPED
> Task :sdks:java:extensions:protobuf:analyzeDependencies SKIPPED
> Task :runners:extensions-java:metrics:test
> Task :runners:extensions-java:metrics:check
> Task :runners:extensions-java:metrics:build
> Task :runners:extensions-java:metrics:buildDependents
> Task :sdks:java:io:common:analyzeTestClassesDependencies SKIPPED
> Task :sdks:java:io:common:analyzeDependencies SKIPPED
> Task :sdks:java:io:common:checkstyleTest
> Task :sdks:java:extensions:protobuf:checkstyleMain
> Task :sdks:java:extensions:protobuf:checkstyleTest
> Task :runners:samza:job-server:startShadowScripts
> Task :sdks:java:extensions:google-cloud-platform-core:javadoc
> Task :runners:samza:job-server:shadowDistTar
> Task :sdks:java:core:checkstyleMain
[main] INFO org.gradle.internal.nativeintegration.services.NativeServices - Initialized native
services in: /home/jenkins/.gradle/native
> Task :sdks:java:extensions:protobuf:javadoc

> Task :sdks:java:extensions:google-cloud-platform-core:spotbugsMain
SLF4J: Failed to load class "org.slf4j.impl.StaticLoggerBinder".
SLF4J: Defaulting to no-operation (NOP) logger implementation
SLF4J: See http://www.slf4j.org/codes.html#StaticLoggerBinder for further details.

[main] INFO org.gradle.internal.nativeintegration.services.NativeServices - Initialized native
services in: /home/jenkins/.gradle/native

> Task :sdks:java:extensions:protobuf:spotbugsMain
SLF4J: Failed to load class "org.slf4j.impl.StaticLoggerBinder".
SLF4J: Defaulting to no-operation (NOP) logger implementation
SLF4J: See http://www.slf4j.org/codes.html#StaticLoggerBinder for further details.

> Task :sdks:java:harness:test
> Task :sdks:java:io:common:test
> Task :sdks:java:io:common:check
> Task :sdks:java:io:common:build
> Task :sdks:java:io:elasticsearch:assemble
> Task :sdks:java:io:elasticsearch:analyzeClassesDependencies SKIPPED
> Task :sdks:java:io:elasticsearch:compileTestJava NO-SOURCE
> Task :sdks:java:io:elasticsearch:testClasses UP-TO-DATE
> Task :sdks:java:io:elasticsearch:analyzeTestClassesDependencies SKIPPED
> Task :sdks:java:io:elasticsearch:analyzeDependencies SKIPPED
> Task :sdks:java:io:elasticsearch:checkstyleMain
> Task :sdks:java:io:elasticsearch:checkstyleTest NO-SOURCE
> Task :sdks:java:io:elasticsearch-tests:elasticsearch-tests-6:check
> Task :sdks:java:io:elasticsearch-tests:elasticsearch-tests-6:build
> Task :sdks:java:io:elasticsearch-tests:elasticsearch-tests-6:buildDependents
> Task :sdks:java:io:hadoop-common:assemble
> Task :sdks:java:io:hadoop-common:analyzeClassesDependencies SKIPPED
> Task :sdks:java:io:hadoop-common:compileTestJava FROM-CACHE
> Task :sdks:java:io:hadoop-common:testClasses UP-TO-DATE
> Task :sdks:java:io:hadoop-common:analyzeTestClassesDependencies SKIPPED
> Task :sdks:java:io:hadoop-common:analyzeDependencies SKIPPED
> Task :sdks:java:io:hadoop-common:checkstyleMain
> Task :runners:samza:job-server:shadowDistZip
> Task :runners:samza:job-server:assemble
> Task :runners:samza:job-server:analyzeClassesDependencies SKIPPED
> Task :runners:samza:job-server:analyzeTestClassesDependencies SKIPPED
> Task :runners:samza:job-server:analyzeDependencies SKIPPED
> Task :runners:samza:job-server:checkstyleMain NO-SOURCE
> Task :runners:samza:job-server:checkstyleTest NO-SOURCE
> Task :runners:samza:job-server:javadoc NO-SOURCE
> Task :runners:samza:job-server:spotbugsMain NO-SOURCE
> Task :runners:samza:job-server:test NO-SOURCE
> Task :runners:samza:job-server:check UP-TO-DATE
> Task :runners:samza:job-server:build
> Task :runners:samza:job-server:buildDependents
> Task :runners:samza:buildDependents
> Task :sdks:java:extensions:sql:hcatalog:compileJava FROM-CACHE
> Task :sdks:java:extensions:sql:hcatalog:classes UP-TO-DATE
> Task :sdks:java:io:hadoop-common:checkstyleTest
> Task :sdks:java:io:elasticsearch-tests:elasticsearch-tests-5:check
> Task :sdks:java:io:elasticsearch-tests:elasticsearch-tests-5:build
> Task :sdks:java:io:elasticsearch-tests:elasticsearch-tests-5:buildDependents
> Task :sdks:java:core:checkstyleTest
> Task :sdks:java:io:elasticsearch-tests:elasticsearch-tests-7:check
> Task :sdks:java:io:elasticsearch-tests:elasticsearch-tests-7:build
> Task :sdks:java:io:elasticsearch-tests:elasticsearch-tests-7:buildDependents
> Task :sdks:java:io:elasticsearch-tests:elasticsearch-tests-common:buildDependents
> Task :sdks:java:io:elasticsearch:javadoc
> Task :sdks:java:extensions:sql:hcatalog:javadoc
> Task :sdks:java:io:hadoop-common:javadoc
[main] INFO org.gradle.internal.nativeintegration.services.NativeServices - Initialized native
services in: /home/jenkins/.gradle/native
[main] INFO org.gradle.internal.nativeintegration.services.NativeServices - Initialized native
services in: /home/jenkins/.gradle/native

> Task :sdks:java:io:elasticsearch:spotbugsMain
SLF4J: Failed to load class "org.slf4j.impl.StaticLoggerBinder".
SLF4J: Defaulting to no-operation (NOP) logger implementation
SLF4J: See http://www.slf4j.org/codes.html#StaticLoggerBinder for further details.

> Task :sdks:java:harness:check
> Task :sdks:java:harness:build

> Task :sdks:java:io:hadoop-common:spotbugsMain
SLF4J: Failed to load class "org.slf4j.impl.StaticLoggerBinder".
SLF4J: Defaulting to no-operation (NOP) logger implementation
SLF4J: See http://www.slf4j.org/codes.html#StaticLoggerBinder for further details.

> Task :sdks:java:fn-execution:test
> Task :sdks:java:fn-execution:check
> Task :sdks:java:fn-execution:build

> Task :sdks:java:core:javadoc
<https://builds.apache.org/job/beam_PreCommit_Java_Cron/ws/src/sdks/java/core/src/main/java/org/apache/beam/sdk/transforms/CombineFns.java>:118:
warning - Tag @link: can't find with(SimpleFunction, CombineFn, TupleTag) in org.apache.beam.sdk.transforms.CombineFns.ComposeCombineFnBuilder
<https://builds.apache.org/job/beam_PreCommit_Java_Cron/ws/src/sdks/java/core/src/main/java/org/apache/beam/sdk/transforms/CombineFns.java>:144:
warning - Tag @link: can't find with(SimpleFunction, CombineFnWithContext, TupleTag) in org.apache.beam.sdk.transforms.CombineFns.ComposeCombineFnBuilder

> Task :sdks:java:io:elasticsearch:spotbugsMain
The following classes needed for analysis were missing:
  com.google.auto.value.AutoValue$Builder
  com.google.auto.value.AutoValue

> Task :sdks:java:io:elasticsearch:test NO-SOURCE
> Task :sdks:java:io:elasticsearch:check
> Task :sdks:java:io:elasticsearch:build
> Task :sdks:java:io:elasticsearch:buildDependents
> Task :sdks:java:extensions:protobuf:test
> Task :sdks:java:extensions:protobuf:check
> Task :sdks:java:extensions:protobuf:build
> Task :sdks:java:extensions:sql:jdbc:shadowJarTest
> Task :sdks:java:extensions:google-cloud-platform-core:test
> Task :sdks:java:io:hadoop-common:test
> Task :sdks:java:io:hadoop-common:check
> Task :sdks:java:io:hadoop-common:build
> Task :sdks:java:io:hadoop-common:buildDependents

> Task :sdks:java:core:javadoc
<https://builds.apache.org/job/beam_PreCommit_Java_Cron/ws/src/sdks/java/core/src/main/java/org/apache/beam/sdk/values/PCollection.java>:302:
warning - Tag @link:illegal character: "60" in "PCollection<Row>"
<https://builds.apache.org/job/beam_PreCommit_Java_Cron/ws/src/sdks/java/core/src/main/java/org/apache/beam/sdk/values/PCollection.java>:302:
warning - Tag @link:illegal character: "62" in "PCollection<Row>"
<https://builds.apache.org/job/beam_PreCommit_Java_Cron/ws/src/sdks/java/core/src/main/java/org/apache/beam/sdk/schemas/SchemaRegistry.java>:288:
warning - Tag @link:illegal character: "42" in "* NoSuchSchemaException"
<https://builds.apache.org/job/beam_PreCommit_Java_Cron/ws/src/sdks/java/core/src/main/java/org/apache/beam/sdk/schemas/SchemaRegistry.java>:296:
warning - Tag @link:illegal character: "42" in "* NoSuchSchemaException"

> Task :sdks:java:extensions:google-cloud-platform-core:check
> Task :sdks:java:extensions:google-cloud-platform-core:build
> Task :sdks:java:javadoc:allJavadoc
[main] INFO org.gradle.internal.nativeintegration.services.NativeServices - Initialized native
services in: /home/jenkins/.gradle/native

> Task :sdks:java:core:spotbugsMain
SLF4J: Failed to load class "org.slf4j.impl.StaticLoggerBinder".
SLF4J: Defaulting to no-operation (NOP) logger implementation
SLF4J: See http://www.slf4j.org/codes.html#StaticLoggerBinder for further details.

> Task :sdks:java:extensions:sql:jdbc:preCommit
> Task :runners:flink:1.9:check
> Task :runners:flink:1.9:build
> Task :runners:flink:1.9:buildDependents

> Task :sdks:java:core:spotbugsMain
The following classes needed for analysis were missing:
  com.google.auto.value.AutoValue$Builder
  com.google.auto.value.AutoValue

> Task :runners:flink:1.10:test
> Task :sdks:java:core:test
> Task :sdks:java:core:validateShadedJarDoesntLeakNonProjectClasses
> Task :sdks:java:core:check
> Task :sdks:java:core:build
> Task :sdks:java:core:buildNeeded
> Task :runners:flink:1.10:check
> Task :runners:flink:1.10:build
> Task :runners:flink:1.10:buildDependents
> Task :sdks:java:testing:nexmark:check
> Task :sdks:java:testing:nexmark:build
> Task :sdks:java:testing:nexmark:buildDependents
> Task :sdks:java:extensions:sql:buildDependents
> Task :sdks:java:io:kafka:buildDependents
> Task :sdks:java:extensions:join-library:buildDependents
> Task :sdks:java:io:mongodb:buildDependents
> Task :sdks:java:io:synthetic:buildDependents

FAILURE: Build completed with 2 failures.

1: Task failed with an exception.
-----------
* What went wrong:
Execution failed for task ':runners:flink:1.8:test'.
> There were failing tests. See the report at: file://<https://builds.apache.org/job/beam_PreCommit_Java_Cron/ws/src/runners/flink/1.8/build/reports/tests/test/index.html>

* Try:
Run with --stacktrace option to get the stack trace. Run with --info or --debug option to
get more log output. Run with --scan to get full insights.
==============================================================================

2: Task failed with an exception.
-----------
* What went wrong:
Execution failed for task ':runners:direct-java:needsRunnerTests'.
> There were failing tests. See the report at: file://<https://builds.apache.org/job/beam_PreCommit_Java_Cron/ws/src/runners/direct-java/build/reports/tests/needsRunnerTests/index.html>

* Try:
Run with --stacktrace option to get the stack trace. Run with --info or --debug option to
get more log output. Run with --scan to get full insights.
==============================================================================

* Get more help at https://help.gradle.org

Deprecated Gradle features were used in this build, making it incompatible with Gradle 6.0.
Use '--warning-mode all' to show the individual deprecation warnings.
See https://docs.gradle.org/5.2.1/userguide/command_line_interface.html#sec:command_line_warnings

BUILD FAILED in 33m 3s
842 actionable tasks: 695 executed, 147 from cache

Publishing build scan...
https://gradle.com/s/iqvqwbuatefva

Build step 'Invoke Gradle script' changed build result to FAILURE
Build step 'Invoke Gradle script' marked build as failure

---------------------------------------------------------------------
To unsubscribe, e-mail: builds-unsubscribe@beam.apache.org
For additional commands, e-mail: builds-help@beam.apache.org


Mime
View raw message