beam-builds mailing list archives

Site index · List index
Message view « Date » · « Thread »
Top « Date » · « Thread »
From Apache Jenkins Server <jenk...@builds.apache.org>
Subject Build failed in Jenkins: beam_PostCommit_Java_PortabilityApi #4245
Date Fri, 28 Feb 2020 00:01:44 GMT
See <https://builds.apache.org/job/beam_PostCommit_Java_PortabilityApi/4245/display/redirect?page=changes>

Changes:

[robinyqiu] Bump Dataflow Java worker container version


------------------------------------------
[...truncated 45.62 KB...]
Resolving golang.org/x/crypto: commit='d9133f5469342136e669e85192a26056b587f503', urls=[https://go.googlesource.com/crypto]

> Task :sdks:java:io:google-cloud-platform:compileJava FROM-CACHE
> Task :sdks:java:io:google-cloud-platform:classes UP-TO-DATE
> Task :sdks:java:harness:compileJava FROM-CACHE
> Task :sdks:java:harness:classes UP-TO-DATE
> Task :sdks:java:core:compileTestJava FROM-CACHE
> Task :sdks:java:core:testClasses
> Task :sdks:java:io:google-cloud-platform:jar
> Task :examples:java:compileJava FROM-CACHE
> Task :examples:java:classes UP-TO-DATE
> Task :runners:google-cloud-dataflow-java:compileJava FROM-CACHE
> Task :runners:google-cloud-dataflow-java:classes
> Task :examples:java:jar
> Task :runners:google-cloud-dataflow-java:jar
> Task :examples:java:compileTestJava FROM-CACHE
> Task :examples:java:testClasses
> Task :examples:java:testJar

> Task :sdks:go:resolveBuildDependencies
Resolving golang.org/x/debug: commit='95515998a8a4bd7448134b2cb5971dbeb12e0b77', urls=[https://go.googlesource.com/debug]
Resolving golang.org/x/net: commit='2fb46b16b8dda405028c50f7c7f0f9dd1fa6bfb1', urls=[https://go.googlesource.com/net]
Resolving golang.org/x/oauth2: commit='a032972e28060ca4f5644acffae3dfc268cc09db', urls=[https://go.googlesource.com/oauth2]
Resolving golang.org/x/sync: commit='fd80eb99c8f653c847d294a001bdf2a3a6f768f5', urls=[https://go.googlesource.com/sync]

> Task :sdks:java:core:shadowTestJar
> Task :sdks:java:extensions:google-cloud-platform-core:compileTestJava FROM-CACHE
> Task :sdks:java:extensions:google-cloud-platform-core:testClasses UP-TO-DATE
> Task :sdks:java:extensions:google-cloud-platform-core:testJar

> Task :sdks:go:resolveBuildDependencies
Resolving golang.org/x/sys: commit='37707fdb30a5b38865cfb95e5aab41707daec7fd', urls=[https://go.googlesource.com/sys]
Resolving cached github.com/coreos/etcd: commit='11214aa33bf5a47d3d9d8dafe0f6b97237dfe921',
urls=[https://github.com/coreos/etcd.git, git@github.com:coreos/etcd.git]
Resolving cached github.com/coreos/etcd: commit='11214aa33bf5a47d3d9d8dafe0f6b97237dfe921',
urls=[https://github.com/coreos/etcd.git, git@github.com:coreos/etcd.git]

> Task :sdks:java:harness:shadowJar
> Task :sdks:java:harness:jar
> Task :sdks:java:container:copyDockerfileDependencies
> Task :runners:java-fn-execution:compileJava FROM-CACHE
> Task :runners:java-fn-execution:classes UP-TO-DATE
> Task :runners:java-fn-execution:jar
> Task :runners:direct-java:compileJava FROM-CACHE
> Task :runners:direct-java:classes UP-TO-DATE
> Task :runners:google-cloud-dataflow-java:worker:compileJava FROM-CACHE
> Task :runners:google-cloud-dataflow-java:worker:classes
> Task :runners:direct-java:shadowJar
> Task :sdks:java:io:google-cloud-platform:compileTestJava FROM-CACHE
> Task :sdks:java:io:google-cloud-platform:testClasses UP-TO-DATE
> Task :sdks:java:io:google-cloud-platform:testJar
> Task :runners:google-cloud-dataflow-java:worker:shadowJar

> Task :sdks:go:resolveBuildDependencies
Resolving google.golang.org/api: commit='386d4e5f4f92f86e6aec85985761bba4b938a2d5', urls=[https://code.googlesource.com/google-api-go-client]
Resolving google.golang.org/genproto: commit='2b5a72b8730b0b16380010cfe5286c42108d88e7', urls=[https://github.com/google/go-genproto]
Resolving google.golang.org/grpc: commit='7646b5360d049a7ca31e9133315db43456f39e2e', urls=[https://github.com/grpc/grpc-go]
Resolving cached github.com/coreos/etcd: commit='11214aa33bf5a47d3d9d8dafe0f6b97237dfe921',
urls=[https://github.com/coreos/etcd.git, git@github.com:coreos/etcd.git]
Resolving cached github.com/coreos/etcd: commit='11214aa33bf5a47d3d9d8dafe0f6b97237dfe921',
urls=[https://github.com/coreos/etcd.git, git@github.com:coreos/etcd.git]

> Task :sdks:go:installDependencies
> Task :sdks:go:buildLinuxAmd64
> Task :sdks:go:goBuild

> Task :sdks:java:container:resolveBuildDependencies
Resolving ./github.com/apache/beam/sdks/go@<https://builds.apache.org/job/beam_PostCommit_Java_PortabilityApi/ws/src/sdks/go>

> Task :sdks:java:container:installDependencies
> Task :sdks:java:container:buildLinuxAmd64
> Task :sdks:java:container:goBuild
> Task :sdks:java:container:dockerPrepare
> Task :sdks:java:container:docker

> Task :runners:google-cloud-dataflow-java:buildAndPushDockerContainer
WARNING: `gcloud docker` will not be supported for Docker client versions above 18.03.

As an alternative, use `gcloud auth configure-docker` to configure `docker` to
use `gcloud` as a credential helper, then use `docker` as you would for non-GCR
registries, e.g. `docker pull gcr.io/project-id/my-image`. Add
`--verbosity=error` to silence this warning: `gcloud docker
--verbosity=error -- pull gcr.io/project-id/my-image`.

See: https://cloud.google.com/container-registry/docs/support/deprecation-notices#gcloud-docker

The push refers to repository [us.gcr.io/apache-beam-testing/java-postcommit-it/java]
11bfeaf8580a: Preparing
5a63bcfc30d4: Preparing
d63a3bb8554e: Preparing
6e11b8db3a3d: Preparing
e502c638f05c: Preparing
b507a286160f: Preparing
4186db990701: Preparing
5b5fbf48ec75: Preparing
832f129ebea4: Preparing
4186db990701: Waiting
6670e930ed33: Preparing
c7f27a4eb870: Preparing
5b5fbf48ec75: Waiting
832f129ebea4: Waiting
6670e930ed33: Waiting
e70dfb4c3a48: Preparing
1c76bd0dc325: Preparing
e70dfb4c3a48: Waiting
1c76bd0dc325: Waiting
c7f27a4eb870: Waiting
b507a286160f: Waiting
e502c638f05c: Layer already exists
5a63bcfc30d4: Layer already exists
d63a3bb8554e: Layer already exists
11bfeaf8580a: Layer already exists
6e11b8db3a3d: Layer already exists
4186db990701: Layer already exists
b507a286160f: Layer already exists
5b5fbf48ec75: Layer already exists
832f129ebea4: Layer already exists
6670e930ed33: Layer already exists
e70dfb4c3a48: Layer already exists
c7f27a4eb870: Layer already exists
1c76bd0dc325: Layer already exists
20200227213627: digest: sha256:5f2a9ac6d9aa4b6428e49db7e7fa6753f616f3aa40adae9dbe9780ac9a765102
size: 3055
8ecd1c82d94a: Preparing
6c3cc20909c2: Preparing
1f4a046570fa: Preparing
3d886e4499ee: Preparing
47c3dafafe07: Preparing
4c369f7c806f: Preparing
35b812de92d6: Preparing
755b2d4031af: Preparing
ac3e2c206c49: Preparing
3663b7fed4c9: Preparing
832f129ebea4: Preparing
6670e930ed33: Preparing
c7f27a4eb870: Preparing
e70dfb4c3a48: Preparing
1c76bd0dc325: Preparing
35b812de92d6: Waiting
755b2d4031af: Waiting
ac3e2c206c49: Waiting
1c76bd0dc325: Waiting
c7f27a4eb870: Waiting
e70dfb4c3a48: Waiting
6670e930ed33: Waiting
3663b7fed4c9: Waiting
4c369f7c806f: Waiting
47c3dafafe07: Pushed
3d886e4499ee: Pushed
6c3cc20909c2: Pushed
8ecd1c82d94a: Pushed
ac3e2c206c49: Layer already exists
832f129ebea4: Layer already exists
6670e930ed33: Layer already exists
c7f27a4eb870: Layer already exists
e70dfb4c3a48: Layer already exists
1c76bd0dc325: Layer already exists
3663b7fed4c9: Layer already exists
1f4a046570fa: Pushed
35b812de92d6: Pushed
755b2d4031af: Pushed
4c369f7c806f: Pushed
20200227232143: digest: sha256:73433c9db799a137e831ef0cabf7793c47a5403d79bf654b99660ddfa0a46285
size: 3470

> Task :runners:google-cloud-dataflow-java:coreSDKJavaFnApiWorkerIntegrationTest NO-SOURCE
> Task :runners:google-cloud-dataflow-java:examplesJavaFnApiWorkerIntegrationTest

org.apache.beam.examples.cookbook.BigQueryTornadoesIT > testE2EBigQueryTornadoesWithExport
FAILED
    java.lang.RuntimeException at BigQueryTornadoesIT.java:68

org.apache.beam.examples.cookbook.BigQueryTornadoesIT > testE2eBigQueryTornadoesWithStorageApi
FAILED
    java.lang.RuntimeException at BigQueryTornadoesIT.java:68

2 tests completed, 2 failed

> Task :runners:google-cloud-dataflow-java:examplesJavaFnApiWorkerIntegrationTest FAILED
> Task :runners:google-cloud-dataflow-java:googleCloudPlatformFnApiWorkerIntegrationTest

org.apache.beam.sdk.io.gcp.bigquery.BigQueryToTableIT > testNewTypesQueryWithReshuffle
FAILED
    java.lang.RuntimeException at BigQueryToTableIT.java:118

org.apache.beam.sdk.io.gcp.bigquery.BigQueryTimePartitioningClusteringIT > testE2EBigQueryClusteringTableFunction
FAILED
    java.lang.RuntimeException at BigQueryTimePartitioningClusteringIT.java:199

org.apache.beam.sdk.io.gcp.bigquery.BigQueryTimePartitioningClusteringIT > testE2EBigQueryClusteringDynamicDestinations
FAILED
    java.lang.RuntimeException at BigQueryTimePartitioningClusteringIT.java:222

org.apache.beam.sdk.io.gcp.bigquery.BigQueryToTableIT > testLegacyQueryWithoutReshuffle
FAILED
    java.lang.RuntimeException at BigQueryToTableIT.java:118

org.apache.beam.sdk.io.gcp.bigquery.BigQueryTimePartitioningClusteringIT > testE2EBigQueryTimePartitioning
FAILED
    java.lang.RuntimeException at BigQueryTimePartitioningClusteringIT.java:145

org.apache.beam.sdk.io.gcp.bigquery.BigQueryToTableIT > testNewTypesQueryWithoutReshuffle
FAILED
    java.lang.RuntimeException at BigQueryToTableIT.java:118

org.apache.beam.sdk.io.gcp.bigquery.BigQueryTimePartitioningClusteringIT > testE2EBigQueryClustering
FAILED
    java.lang.RuntimeException at BigQueryTimePartitioningClusteringIT.java:170

org.apache.beam.sdk.io.gcp.bigquery.BigQueryToTableIT > testStandardQueryWithoutCustom
FAILED
    java.lang.RuntimeException at BigQueryToTableIT.java:118

13 tests completed, 8 failed

> Task :runners:google-cloud-dataflow-java:googleCloudPlatformFnApiWorkerIntegrationTest
FAILED

> Task :runners:google-cloud-dataflow-java:cleanUpDockerImages
Untagged: us.gcr.io/apache-beam-testing/java-postcommit-it/java:20200227232143
Untagged: us.gcr.io/apache-beam-testing/java-postcommit-it/java@sha256:73433c9db799a137e831ef0cabf7793c47a5403d79bf654b99660ddfa0a46285
Digests:
- us.gcr.io/apache-beam-testing/java-postcommit-it/java@sha256:73433c9db799a137e831ef0cabf7793c47a5403d79bf654b99660ddfa0a46285
  Associated tags:
 - 20200227232143
Tags:
- us.gcr.io/apache-beam-testing/java-postcommit-it/java:20200227232143
Deleted [us.gcr.io/apache-beam-testing/java-postcommit-it/java:20200227232143].
Deleted [us.gcr.io/apache-beam-testing/java-postcommit-it/java@sha256:73433c9db799a137e831ef0cabf7793c47a5403d79bf654b99660ddfa0a46285].

FAILURE: Build completed with 2 failures.

1: Task failed with an exception.
-----------
* What went wrong:
Execution failed for task ':runners:google-cloud-dataflow-java:examplesJavaFnApiWorkerIntegrationTest'.
> There were failing tests. See the report at: file://<https://builds.apache.org/job/beam_PostCommit_Java_PortabilityApi/ws/src/runners/google-cloud-dataflow-java/build/reports/tests/examplesJavaFnApiWorkerIntegrationTest/index.html>

* Try:
Run with --stacktrace option to get the stack trace. Run with --info or --debug option to
get more log output. Run with --scan to get full insights.
==============================================================================

2: Task failed with an exception.
-----------
* What went wrong:
Execution failed for task ':runners:google-cloud-dataflow-java:googleCloudPlatformFnApiWorkerIntegrationTest'.
> There were failing tests. See the report at: file://<https://builds.apache.org/job/beam_PostCommit_Java_PortabilityApi/ws/src/runners/google-cloud-dataflow-java/build/reports/tests/googleCloudPlatformFnApiWorkerIntegrationTest/index.html>

* Try:
Run with --stacktrace option to get the stack trace. Run with --info or --debug option to
get more log output. Run with --scan to get full insights.
==============================================================================

* Get more help at https://help.gradle.org

Deprecated Gradle features were used in this build, making it incompatible with Gradle 6.0.
Use '--warning-mode all' to show the individual deprecation warnings.
See https://docs.gradle.org/5.2.1/userguide/command_line_interface.html#sec:command_line_warnings

BUILD FAILED in 40m 9s
101 actionable tasks: 72 executed, 28 from cache, 1 up-to-date

Publishing build scan...
https://gradle.com/s/m2w7z5dfu3uqu

Build step 'Invoke Gradle script' changed build result to FAILURE
Build step 'Invoke Gradle script' marked build as failure

---------------------------------------------------------------------
To unsubscribe, e-mail: builds-unsubscribe@beam.apache.org
For additional commands, e-mail: builds-help@beam.apache.org


Mime
View raw message