beam-builds mailing list archives

Site index · List index
Message view « Date » · « Thread »
Top « Date » · « Thread »
From Apache Jenkins Server <jenk...@builds.apache.org>
Subject Build failed in Jenkins: beam_PostCommit_Java_PortabilityApi #4209
Date Tue, 25 Feb 2020 15:13:30 GMT
See <https://builds.apache.org/job/beam_PostCommit_Java_PortabilityApi/4209/display/redirect?page=changes>

Changes:

[mxm] [BEAM-9345] Remove workaround to restore stdout/stderr during JobGraph

[mxm] [BEAM-9345] Add end-to-end Flink job submission test


------------------------------------------
[...truncated 45.56 KB...]
> Task :runners:core-java:jar
> Task :sdks:java:harness:compileJava FROM-CACHE
> Task :sdks:java:harness:classes UP-TO-DATE
> Task :sdks:java:io:google-cloud-platform:compileJava FROM-CACHE
> Task :sdks:java:io:google-cloud-platform:classes UP-TO-DATE
> Task :sdks:java:core:compileTestJava FROM-CACHE
> Task :sdks:java:core:testClasses
> Task :sdks:java:io:google-cloud-platform:jar
> Task :examples:java:compileJava FROM-CACHE
> Task :examples:java:classes UP-TO-DATE
> Task :runners:google-cloud-dataflow-java:compileJava FROM-CACHE
> Task :runners:google-cloud-dataflow-java:classes
> Task :examples:java:jar
> Task :runners:google-cloud-dataflow-java:jar
> Task :examples:java:compileTestJava FROM-CACHE
> Task :examples:java:testClasses
> Task :examples:java:testJar

> Task :sdks:go:resolveBuildDependencies
Resolving golang.org/x/debug: commit='95515998a8a4bd7448134b2cb5971dbeb12e0b77', urls=[https://go.googlesource.com/debug]
Resolving golang.org/x/net: commit='2fb46b16b8dda405028c50f7c7f0f9dd1fa6bfb1', urls=[https://go.googlesource.com/net]
Resolving golang.org/x/oauth2: commit='a032972e28060ca4f5644acffae3dfc268cc09db', urls=[https://go.googlesource.com/oauth2]
Resolving golang.org/x/sync: commit='fd80eb99c8f653c847d294a001bdf2a3a6f768f5', urls=[https://go.googlesource.com/sync]

> Task :sdks:java:core:shadowTestJar
> Task :sdks:java:extensions:google-cloud-platform-core:compileTestJava FROM-CACHE
> Task :sdks:java:extensions:google-cloud-platform-core:testClasses UP-TO-DATE
> Task :sdks:java:extensions:google-cloud-platform-core:testJar

> Task :sdks:go:resolveBuildDependencies
Resolving golang.org/x/sys: commit='37707fdb30a5b38865cfb95e5aab41707daec7fd', urls=[https://go.googlesource.com/sys]
Resolving cached github.com/coreos/etcd: commit='11214aa33bf5a47d3d9d8dafe0f6b97237dfe921',
urls=[https://github.com/coreos/etcd.git, git@github.com:coreos/etcd.git]
Resolving cached github.com/coreos/etcd: commit='11214aa33bf5a47d3d9d8dafe0f6b97237dfe921',
urls=[https://github.com/coreos/etcd.git, git@github.com:coreos/etcd.git]

> Task :sdks:java:harness:shadowJar
> Task :sdks:java:harness:jar
> Task :sdks:java:container:copyDockerfileDependencies
> Task :runners:java-fn-execution:compileJava FROM-CACHE
> Task :runners:java-fn-execution:classes UP-TO-DATE
> Task :runners:java-fn-execution:jar
> Task :runners:direct-java:compileJava FROM-CACHE
> Task :runners:direct-java:classes UP-TO-DATE
> Task :runners:google-cloud-dataflow-java:worker:compileJava FROM-CACHE
> Task :runners:google-cloud-dataflow-java:worker:classes
> Task :runners:direct-java:shadowJar
> Task :sdks:java:io:google-cloud-platform:compileTestJava FROM-CACHE
> Task :sdks:java:io:google-cloud-platform:testClasses UP-TO-DATE
> Task :sdks:java:io:google-cloud-platform:testJar
> Task :runners:google-cloud-dataflow-java:worker:shadowJar

> Task :sdks:go:resolveBuildDependencies
Resolving google.golang.org/api: commit='386d4e5f4f92f86e6aec85985761bba4b938a2d5', urls=[https://code.googlesource.com/google-api-go-client]
Resolving google.golang.org/genproto: commit='2b5a72b8730b0b16380010cfe5286c42108d88e7', urls=[https://github.com/google/go-genproto]
Resolving google.golang.org/grpc: commit='7646b5360d049a7ca31e9133315db43456f39e2e', urls=[https://github.com/grpc/grpc-go]
Resolving cached github.com/coreos/etcd: commit='11214aa33bf5a47d3d9d8dafe0f6b97237dfe921',
urls=[https://github.com/coreos/etcd.git, git@github.com:coreos/etcd.git]
Resolving cached github.com/coreos/etcd: commit='11214aa33bf5a47d3d9d8dafe0f6b97237dfe921',
urls=[https://github.com/coreos/etcd.git, git@github.com:coreos/etcd.git]

> Task :sdks:go:installDependencies
> Task :sdks:go:buildLinuxAmd64
> Task :sdks:go:goBuild

> Task :sdks:java:container:resolveBuildDependencies
Resolving ./github.com/apache/beam/sdks/go@<https://builds.apache.org/job/beam_PostCommit_Java_PortabilityApi/ws/src/sdks/go>

> Task :sdks:java:container:installDependencies
> Task :sdks:java:container:buildLinuxAmd64
> Task :sdks:java:container:goBuild
> Task :sdks:java:container:dockerPrepare
> Task :sdks:java:container:docker

> Task :runners:google-cloud-dataflow-java:buildAndPushDockerContainer
WARNING: `gcloud docker` will not be supported for Docker client versions above 18.03.

As an alternative, use `gcloud auth configure-docker` to configure `docker` to
use `gcloud` as a credential helper, then use `docker` as you would for non-GCR
registries, e.g. `docker pull gcr.io/project-id/my-image`. Add
`--verbosity=error` to silence this warning: `gcloud docker
--verbosity=error -- pull gcr.io/project-id/my-image`.

See: https://cloud.google.com/container-registry/docs/support/deprecation-notices#gcloud-docker

The push refers to repository [us.gcr.io/apache-beam-testing/java-postcommit-it/java]
e42fd58fafb1: Preparing
c72b0ce118a6: Preparing
d518d689eb9c: Preparing
5a5bc34f2042: Preparing
243123490e7e: Preparing
65416af4fa40: Preparing
3fb986725e60: Preparing
a6170c7cf572: Preparing
33783834b288: Preparing
5c813a85f7f0: Preparing
bdca38f94ff0: Preparing
faac394a1ad3: Preparing
ce8168f12337: Preparing
33783834b288: Waiting
faac394a1ad3: Waiting
5c813a85f7f0: Waiting
ce8168f12337: Waiting
3fb986725e60: Waiting
bdca38f94ff0: Waiting
65416af4fa40: Waiting
a6170c7cf572: Waiting
e42fd58fafb1: Layer already exists
c72b0ce118a6: Layer already exists
d518d689eb9c: Layer already exists
243123490e7e: Layer already exists
5a5bc34f2042: Layer already exists
a6170c7cf572: Layer already exists
3fb986725e60: Layer already exists
33783834b288: Layer already exists
5c813a85f7f0: Layer already exists
65416af4fa40: Layer already exists
ce8168f12337: Layer already exists
bdca38f94ff0: Layer already exists
faac394a1ad3: Layer already exists
20200225143103: digest: sha256:b23080298def847ae38637dc797b259b8643b955172cccc9a94b8ecc8b4d416d
size: 3055
f6807d1a5a78: Preparing
74014b734ba4: Preparing
eee247a5d4ea: Preparing
6c3ca20f70bb: Preparing
980f0c97c37c: Preparing
3d2257052db4: Preparing
1dc81023da51: Preparing
f5324a7ba517: Preparing
c601709dd5d2: Preparing
72ce39f2b7f6: Preparing
33783834b288: Preparing
5c813a85f7f0: Preparing
bdca38f94ff0: Preparing
faac394a1ad3: Preparing
ce8168f12337: Preparing
72ce39f2b7f6: Waiting
1dc81023da51: Waiting
f5324a7ba517: Waiting
3d2257052db4: Waiting
bdca38f94ff0: Waiting
5c813a85f7f0: Waiting
faac394a1ad3: Waiting
ce8168f12337: Waiting
33783834b288: Waiting
c601709dd5d2: Waiting
980f0c97c37c: Pushed
f6807d1a5a78: Pushed
6c3ca20f70bb: Pushed
74014b734ba4: Pushed
c601709dd5d2: Layer already exists
72ce39f2b7f6: Layer already exists
bdca38f94ff0: Layer already exists
33783834b288: Layer already exists
5c813a85f7f0: Layer already exists
faac394a1ad3: Layer already exists
ce8168f12337: Layer already exists
eee247a5d4ea: Pushed
1dc81023da51: Pushed
f5324a7ba517: Pushed
3d2257052db4: Pushed
20200225143537: digest: sha256:3ee42627f3581741aec14ac18696b90c009a7e2ea0fe3c4538081e852f0f8669
size: 3470

> Task :runners:google-cloud-dataflow-java:coreSDKJavaFnApiWorkerIntegrationTest NO-SOURCE
> Task :runners:google-cloud-dataflow-java:examplesJavaFnApiWorkerIntegrationTest

org.apache.beam.examples.cookbook.BigQueryTornadoesIT > testE2EBigQueryTornadoesWithExport
FAILED
    java.lang.RuntimeException at BigQueryTornadoesIT.java:68

org.apache.beam.examples.cookbook.BigQueryTornadoesIT > testE2eBigQueryTornadoesWithStorageApi
FAILED
    java.lang.RuntimeException at BigQueryTornadoesIT.java:68

2 tests completed, 2 failed

> Task :runners:google-cloud-dataflow-java:examplesJavaFnApiWorkerIntegrationTest FAILED
> Task :runners:google-cloud-dataflow-java:googleCloudPlatformFnApiWorkerIntegrationTest

org.apache.beam.sdk.io.gcp.bigquery.BigQueryToTableIT > testNewTypesQueryWithReshuffle
FAILED
    java.lang.RuntimeException at BigQueryToTableIT.java:118

org.apache.beam.sdk.io.gcp.bigquery.BigQueryTimePartitioningClusteringIT > testE2EBigQueryClusteringTableFunction
FAILED
    java.lang.RuntimeException at BigQueryTimePartitioningClusteringIT.java:199

org.apache.beam.sdk.io.gcp.bigquery.BigQueryToTableIT > testLegacyQueryWithoutReshuffle
FAILED
    java.lang.RuntimeException at BigQueryToTableIT.java:118

org.apache.beam.sdk.io.gcp.bigquery.BigQueryTimePartitioningClusteringIT > testE2EBigQueryClusteringDynamicDestinations
FAILED
    java.lang.RuntimeException at BigQueryTimePartitioningClusteringIT.java:222

org.apache.beam.sdk.io.gcp.bigquery.BigQueryToTableIT > testNewTypesQueryWithoutReshuffle
FAILED
    java.lang.RuntimeException at BigQueryToTableIT.java:118

org.apache.beam.sdk.io.gcp.bigquery.BigQueryTimePartitioningClusteringIT > testE2EBigQueryTimePartitioning
FAILED
    java.lang.RuntimeException at BigQueryTimePartitioningClusteringIT.java:145

org.apache.beam.sdk.io.gcp.bigquery.BigQueryToTableIT > testStandardQueryWithoutCustom
FAILED
    java.lang.RuntimeException at BigQueryToTableIT.java:118

org.apache.beam.sdk.io.gcp.bigquery.BigQueryTimePartitioningClusteringIT > testE2EBigQueryClustering
FAILED
    java.lang.RuntimeException at BigQueryTimePartitioningClusteringIT.java:170

13 tests completed, 8 failed

> Task :runners:google-cloud-dataflow-java:googleCloudPlatformFnApiWorkerIntegrationTest
FAILED

> Task :runners:google-cloud-dataflow-java:cleanUpDockerImages
Untagged: us.gcr.io/apache-beam-testing/java-postcommit-it/java:20200225143537
Untagged: us.gcr.io/apache-beam-testing/java-postcommit-it/java@sha256:3ee42627f3581741aec14ac18696b90c009a7e2ea0fe3c4538081e852f0f8669
Digests:
- us.gcr.io/apache-beam-testing/java-postcommit-it/java@sha256:3ee42627f3581741aec14ac18696b90c009a7e2ea0fe3c4538081e852f0f8669
  Associated tags:
 - 20200225143537
Tags:
- us.gcr.io/apache-beam-testing/java-postcommit-it/java:20200225143537
Deleted [us.gcr.io/apache-beam-testing/java-postcommit-it/java:20200225143537].
Deleted [us.gcr.io/apache-beam-testing/java-postcommit-it/java@sha256:3ee42627f3581741aec14ac18696b90c009a7e2ea0fe3c4538081e852f0f8669].

FAILURE: Build completed with 2 failures.

1: Task failed with an exception.
-----------
* What went wrong:
Execution failed for task ':runners:google-cloud-dataflow-java:examplesJavaFnApiWorkerIntegrationTest'.
> There were failing tests. See the report at: file://<https://builds.apache.org/job/beam_PostCommit_Java_PortabilityApi/ws/src/runners/google-cloud-dataflow-java/build/reports/tests/examplesJavaFnApiWorkerIntegrationTest/index.html>

* Try:
Run with --stacktrace option to get the stack trace. Run with --info or --debug option to
get more log output. Run with --scan to get full insights.
==============================================================================

2: Task failed with an exception.
-----------
* What went wrong:
Execution failed for task ':runners:google-cloud-dataflow-java:googleCloudPlatformFnApiWorkerIntegrationTest'.
> There were failing tests. See the report at: file://<https://builds.apache.org/job/beam_PostCommit_Java_PortabilityApi/ws/src/runners/google-cloud-dataflow-java/build/reports/tests/googleCloudPlatformFnApiWorkerIntegrationTest/index.html>

* Try:
Run with --stacktrace option to get the stack trace. Run with --info or --debug option to
get more log output. Run with --scan to get full insights.
==============================================================================

* Get more help at https://help.gradle.org

Deprecated Gradle features were used in this build, making it incompatible with Gradle 6.0.
Use '--warning-mode all' to show the individual deprecation warnings.
See https://docs.gradle.org/5.2.1/userguide/command_line_interface.html#sec:command_line_warnings

BUILD FAILED in 38m 1s
101 actionable tasks: 72 executed, 28 from cache, 1 up-to-date

Publishing build scan...
https://gradle.com/s/nqipuc6glm3dw

Build step 'Invoke Gradle script' changed build result to FAILURE
Build step 'Invoke Gradle script' marked build as failure

---------------------------------------------------------------------
To unsubscribe, e-mail: builds-unsubscribe@beam.apache.org
For additional commands, e-mail: builds-help@beam.apache.org


Mime
View raw message