beam-builds mailing list archives

Site index · List index
Message view « Date » · « Thread »
Top « Date » · « Thread »
From Apache Jenkins Server <jenk...@builds.apache.org>
Subject Build failed in Jenkins: beam_PostCommit_XVR_Flink #1411
Date Fri, 10 Jan 2020 02:07:44 GMT
See <https://builds.apache.org/job/beam_PostCommit_XVR_Flink/1411/display/redirect?page=changes>

Changes:

[hannahjiang] BEAM-7861 add direct_running_mode option

[hannahjiang] [BEAM-7861] rephrase direct_running_mode option checking


------------------------------------------
Started by GitHub push by ibzib
Started by GitHub push by ibzib
Running as SYSTEM
[EnvInject] - Loading node environment variables.
Building remotely on apache-beam-jenkins-1 (beam) in workspace <https://builds.apache.org/job/beam_PostCommit_XVR_Flink/ws/>
No credentials specified
Wiping out workspace first.
Cloning the remote Git repository
Cloning repository https://github.com/apache/beam.git
 > git init <https://builds.apache.org/job/beam_PostCommit_XVR_Flink/ws/src> # timeout=10
Fetching upstream changes from https://github.com/apache/beam.git
 > git --version # timeout=10
 > git fetch --tags --progress https://github.com/apache/beam.git +refs/heads/*:refs/remotes/origin/*
 > git config remote.origin.url https://github.com/apache/beam.git # timeout=10
 > git config --add remote.origin.fetch +refs/heads/*:refs/remotes/origin/* # timeout=10
 > git config remote.origin.url https://github.com/apache/beam.git # timeout=10
Fetching upstream changes from https://github.com/apache/beam.git
 > git fetch --tags --progress https://github.com/apache/beam.git +refs/heads/*:refs/remotes/origin/*
+refs/pull/${ghprbPullId}/*:refs/remotes/origin/pr/${ghprbPullId}/*
 > git rev-parse origin/master^{commit} # timeout=10
Checking out Revision 0bdd5c2a2390f77f7c7aa119fed178c2bae9e771 (origin/master)
 > git config core.sparsecheckout # timeout=10
 > git checkout -f 0bdd5c2a2390f77f7c7aa119fed178c2bae9e771
Commit message: "Merge pull request #10536 from Hannah-Jiang/add_running_mode_to_fnapi"
 > git rev-list --no-walk 2cba315e10b87a6c1f8c14852299a2e0d7fc3833 # timeout=10
No emails were triggered.
[EnvInject] - Executing scripts and injecting environment variables after the SCM step.
[EnvInject] - Injecting as environment variables the properties content 
SPARK_LOCAL_IP=127.0.0.1

[EnvInject] - Variables injected successfully.
[Gradle] - Launching build.
[src] $ <https://builds.apache.org/job/beam_PostCommit_XVR_Flink/ws/src/gradlew> --continue
--max-workers=12 -Dorg.gradle.jvmargs=-Xms2g -Dorg.gradle.jvmargs=-Xmx4g :runners:flink:1.9:job-server:validatesCrossLanguageRunner
Starting a Gradle Daemon, 1 busy Daemon could not be reused, use --status for details
> Task :buildSrc:compileJava NO-SOURCE
> Task :buildSrc:compileGroovy FROM-CACHE
> Task :buildSrc:pluginDescriptors
> Task :buildSrc:processResources
> Task :buildSrc:classes
> Task :buildSrc:jar
> Task :buildSrc:assemble
> Task :buildSrc:spotlessGroovy
> Task :buildSrc:spotlessGroovyCheck
> Task :buildSrc:spotlessGroovyGradle
> Task :buildSrc:spotlessGroovyGradleCheck
> Task :buildSrc:spotlessCheck
> Task :buildSrc:pluginUnderTestMetadata
> Task :buildSrc:compileTestJava NO-SOURCE
> Task :buildSrc:compileTestGroovy NO-SOURCE
> Task :buildSrc:processTestResources NO-SOURCE
> Task :buildSrc:testClasses UP-TO-DATE
> Task :buildSrc:test NO-SOURCE
> Task :buildSrc:validateTaskProperties FROM-CACHE
> Task :buildSrc:check
> Task :buildSrc:build
Configuration on demand is an incubating feature.

> Configure project :sdks:python:container
Found go 1.12 in /usr/bin/go, use it.

> Configure project :sdks:java:container
Found go 1.12 in /usr/bin/go, use it.

> Configure project :sdks:go
Found go 1.12 in /usr/bin/go, use it.

FAILURE: Build failed with an exception.

* Where:
Build file '<https://builds.apache.org/job/beam_PostCommit_XVR_Flink/ws/src/sdks/java/testing/expansion-service/build.gradle'>
line: 49

* What went wrong:
Could not determine the dependencies of task ':sdks:java:testing:expansion-service:buildTestExpansionServiceJar'.
> Could not resolve all files for configuration ':sdks:java:testing:expansion-service:testRuntime'.
   > Could not resolve net.minidev:json-smart:[1.3.1,2.3].
     Required by:
         project :sdks:java:testing:expansion-service > project :sdks:java:io:parquet >
org.apache.hadoop:hadoop-common:2.8.5 > org.apache.hadoop:hadoop-auth:2.8.5 > com.nimbusds:nimbus-jose-jwt:4.41.1
      > Could not resolve net.minidev:json-smart:2.3-SNAPSHOT.
         > Unable to load Maven meta-data from https://oss.sonatype.org/content/repositories/staging/net/minidev/json-smart/2.3-SNAPSHOT/maven-metadata.xml.
            > Could not get resource 'https://oss.sonatype.org/content/repositories/staging/net/minidev/json-smart/2.3-SNAPSHOT/maven-metadata.xml'.
               > Could not GET 'https://oss.sonatype.org/content/repositories/staging/net/minidev/json-smart/2.3-SNAPSHOT/maven-metadata.xml'.
                  > Read timed out

* Try:
Run with --stacktrace option to get the stack trace. Run with --info or --debug option to
get more log output. Run with --scan to get full insights.

* Get more help at https://help.gradle.org

Deprecated Gradle features were used in this build, making it incompatible with Gradle 6.0.
Use '--warning-mode all' to show the individual deprecation warnings.
See https://docs.gradle.org/5.2.1/userguide/command_line_interface.html#sec:command_line_warnings

BUILD FAILED in 1m 54s

Publishing build scan...
https://gradle.com/s/rojgrgvoharyk

Build step 'Invoke Gradle script' changed build result to FAILURE
Build step 'Invoke Gradle script' marked build as failure

---------------------------------------------------------------------
To unsubscribe, e-mail: builds-unsubscribe@beam.apache.org
For additional commands, e-mail: builds-help@beam.apache.org


Mime
View raw message