beam-builds mailing list archives

Site index · List index
Message view « Date » · « Thread »
Top « Date » · « Thread »
From Apache Jenkins Server <jenk...@builds.apache.org>
Subject Build failed in Jenkins: beam_PreCommit_Python_Cron #2316
Date Fri, 24 Jan 2020 18:48:49 GMT
See <https://builds.apache.org/job/beam_PreCommit_Python_Cron/2316/display/redirect?page=changes>

Changes:

[iemejia] [BEAM-9170] Unify Jenkins job names related to Java 11 testing


------------------------------------------
[...truncated 1.06 MB...]
    | "MapApache" >> beam.FlatMap(

apache_beam/io/fileio_test.py:544
  <https://builds.apache.org/job/beam_PreCommit_Python_Cron/ws/src/sdks/python/test-suites/tox/py2/build/srcs/sdks/python/apache_beam/io/fileio_test.py>:544:
FutureWarning: WriteToFiles is experimental.
    | beam.ParDo(self.record_dofn()))

apache_beam/io/fileio_test.py:548
  <https://builds.apache.org/job/beam_PreCommit_Python_Cron/ws/src/sdks/python/test-suites/tox/py2/build/srcs/sdks/python/apache_beam/io/fileio_test.py>:548:
FutureWarning: MatchFiles is experimental.
    files = (p | beam.io.fileio.MatchFiles(FileSystems.join(dir, '*')))

apache_beam/io/fileio_test.py:555
  <https://builds.apache.org/job/beam_PreCommit_Python_Cron/ws/src/sdks/python/test-suites/tox/py2/build/srcs/sdks/python/apache_beam/io/fileio_test.py>:555:
FutureWarning: ReadMatches is experimental.
    | beam.Map(lambda rf: (rf.metadata.path,

apache_beam/io/mongodbio_test.py:304
  <https://builds.apache.org/job/beam_PreCommit_Python_Cron/ws/src/sdks/python/test-suites/tox/py2/build/srcs/sdks/python/apache_beam/io/mongodbio_test.py>:304:
FutureWarning: WriteToMongoDB is experimental.
    | "Write" >> WriteToMongoDB(db='test', coll='test'))

apache_beam/io/parquetio_test.py:362
  <https://builds.apache.org/job/beam_PreCommit_Python_Cron/ws/src/sdks/python/test-suites/tox/py2/build/srcs/sdks/python/apache_beam/io/parquetio_test.py>:362:
FutureWarning: The parameter chunksize is deprecated for pyarrow.Table.to_batches as of 0.15,
please use the parameter max_chunksize instead
    count=12000).to_batches(chunksize=1000)

apache_beam/runners/portability/fn_api_runner_test.py:1230
apache_beam/runners/portability/fn_api_runner_test.py:1230
apache_beam/runners/portability/fn_api_runner_test.py:1230
apache_beam/runners/portability/fn_api_runner_test.py:1230
apache_beam/runners/portability/fn_api_runner_test.py:1230
apache_beam/runners/portability/fn_api_runner_test.py:1230
apache_beam/runners/portability/fn_api_runner_test.py:1230
apache_beam/runners/portability/fn_api_runner_test.py:1230
apache_beam/runners/portability/fn_api_runner_test.py:1230
apache_beam/runners/portability/fn_api_runner_test.py:1230
apache_beam/runners/portability/fn_api_runner_test.py:1230
apache_beam/runners/portability/fn_api_runner_test.py:1230
apache_beam/runners/portability/fn_api_runner_test.py:1230
apache_beam/runners/portability/fn_api_runner_test.py:1230
apache_beam/runners/portability/fn_api_runner_test.py:1230
apache_beam/runners/portability/fn_api_runner_test.py:1230
apache_beam/runners/portability/fn_api_runner_test.py:1230
apache_beam/runners/portability/fn_api_runner_test.py:1230
apache_beam/runners/portability/fn_api_runner_test.py:1230
apache_beam/runners/portability/fn_api_runner_test.py:1230
apache_beam/runners/portability/fn_api_runner_test.py:1230
apache_beam/runners/portability/fn_api_runner_test.py:1230
apache_beam/runners/portability/fn_api_runner_test.py:1230
apache_beam/runners/portability/fn_api_runner_test.py:1230
apache_beam/runners/portability/fn_api_runner_test.py:1230
apache_beam/runners/portability/fn_api_runner_test.py:1230
apache_beam/runners/portability/fn_api_runner_test.py:1230
apache_beam/runners/portability/fn_api_runner_test.py:1230
apache_beam/runners/portability/fn_api_runner_test.py:1230
apache_beam/runners/portability/fn_api_runner_test.py:1230
apache_beam/runners/portability/fn_api_runner_test.py:1230
apache_beam/runners/portability/fn_api_runner_test.py:1230
  <https://builds.apache.org/job/beam_PreCommit_Python_Cron/ws/src/sdks/python/test-suites/tox/py2/build/srcs/sdks/python/apache_beam/runners/portability/fn_api_runner_test.py>:1230:
BeamDeprecationWarning: options is deprecated since First stable release. References to <pipeline>.options
will not be supported
    p.options.view_as(DebugOptions).experiments.remove('beam_fn_api')

apache_beam/runners/portability/fn_api_runner_test.py:1178
apache_beam/runners/portability/fn_api_runner_test.py:1178
apache_beam/runners/portability/fn_api_runner_test.py:1178
apache_beam/runners/portability/fn_api_runner_test.py:1178
apache_beam/runners/portability/fn_api_runner_test.py:1178
apache_beam/runners/portability/fn_api_runner_test.py:1178
apache_beam/runners/portability/fn_api_runner_test.py:1178
apache_beam/runners/portability/fn_api_runner_test.py:1178
apache_beam/runners/portability/fn_api_runner_test.py:1178
apache_beam/runners/portability/fn_api_runner_test.py:1178
apache_beam/runners/portability/fn_api_runner_test.py:1178
apache_beam/runners/portability/fn_api_runner_test.py:1178
apache_beam/runners/portability/fn_api_runner_test.py:1178
apache_beam/runners/portability/fn_api_runner_test.py:1178
apache_beam/runners/portability/fn_api_runner_test.py:1178
apache_beam/runners/portability/fn_api_runner_test.py:1178
apache_beam/runners/portability/fn_api_runner_test.py:1178
apache_beam/runners/portability/fn_api_runner_test.py:1178
apache_beam/runners/portability/fn_api_runner_test.py:1178
apache_beam/runners/portability/fn_api_runner_test.py:1178
apache_beam/runners/portability/fn_api_runner_test.py:1178
apache_beam/runners/portability/fn_api_runner_test.py:1178
apache_beam/runners/portability/fn_api_runner_test.py:1178
apache_beam/runners/portability/fn_api_runner_test.py:1178
apache_beam/runners/portability/fn_api_runner_test.py:1178
apache_beam/runners/portability/fn_api_runner_test.py:1178
apache_beam/runners/portability/fn_api_runner_test.py:1178
apache_beam/runners/portability/fn_api_runner_test.py:1178
apache_beam/runners/portability/fn_api_runner_test.py:1178
apache_beam/runners/portability/fn_api_runner_test.py:1178
apache_beam/runners/portability/fn_api_runner_test.py:1178
apache_beam/runners/portability/fn_api_runner_test.py:1178
apache_beam/runners/portability/fn_api_runner_test.py:1178
  <https://builds.apache.org/job/beam_PreCommit_Python_Cron/ws/src/sdks/python/test-suites/tox/py2/build/srcs/sdks/python/apache_beam/runners/portability/fn_api_runner_test.py>:1178:
BeamDeprecationWarning: options is deprecated since First stable release. References to <pipeline>.options
will not be supported
    p.options.view_as(DebugOptions).experiments.remove('beam_fn_api')

apache_beam/runners/portability/fn_api_runner_test.py:1200
apache_beam/runners/portability/fn_api_runner_test.py:1200
apache_beam/runners/portability/fn_api_runner_test.py:1200
apache_beam/runners/portability/fn_api_runner_test.py:1200
apache_beam/runners/portability/fn_api_runner_test.py:1200
apache_beam/runners/portability/fn_api_runner_test.py:1200
apache_beam/runners/portability/fn_api_runner_test.py:1200
apache_beam/runners/portability/fn_api_runner_test.py:1200
apache_beam/runners/portability/fn_api_runner_test.py:1200
apache_beam/runners/portability/fn_api_runner_test.py:1200
apache_beam/runners/portability/fn_api_runner_test.py:1200
apache_beam/runners/portability/fn_api_runner_test.py:1200
apache_beam/runners/portability/fn_api_runner_test.py:1200
apache_beam/runners/portability/fn_api_runner_test.py:1200
apache_beam/runners/portability/fn_api_runner_test.py:1200
apache_beam/runners/portability/fn_api_runner_test.py:1200
apache_beam/runners/portability/fn_api_runner_test.py:1200
apache_beam/runners/portability/fn_api_runner_test.py:1200
apache_beam/runners/portability/fn_api_runner_test.py:1200
apache_beam/runners/portability/fn_api_runner_test.py:1200
apache_beam/runners/portability/fn_api_runner_test.py:1200
apache_beam/runners/portability/fn_api_runner_test.py:1200
apache_beam/runners/portability/fn_api_runner_test.py:1200
apache_beam/runners/portability/fn_api_runner_test.py:1200
apache_beam/runners/portability/fn_api_runner_test.py:1200
apache_beam/runners/portability/fn_api_runner_test.py:1200
apache_beam/runners/portability/fn_api_runner_test.py:1200
apache_beam/runners/portability/fn_api_runner_test.py:1200
apache_beam/runners/portability/fn_api_runner_test.py:1200
apache_beam/runners/portability/fn_api_runner_test.py:1200
apache_beam/runners/portability/fn_api_runner_test.py:1200
apache_beam/runners/portability/fn_api_runner_test.py:1200
apache_beam/runners/portability/fn_api_runner_test.py:1200
  <https://builds.apache.org/job/beam_PreCommit_Python_Cron/ws/src/sdks/python/test-suites/tox/py2/build/srcs/sdks/python/apache_beam/runners/portability/fn_api_runner_test.py>:1200:
BeamDeprecationWarning: options is deprecated since First stable release. References to <pipeline>.options
will not be supported
    p.options.view_as(DebugOptions).experiments.remove('beam_fn_api')

apache_beam/runners/portability/fn_api_runner_test.py:1560
apache_beam/runners/portability/fn_api_runner_test.py:1560
apache_beam/runners/portability/fn_api_runner_test.py:1560
apache_beam/runners/portability/fn_api_runner_test.py:1560
  <https://builds.apache.org/job/beam_PreCommit_Python_Cron/ws/src/sdks/python/test-suites/tox/py2/build/srcs/sdks/python/apache_beam/runners/portability/fn_api_runner_test.py>:1560:
BeamDeprecationWarning: options is deprecated since First stable release. References to <pipeline>.options
will not be supported
    p.options.view_as(DebugOptions).experiments.remove('beam_fn_api')

apache_beam/transforms/ptransform_test.py:706
  <https://builds.apache.org/job/beam_PreCommit_Python_Cron/ws/src/sdks/python/test-suites/tox/py2/build/srcs/sdks/python/apache_beam/transforms/ptransform_test.py>:706:
BeamDeprecationWarning: RemoveDuplicates is deprecated since 2.12. Use Distinct instead.
    result = pcoll.apply(beam.RemoveDuplicates())

apache_beam/transforms/trigger_test.py:913
apache_beam/transforms/trigger_test.py:913
apache_beam/transforms/trigger_test.py:913
apache_beam/transforms/trigger_test.py:913
apache_beam/transforms/trigger_test.py:913
apache_beam/transforms/trigger_test.py:913
apache_beam/transforms/trigger_test.py:913
apache_beam/transforms/trigger_test.py:913
apache_beam/transforms/trigger_test.py:913
apache_beam/transforms/trigger_test.py:913
apache_beam/transforms/trigger_test.py:913
apache_beam/transforms/trigger_test.py:913
apache_beam/transforms/trigger_test.py:913
apache_beam/transforms/trigger_test.py:913
apache_beam/transforms/trigger_test.py:913
apache_beam/transforms/trigger_test.py:913
apache_beam/transforms/trigger_test.py:913
apache_beam/transforms/trigger_test.py:913
apache_beam/transforms/trigger_test.py:913
apache_beam/transforms/trigger_test.py:913
apache_beam/transforms/trigger_test.py:913
apache_beam/transforms/trigger_test.py:913
apache_beam/transforms/trigger_test.py:913
apache_beam/transforms/trigger_test.py:913
apache_beam/transforms/trigger_test.py:913
apache_beam/transforms/trigger_test.py:913
  <https://builds.apache.org/job/beam_PreCommit_Python_Cron/ws/src/sdks/python/test-suites/tox/py2/build/srcs/sdks/python/apache_beam/transforms/trigger_test.py>:913:
BeamDeprecationWarning: options is deprecated since First stable release. References to <pipeline>.options
will not be supported
    p.options.view_as(StandardOptions).streaming = True

apache_beam/transforms/combiners.py:198
apache_beam/transforms/combiners.py:198
apache_beam/transforms/combiners.py:198
  <https://builds.apache.org/job/beam_PreCommit_Python_Cron/ws/src/sdks/python/test-suites/tox/py2/build/srcs/sdks/python/apache_beam/transforms/combiners.py>:198:
DeprecationWarning: Compare not available in Python 3, use key instead.
    DeprecationWarning)

apache_beam/transforms/combiners.py:287
  <https://builds.apache.org/job/beam_PreCommit_Python_Cron/ws/src/sdks/python/test-suites/tox/py2/build/srcs/sdks/python/apache_beam/transforms/combiners.py>:287:
DeprecationWarning: Compare not available in Python 3, use key instead.
    DeprecationWarning)

apache_beam/transforms/util_test.py:585
  <https://builds.apache.org/job/beam_PreCommit_Python_Cron/ws/src/sdks/python/test-suites/tox/py2/build/srcs/sdks/python/apache_beam/transforms/util_test.py>:585:
FutureWarning: GroupIntoBatches is experimental.
    | util.GroupIntoBatches(GroupIntoBatchesTest.BATCH_SIZE)

apache_beam/transforms/util.py:749
  <https://builds.apache.org/job/beam_PreCommit_Python_Cron/ws/src/sdks/python/test-suites/tox/py2/build/srcs/sdks/python/apache_beam/transforms/util.py>:749:
UserWarning: Use of GroupIntoBatches transform requires State/Timer support from the runner
    warnings.warn('Use of GroupIntoBatches transform requires State/Timer '

-- Docs: https://docs.pytest.org/en/latest/warnings.html
- generated xml file: <https://builds.apache.org/job/beam_PreCommit_Python_Cron/ws/src/sdks/python/test-suites/tox/py2/build/srcs/sdks/python/pytest_py27-cython-pytest.xml>
-
=========== 2439 passed, 599 skipped, 219 warnings in 546.61 seconds ===========
============================= test session starts ==============================
platform linux2 -- Python 2.7.12, pytest-4.6.9, py-1.8.1, pluggy-0.13.1
cachedir: target/.tox-py27-cython-pytest/py27-cython-pytest/.pytest_cache
rootdir: <https://builds.apache.org/job/beam_PreCommit_Python_Cron/ws/src/sdks/python/test-suites/tox/py2/build/srcs/sdks/python,>
inifile: pytest.ini
plugins: requests-mock-1.7.0, forked-1.1.3, xdist-1.31.0
collected 3097 items / 3038 deselected / 59 selected

apache_beam/coders/fast_coders_test.py ............................      [ 47%]
apache_beam/coders/slow_coders_test.py ............................      [ 94%]
apache_beam/io/gcp/tests/bigquery_matcher_test.py s                      [ 96%]
apache_beam/runners/dataflow/dataflow_runner_test.py s                   [ 98%]
apache_beam/runners/portability/stager_test.py .                         [100%]

=============================== warnings summary ===============================
apache_beam/__init__.py:84
  <https://builds.apache.org/job/beam_PreCommit_Python_Cron/ws/src/sdks/python/test-suites/tox/py2/build/srcs/sdks/python/apache_beam/__init__.py>:84:
UserWarning: You are using Apache Beam with Python 2. New releases of Apache Beam will soon
support Python 3 only.
    'You are using Apache Beam with Python 2. '

target/.tox-py27-cython-pytest/py27-cython-pytest/local/lib/python2.7/site-packages/py/_code/_assertionold.py:3
  <https://builds.apache.org/job/beam_PreCommit_Python_Cron/ws/src/sdks/python/test-suites/tox/py2/build/srcs/sdks/python/target/.tox-py27-cython-pytest/py27-cython-pytest/local/lib/python2.7/site-packages/py/_code/_assertionold.py>:3:
DeprecationWarning: The compiler package is deprecated and removed in Python 3.x.
    from compiler import parse, ast, pycodegen

apache_beam/transforms/trigger_test.py:513
  <https://builds.apache.org/job/beam_PreCommit_Python_Cron/ws/src/sdks/python/test-suites/tox/py2/build/srcs/sdks/python/apache_beam/transforms/trigger_test.py>:513:
YAMLLoadWarning: calling yaml.load_all() without Loader=... is deprecated, as the default
Loader is unsafe. Please read https://msg.pyyaml.org/load for full details.
    for spec in yaml.load_all(open(transcript_filename)):

-- Docs: https://docs.pytest.org/en/latest/warnings.html
- generated xml file: <https://builds.apache.org/job/beam_PreCommit_Python_Cron/ws/src/sdks/python/test-suites/tox/py2/build/srcs/sdks/python/pytest_py27-cython-pytest_no_xdist.xml>
-
====== 57 passed, 2 skipped, 3038 deselected, 3 warnings in 7.65 seconds =======
py27-cython-pytest run-test-post: commands[0] | <https://builds.apache.org/job/beam_PreCommit_Python_Cron/ws/src/sdks/python/test-suites/tox/py2/build/srcs/sdks/python/scripts/run_tox_cleanup.sh>
___________________________________ summary ____________________________________
  py27-cython-pytest: commands succeeded
  congratulations :)

> Task :sdks:python:test-suites:tox:py2:preCommitPy2

FAILURE: Build failed with an exception.

* What went wrong:
Execution failed for task ':sdks:python:test-suites:tox:py35:testPy35Gcp'.
> Process 'command 'sh'' finished with non-zero exit value 1

* Try:
Run with --stacktrace option to get the stack trace. Run with --info or --debug option to
get more log output. Run with --scan to get full insights.

* Get more help at https://help.gradle.org

Deprecated Gradle features were used in this build, making it incompatible with Gradle 6.0.
Use '--warning-mode all' to show the individual deprecation warnings.
See https://docs.gradle.org/5.2.1/userguide/command_line_interface.html#sec:command_line_warnings

BUILD FAILED in 32m 42s
78 actionable tasks: 61 executed, 17 from cache

Publishing build scan...
https://gradle.com/s/hsl7fq2urxdnm

Build step 'Invoke Gradle script' changed build result to FAILURE
Build step 'Invoke Gradle script' marked build as failure

---------------------------------------------------------------------
To unsubscribe, e-mail: builds-unsubscribe@beam.apache.org
For additional commands, e-mail: builds-help@beam.apache.org


Mime
View raw message