beam-builds mailing list archives

Site index · List index
Message view « Date » · « Thread »
Top « Date » · « Thread »
From Apache Jenkins Server <jenk...@builds.apache.org>
Subject Build failed in Jenkins: beam_PostCommit_XVR_Flink #1525
Date Wed, 22 Jan 2020 12:19:37 GMT
See <https://builds.apache.org/job/beam_PostCommit_XVR_Flink/1525/display/redirect>

Changes:


------------------------------------------
[...truncated 4.76 MB...]
    self.consumer.process(windowed_value)
  File "apache_beam/runners/worker/operations.py", line 657, in apache_beam.runners.worker.operations.DoOperation.process
    with self.scoped_process_state:
  File "apache_beam/runners/worker/operations.py", line 658, in apache_beam.runners.worker.operations.DoOperation.process
    delayed_application = self.dofn_receiver.receive(o)
  File "apache_beam/runners/common.py", line 878, in apache_beam.runners.common.DoFnRunner.receive
    self.process(windowed_value)
  File "apache_beam/runners/common.py", line 885, in apache_beam.runners.common.DoFnRunner.process
    self._reraise_augmented(exn)
  File "apache_beam/runners/common.py", line 956, in apache_beam.runners.common.DoFnRunner._reraise_augmented
    raise_with_traceback(new_exn)
  File "apache_beam/runners/common.py", line 883, in apache_beam.runners.common.DoFnRunner.process
    return self.do_fn_invoker.invoke_process(windowed_value)
  File "apache_beam/runners/common.py", line 498, in apache_beam.runners.common.SimpleInvoker.invoke_process
    windowed_value, self.process_method(windowed_value.value))
  File "<https://builds.apache.org/job/beam_PostCommit_XVR_Flink/ws/src/sdks/python/apache_beam/transforms/core.py",>
line 1437, in <lambda>
  File "<https://builds.apache.org/job/beam_PostCommit_XVR_Flink/ws/src/sdks/python/apache_beam/testing/util.py",>
line 191, in _equal
BeamAssertException: Failed assert: ['a: 3', 'b: 1', 'c: 2'] == [], missing elements ['a:
3', 'b: 1', 'c: 2'] [while running 'assert_that/Match']

	at java.util.concurrent.CompletableFuture.reportGet(CompletableFuture.java:357)
	at java.util.concurrent.CompletableFuture.get(CompletableFuture.java:1908)
	at org.apache.beam.sdk.util.MoreFutures.get(MoreFutures.java:57)
	at org.apache.beam.runners.fnexecution.control.SdkHarnessClient$BundleProcessor$ActiveBundle.close(SdkHarnessClient.java:345)
	at org.apache.beam.runners.flink.translation.functions.FlinkExecutableStageFunction.$closeResource(FlinkExecutableStageFunction.java:204)
	at org.apache.beam.runners.flink.translation.functions.FlinkExecutableStageFunction.mapPartition(FlinkExecutableStageFunction.java:204)
	at org.apache.flink.runtime.operators.MapPartitionDriver.run(MapPartitionDriver.java:103)
	at org.apache.flink.runtime.operators.BatchTask.run(BatchTask.java:504)
	at org.apache.flink.runtime.operators.BatchTask.invoke(BatchTask.java:369)
	at org.apache.flink.runtime.taskmanager.Task.doRun(Task.java:705)
	at org.apache.flink.runtime.taskmanager.Task.run(Task.java:530)
	... 1 more
Caused by: java.lang.RuntimeException: Error received from SDK harness for instruction 133:
Traceback (most recent call last):
  File "/usr/local/lib/python2.7/site-packages/apache_beam/runners/worker/sdk_worker.py",
line 167, in _execute
    response = task()
  File "/usr/local/lib/python2.7/site-packages/apache_beam/runners/worker/sdk_worker.py",
line 223, in <lambda>
    lambda: self.create_worker().do_instruction(request), request)
  File "/usr/local/lib/python2.7/site-packages/apache_beam/runners/worker/sdk_worker.py",
line 352, in do_instruction
    request.instruction_id)
  File "/usr/local/lib/python2.7/site-packages/apache_beam/runners/worker/sdk_worker.py",
line 386, in process_bundle
    bundle_processor.process_bundle(instruction_id))
  File "/usr/local/lib/python2.7/site-packages/apache_beam/runners/worker/bundle_processor.py",
line 812, in process_bundle
    data.transform_id].process_encoded(data.data)
  File "/usr/local/lib/python2.7/site-packages/apache_beam/runners/worker/bundle_processor.py",
line 205, in process_encoded
    self.output(decoded_value)
  File "apache_beam/runners/worker/operations.py", line 302, in apache_beam.runners.worker.operations.Operation.output
    def output(self, windowed_value, output_index=0):
  File "apache_beam/runners/worker/operations.py", line 304, in apache_beam.runners.worker.operations.Operation.output
    cython.cast(Receiver, self.receivers[output_index]).receive(windowed_value)
  File "apache_beam/runners/worker/operations.py", line 178, in apache_beam.runners.worker.operations.SingletonConsumerSet.receive
    self.consumer.process(windowed_value)
  File "apache_beam/runners/worker/operations.py", line 657, in apache_beam.runners.worker.operations.DoOperation.process
    with self.scoped_process_state:
  File "apache_beam/runners/worker/operations.py", line 658, in apache_beam.runners.worker.operations.DoOperation.process
    delayed_application = self.dofn_receiver.receive(o)
  File "apache_beam/runners/common.py", line 878, in apache_beam.runners.common.DoFnRunner.receive
    self.process(windowed_value)
  File "apache_beam/runners/common.py", line 885, in apache_beam.runners.common.DoFnRunner.process
    self._reraise_augmented(exn)
  File "apache_beam/runners/common.py", line 941, in apache_beam.runners.common.DoFnRunner._reraise_augmented
    raise
  File "apache_beam/runners/common.py", line 883, in apache_beam.runners.common.DoFnRunner.process
    return self.do_fn_invoker.invoke_process(windowed_value)
  File "apache_beam/runners/common.py", line 667, in apache_beam.runners.common.PerWindowInvoker.invoke_process
    self._invoke_process_per_window(
  File "apache_beam/runners/common.py", line 747, in apache_beam.runners.common.PerWindowInvoker._invoke_process_per_window
    self.output_processor.process_outputs(
  File "apache_beam/runners/common.py", line 1028, in apache_beam.runners.common._OutputProcessor.process_outputs
    self.main_receivers.receive(windowed_value)
  File "apache_beam/runners/worker/operations.py", line 178, in apache_beam.runners.worker.operations.SingletonConsumerSet.receive
    self.consumer.process(windowed_value)
  File "apache_beam/runners/worker/operations.py", line 657, in apache_beam.runners.worker.operations.DoOperation.process
    with self.scoped_process_state:
  File "apache_beam/runners/worker/operations.py", line 658, in apache_beam.runners.worker.operations.DoOperation.process
    delayed_application = self.dofn_receiver.receive(o)
  File "apache_beam/runners/common.py", line 878, in apache_beam.runners.common.DoFnRunner.receive
    self.process(windowed_value)
  File "apache_beam/runners/common.py", line 885, in apache_beam.runners.common.DoFnRunner.process
    self._reraise_augmented(exn)
  File "apache_beam/runners/common.py", line 941, in apache_beam.runners.common.DoFnRunner._reraise_augmented
    raise
  File "apache_beam/runners/common.py", line 883, in apache_beam.runners.common.DoFnRunner.process
    return self.do_fn_invoker.invoke_process(windowed_value)
  File "apache_beam/runners/common.py", line 497, in apache_beam.runners.common.SimpleInvoker.invoke_process
    self.output_processor.process_outputs(
  File "apache_beam/runners/common.py", line 1028, in apache_beam.runners.common._OutputProcessor.process_outputs
    self.main_receivers.receive(windowed_value)
  File "apache_beam/runners/worker/operations.py", line 178, in apache_beam.runners.worker.operations.SingletonConsumerSet.receive
    self.consumer.process(windowed_value)
  File "apache_beam/runners/worker/operations.py", line 657, in apache_beam.runners.worker.operations.DoOperation.process
    with self.scoped_process_state:
  File "apache_beam/runners/worker/operations.py", line 658, in apache_beam.runners.worker.operations.DoOperation.process
    delayed_application = self.dofn_receiver.receive(o)
  File "apache_beam/runners/common.py", line 878, in apache_beam.runners.common.DoFnRunner.receive
    self.process(windowed_value)
  File "apache_beam/runners/common.py", line 885, in apache_beam.runners.common.DoFnRunner.process
    self._reraise_augmented(exn)
  File "apache_beam/runners/common.py", line 956, in apache_beam.runners.common.DoFnRunner._reraise_augmented
    raise_with_traceback(new_exn)
  File "apache_beam/runners/common.py", line 883, in apache_beam.runners.common.DoFnRunner.process
    return self.do_fn_invoker.invoke_process(windowed_value)
  File "apache_beam/runners/common.py", line 498, in apache_beam.runners.common.SimpleInvoker.invoke_process
    windowed_value, self.process_method(windowed_value.value))
  File "<https://builds.apache.org/job/beam_PostCommit_XVR_Flink/ws/src/sdks/python/apache_beam/transforms/core.py",>
line 1437, in <lambda>
  File "<https://builds.apache.org/job/beam_PostCommit_XVR_Flink/ws/src/sdks/python/apache_beam/testing/util.py",>
line 191, in _equal
BeamAssertException: Failed assert: ['a: 3', 'b: 1', 'c: 2'] == [], missing elements ['a:
3', 'b: 1', 'c: 2'] [while running 'assert_that/Match']

	at org.apache.beam.runners.fnexecution.control.FnApiControlClient$ResponseStreamObserver.onNext(FnApiControlClient.java:160)
	at org.apache.beam.runners.fnexecution.control.FnApiControlClient$ResponseStreamObserver.onNext(FnApiControlClient.java:140)
	at org.apache.beam.vendor.grpc.v1p26p0.io.grpc.stub.ServerCalls$StreamingServerCallHandler$StreamingServerCallListener.onMessage(ServerCalls.java:251)
	at org.apache.beam.vendor.grpc.v1p26p0.io.grpc.ForwardingServerCallListener.onMessage(ForwardingServerCallListener.java:33)
	at org.apache.beam.vendor.grpc.v1p26p0.io.grpc.Contexts$ContextualizedServerCallListener.onMessage(Contexts.java:76)
	at org.apache.beam.vendor.grpc.v1p26p0.io.grpc.internal.ServerCallImpl$ServerStreamListenerImpl.messagesAvailableInternal(ServerCallImpl.java:309)
	at org.apache.beam.vendor.grpc.v1p26p0.io.grpc.internal.ServerCallImpl$ServerStreamListenerImpl.messagesAvailable(ServerCallImpl.java:292)
	at org.apache.beam.vendor.grpc.v1p26p0.io.grpc.internal.ServerImpl$JumpToApplicationThreadServerStreamListener$1MessagesAvailable.runInContext(ServerImpl.java:782)
	at org.apache.beam.vendor.grpc.v1p26p0.io.grpc.internal.ContextRunnable.run(ContextRunnable.java:37)
	at org.apache.beam.vendor.grpc.v1p26p0.io.grpc.internal.SerializingExecutor.run(SerializingExecutor.java:123)
	at java.util.concurrent.ThreadPoolExecutor.runWorker(ThreadPoolExecutor.java:1149)
	at java.util.concurrent.ThreadPoolExecutor$Worker.run(ThreadPoolExecutor.java:624)
	... 1 more

root: ERROR: java.lang.RuntimeException: Error received from SDK harness for instruction 133:
Traceback (most recent call last):
  File "/usr/local/lib/python2.7/site-packages/apache_beam/runners/worker/sdk_worker.py",
line 167, in _execute
    response = task()
  File "/usr/local/lib/python2.7/site-packages/apache_beam/runners/worker/sdk_worker.py",
line 223, in <lambda>
    lambda: self.create_worker().do_instruction(request), request)
  File "/usr/local/lib/python2.7/site-packages/apache_beam/runners/worker/sdk_worker.py",
line 352, in do_instruction
    request.instruction_id)
  File "/usr/local/lib/python2.7/site-packages/apache_beam/runners/worker/sdk_worker.py",
line 386, in process_bundle
    bundle_processor.process_bundle(instruction_id))
  File "/usr/local/lib/python2.7/site-packages/apache_beam/runners/worker/bundle_processor.py",
line 812, in process_bundle
    data.transform_id].process_encoded(data.data)
  File "/usr/local/lib/python2.7/site-packages/apache_beam/runners/worker/bundle_processor.py",
line 205, in process_encoded
    self.output(decoded_value)
  File "apache_beam/runners/worker/operations.py", line 302, in apache_beam.runners.worker.operations.Operation.output
    def output(self, windowed_value, output_index=0):
  File "apache_beam/runners/worker/operations.py", line 304, in apache_beam.runners.worker.operations.Operation.output
    cython.cast(Receiver, self.receivers[output_index]).receive(windowed_value)
  File "apache_beam/runners/worker/operations.py", line 178, in apache_beam.runners.worker.operations.SingletonConsumerSet.receive
    self.consumer.process(windowed_value)
  File "apache_beam/runners/worker/operations.py", line 657, in apache_beam.runners.worker.operations.DoOperation.process
    with self.scoped_process_state:
  File "apache_beam/runners/worker/operations.py", line 658, in apache_beam.runners.worker.operations.DoOperation.process
    delayed_application = self.dofn_receiver.receive(o)
  File "apache_beam/runners/common.py", line 878, in apache_beam.runners.common.DoFnRunner.receive
    self.process(windowed_value)
  File "apache_beam/runners/common.py", line 885, in apache_beam.runners.common.DoFnRunner.process
    self._reraise_augmented(exn)
  File "apache_beam/runners/common.py", line 941, in apache_beam.runners.common.DoFnRunner._reraise_augmented
    raise
  File "apache_beam/runners/common.py", line 883, in apache_beam.runners.common.DoFnRunner.process
    return self.do_fn_invoker.invoke_process(windowed_value)
  File "apache_beam/runners/common.py", line 667, in apache_beam.runners.common.PerWindowInvoker.invoke_process
    self._invoke_process_per_window(
  File "apache_beam/runners/common.py", line 747, in apache_beam.runners.common.PerWindowInvoker._invoke_process_per_window
    self.output_processor.process_outputs(
  File "apache_beam/runners/common.py", line 1028, in apache_beam.runners.common._OutputProcessor.process_outputs
    self.main_receivers.receive(windowed_value)
  File "apache_beam/runners/worker/operations.py", line 178, in apache_beam.runners.worker.operations.SingletonConsumerSet.receive
    self.consumer.process(windowed_value)
  File "apache_beam/runners/worker/operations.py", line 657, in apache_beam.runners.worker.operations.DoOperation.process
    with self.scoped_process_state:
  File "apache_beam/runners/worker/operations.py", line 658, in apache_beam.runners.worker.operations.DoOperation.process
    delayed_application = self.dofn_receiver.receive(o)
  File "apache_beam/runners/common.py", line 878, in apache_beam.runners.common.DoFnRunner.receive
    self.process(windowed_value)
  File "apache_beam/runners/common.py", line 885, in apache_beam.runners.common.DoFnRunner.process
    self._reraise_augmented(exn)
  File "apache_beam/runners/common.py", line 941, in apache_beam.runners.common.DoFnRunner._reraise_augmented
    raise
  File "apache_beam/runners/common.py", line 883, in apache_beam.runners.common.DoFnRunner.process
    return self.do_fn_invoker.invoke_process(windowed_value)
  File "apache_beam/runners/common.py", line 497, in apache_beam.runners.common.SimpleInvoker.invoke_process
    self.output_processor.process_outputs(
  File "apache_beam/runners/common.py", line 1028, in apache_beam.runners.common._OutputProcessor.process_outputs
    self.main_receivers.receive(windowed_value)
  File "apache_beam/runners/worker/operations.py", line 178, in apache_beam.runners.worker.operations.SingletonConsumerSet.receive
    self.consumer.process(windowed_value)
  File "apache_beam/runners/worker/operations.py", line 657, in apache_beam.runners.worker.operations.DoOperation.process
    with self.scoped_process_state:
  File "apache_beam/runners/worker/operations.py", line 658, in apache_beam.runners.worker.operations.DoOperation.process
    delayed_application = self.dofn_receiver.receive(o)
  File "apache_beam/runners/common.py", line 878, in apache_beam.runners.common.DoFnRunner.receive
    self.process(windowed_value)
  File "apache_beam/runners/common.py", line 885, in apache_beam.runners.common.DoFnRunner.process
    self._reraise_augmented(exn)
  File "apache_beam/runners/common.py", line 956, in apache_beam.runners.common.DoFnRunner._reraise_augmented
    raise_with_traceback(new_exn)
  File "apache_beam/runners/common.py", line 883, in apache_beam.runners.common.DoFnRunner.process
    return self.do_fn_invoker.invoke_process(windowed_value)
  File "apache_beam/runners/common.py", line 498, in apache_beam.runners.common.SimpleInvoker.invoke_process
    windowed_value, self.process_method(windowed_value.value))
  File "<https://builds.apache.org/job/beam_PostCommit_XVR_Flink/ws/src/sdks/python/apache_beam/transforms/core.py",>
line 1437, in <lambda>
  File "<https://builds.apache.org/job/beam_PostCommit_XVR_Flink/ws/src/sdks/python/apache_beam/testing/util.py",>
line 191, in _equal
BeamAssertException: Failed assert: ['a: 3', 'b: 1', 'c: 2'] == [], missing elements ['a:
3', 'b: 1', 'c: 2'] [while running 'assert_that/Match']

apache_beam.runners.portability.portable_runner: INFO: Job state changed to FAILED
--------------------- >> end captured logging << ---------------------

----------------------------------------------------------------------
XML: nosetests-xlangValidateRunner.xml
----------------------------------------------------------------------
XML: <https://builds.apache.org/job/beam_PostCommit_XVR_Flink/ws/src/sdks/python/nosetests.xml>
----------------------------------------------------------------------
Ran 10 tests in 104.614s

FAILED (SKIP=1, errors=1)

> Task :runners:flink:1.9:job-server:validatesCrossLanguageRunnerPythonUsingPython FAILED

> Task :runners:flink:1.9:job-server:validatesCrossLanguageRunnerCleanup
Stopping expansion service pid: 20922.
Stopping expansion service pid: 20923.

FAILURE: Build completed with 2 failures.

1: Task failed with an exception.
-----------
* What went wrong:
Execution failed for task ':runners:flink:1.9:job-server:validatesCrossLanguageRunnerPythonUsingJava'.
> Process 'command 'sh'' finished with non-zero exit value 1

* Try:
Run with --stacktrace option to get the stack trace. Run with --info or --debug option to
get more log output. Run with --scan to get full insights.
==============================================================================

2: Task failed with an exception.
-----------
* What went wrong:
Execution failed for task ':runners:flink:1.9:job-server:validatesCrossLanguageRunnerPythonUsingPython'.
> Process 'command 'sh'' finished with non-zero exit value 1

* Try:
Run with --stacktrace option to get the stack trace. Run with --info or --debug option to
get more log output. Run with --scan to get full insights.
==============================================================================

* Get more help at https://help.gradle.org

Deprecated Gradle features were used in this build, making it incompatible with Gradle 6.0.
Use '--warning-mode all' to show the individual deprecation warnings.
See https://docs.gradle.org/5.2.1/userguide/command_line_interface.html#sec:command_line_warnings

BUILD FAILED in 13m 54s
113 actionable tasks: 85 executed, 25 from cache, 3 up-to-date

Publishing build scan...
https://gradle.com/s/eewm45ontrhlw

Build step 'Invoke Gradle script' changed build result to FAILURE
Build step 'Invoke Gradle script' marked build as failure

---------------------------------------------------------------------
To unsubscribe, e-mail: builds-unsubscribe@beam.apache.org
For additional commands, e-mail: builds-help@beam.apache.org


Mime
View raw message