beam-builds mailing list archives

Site index · List index
Message view « Date » · « Thread »
Top « Date » · « Thread »
From Apache Jenkins Server <jenk...@builds.apache.org>
Subject Build failed in Jenkins: beam_PostCommit_Py_ValCont #5312
Date Fri, 17 Jan 2020 01:16:37 GMT
See <https://builds.apache.org/job/beam_PostCommit_Py_ValCont/5312/display/redirect?page=changes>

Changes:

[robertwb] Automatically convert to with pipeline syntax.

[robertwb] Quick pass through failed auto-conversions.

[robertwb] Automatic conversion of more pipelines.

[robertwb] Fix lint and tests due to autoconversion.

[robertwb] A couple more conversions.

[robertwb] Fix lint and tests due to autoconversion.

[robertwb] Return non-None result for Dataflow dry run.

[robertwb] Fix lint and tests due to autoconversion.

[robertwb] lint, reviewer comments

[robertwb] lint

[robertwb] fix merge


------------------------------------------
[...truncated 630.83 KB...]
copying apache_beam/transforms/display.py -> apache-beam-2.20.0.dev0/apache_beam/transforms
copying apache_beam/transforms/display_test.py -> apache-beam-2.20.0.dev0/apache_beam/transforms
copying apache_beam/transforms/dofn_lifecycle_test.py -> apache-beam-2.20.0.dev0/apache_beam/transforms
copying apache_beam/transforms/environments.py -> apache-beam-2.20.0.dev0/apache_beam/transforms
copying apache_beam/transforms/environments_test.py -> apache-beam-2.20.0.dev0/apache_beam/transforms
copying apache_beam/transforms/external.py -> apache-beam-2.20.0.dev0/apache_beam/transforms
copying apache_beam/transforms/external_test.py -> apache-beam-2.20.0.dev0/apache_beam/transforms
copying apache_beam/transforms/external_test_it.py -> apache-beam-2.20.0.dev0/apache_beam/transforms
copying apache_beam/transforms/external_test_py3.py -> apache-beam-2.20.0.dev0/apache_beam/transforms
copying apache_beam/transforms/external_test_py37.py -> apache-beam-2.20.0.dev0/apache_beam/transforms
copying apache_beam/transforms/ptransform.py -> apache-beam-2.20.0.dev0/apache_beam/transforms
copying apache_beam/transforms/ptransform_test.py -> apache-beam-2.20.0.dev0/apache_beam/transforms
copying apache_beam/transforms/py_dataflow_distribution_counter.py -> apache-beam-2.20.0.dev0/apache_beam/transforms
copying apache_beam/transforms/sideinputs.py -> apache-beam-2.20.0.dev0/apache_beam/transforms
copying apache_beam/transforms/sideinputs_test.py -> apache-beam-2.20.0.dev0/apache_beam/transforms
copying apache_beam/transforms/stats.py -> apache-beam-2.20.0.dev0/apache_beam/transforms
copying apache_beam/transforms/stats_test.py -> apache-beam-2.20.0.dev0/apache_beam/transforms
copying apache_beam/transforms/timeutil.py -> apache-beam-2.20.0.dev0/apache_beam/transforms
copying apache_beam/transforms/transforms_keyword_only_args_test_py3.py -> apache-beam-2.20.0.dev0/apache_beam/transforms
copying apache_beam/transforms/trigger.py -> apache-beam-2.20.0.dev0/apache_beam/transforms
copying apache_beam/transforms/trigger_test.py -> apache-beam-2.20.0.dev0/apache_beam/transforms
copying apache_beam/transforms/userstate.py -> apache-beam-2.20.0.dev0/apache_beam/transforms
copying apache_beam/transforms/userstate_test.py -> apache-beam-2.20.0.dev0/apache_beam/transforms
copying apache_beam/transforms/util.py -> apache-beam-2.20.0.dev0/apache_beam/transforms
copying apache_beam/transforms/util_test.py -> apache-beam-2.20.0.dev0/apache_beam/transforms
copying apache_beam/transforms/window.py -> apache-beam-2.20.0.dev0/apache_beam/transforms
copying apache_beam/transforms/window_test.py -> apache-beam-2.20.0.dev0/apache_beam/transforms
copying apache_beam/transforms/write_ptransform_test.py -> apache-beam-2.20.0.dev0/apache_beam/transforms
copying apache_beam/typehints/__init__.py -> apache-beam-2.20.0.dev0/apache_beam/typehints
copying apache_beam/typehints/decorators.py -> apache-beam-2.20.0.dev0/apache_beam/typehints
copying apache_beam/typehints/decorators_test.py -> apache-beam-2.20.0.dev0/apache_beam/typehints
copying apache_beam/typehints/decorators_test_py3.py -> apache-beam-2.20.0.dev0/apache_beam/typehints
copying apache_beam/typehints/native_type_compatibility.py -> apache-beam-2.20.0.dev0/apache_beam/typehints
copying apache_beam/typehints/native_type_compatibility_test.py -> apache-beam-2.20.0.dev0/apache_beam/typehints
copying apache_beam/typehints/opcodes.py -> apache-beam-2.20.0.dev0/apache_beam/typehints
copying apache_beam/typehints/schemas.py -> apache-beam-2.20.0.dev0/apache_beam/typehints
copying apache_beam/typehints/schemas_test.py -> apache-beam-2.20.0.dev0/apache_beam/typehints
copying apache_beam/typehints/trivial_inference.py -> apache-beam-2.20.0.dev0/apache_beam/typehints
copying apache_beam/typehints/trivial_inference_test.py -> apache-beam-2.20.0.dev0/apache_beam/typehints
copying apache_beam/typehints/trivial_inference_test_py3.py -> apache-beam-2.20.0.dev0/apache_beam/typehints
copying apache_beam/typehints/typecheck.py -> apache-beam-2.20.0.dev0/apache_beam/typehints
copying apache_beam/typehints/typed_pipeline_test.py -> apache-beam-2.20.0.dev0/apache_beam/typehints
copying apache_beam/typehints/typed_pipeline_test_py3.py -> apache-beam-2.20.0.dev0/apache_beam/typehints
copying apache_beam/typehints/typehints.py -> apache-beam-2.20.0.dev0/apache_beam/typehints
copying apache_beam/typehints/typehints_test.py -> apache-beam-2.20.0.dev0/apache_beam/typehints
copying apache_beam/typehints/typehints_test_py3.py -> apache-beam-2.20.0.dev0/apache_beam/typehints
copying apache_beam/utils/__init__.py -> apache-beam-2.20.0.dev0/apache_beam/utils
copying apache_beam/utils/annotations.py -> apache-beam-2.20.0.dev0/apache_beam/utils
copying apache_beam/utils/annotations_test.py -> apache-beam-2.20.0.dev0/apache_beam/utils
copying apache_beam/utils/counters.pxd -> apache-beam-2.20.0.dev0/apache_beam/utils
copying apache_beam/utils/counters.py -> apache-beam-2.20.0.dev0/apache_beam/utils
copying apache_beam/utils/counters_test.py -> apache-beam-2.20.0.dev0/apache_beam/utils
copying apache_beam/utils/interactive_utils.py -> apache-beam-2.20.0.dev0/apache_beam/utils
copying apache_beam/utils/plugin.py -> apache-beam-2.20.0.dev0/apache_beam/utils
copying apache_beam/utils/processes.py -> apache-beam-2.20.0.dev0/apache_beam/utils
copying apache_beam/utils/processes_test.py -> apache-beam-2.20.0.dev0/apache_beam/utils
copying apache_beam/utils/profiler.py -> apache-beam-2.20.0.dev0/apache_beam/utils
copying apache_beam/utils/proto_utils.py -> apache-beam-2.20.0.dev0/apache_beam/utils
copying apache_beam/utils/retry.py -> apache-beam-2.20.0.dev0/apache_beam/utils
copying apache_beam/utils/retry_test.py -> apache-beam-2.20.0.dev0/apache_beam/utils
copying apache_beam/utils/subprocess_server.py -> apache-beam-2.20.0.dev0/apache_beam/utils
copying apache_beam/utils/thread_pool_executor.py -> apache-beam-2.20.0.dev0/apache_beam/utils
copying apache_beam/utils/thread_pool_executor_test.py -> apache-beam-2.20.0.dev0/apache_beam/utils
copying apache_beam/utils/timestamp.py -> apache-beam-2.20.0.dev0/apache_beam/utils
copying apache_beam/utils/timestamp_test.py -> apache-beam-2.20.0.dev0/apache_beam/utils
copying apache_beam/utils/urns.py -> apache-beam-2.20.0.dev0/apache_beam/utils
copying apache_beam/utils/windowed_value.pxd -> apache-beam-2.20.0.dev0/apache_beam/utils
copying apache_beam/utils/windowed_value.py -> apache-beam-2.20.0.dev0/apache_beam/utils
copying apache_beam/utils/windowed_value_test.py -> apache-beam-2.20.0.dev0/apache_beam/utils
Writing apache-beam-2.20.0.dev0/setup.cfg
creating dist
Creating tar archive
removing 'apache-beam-2.20.0.dev0' (and everything under it)
SDK_LOCATION=$(find dist/apache-beam-*.tar.gz)
find dist/apache-beam-*.tar.gz

# Run ValidatesRunner tests on Google Cloud Dataflow service
echo ">>> RUNNING DATAFLOW RUNNER VALIDATESCONTAINER TEST"
>>> RUNNING DATAFLOW RUNNER VALIDATESCONTAINER TEST
python setup.py nosetests \
  --attr ValidatesContainer \
  --nologcapture \
  --processes=1 \
  --process-timeout=900 \
  --with-xunitmp \
  --xunitmp-file=$XUNIT_FILE \
  --ignore-files '.*py3\d?\.py$' \
  --test-pipeline-options=" \
    --runner=TestDataflowRunner \
    --project=$PROJECT \
    --worker_harness_container_image=$CONTAINER:$TAG \
    --staging_location=$GCS_LOCATION/staging-validatesrunner-test \
    --temp_location=$GCS_LOCATION/temp-validatesrunner-test \
    --output=$GCS_LOCATION/output \
    --sdk_location=$SDK_LOCATION \
    --num_workers=1"
setup.py:242: UserWarning: You are using Apache Beam with Python 2. New releases of Apache
Beam will soon support Python 3 only.
  'You are using Apache Beam with Python 2. '
<https://builds.apache.org/job/beam_PostCommit_Py_ValCont/ws/src/sdks/python/container/venv/python/local/lib/python2.7/site-packages/setuptools/dist.py>:476:
UserWarning: Normalizing '2.20.0.dev' to '2.20.0.dev0'
  normalized_version,
running nosetests
running egg_info
<https://builds.apache.org/job/beam_PostCommit_Py_ValCont/ws/src/sdks/python/gen_protos.py>:224:
UserWarning: Installing grpcio-tools is recommended for development.
  warnings.warn('Installing grpcio-tools is recommended for development.')
Skipping proto regeneration: all files up to date
writing requirements to apache_beam.egg-info/requires.txt
writing apache_beam.egg-info/PKG-INFO
writing top-level names to apache_beam.egg-info/top_level.txt
writing dependency_links to apache_beam.egg-info/dependency_links.txt
writing entry points to apache_beam.egg-info/entry_points.txt
reading manifest file 'apache_beam.egg-info/SOURCES.txt'
reading manifest template 'MANIFEST.in'
warning: no files found matching 'README.md'
warning: no files found matching 'NOTICE'
warning: no files found matching 'LICENSE'
writing manifest file 'apache_beam.egg-info/SOURCES.txt'
<https://builds.apache.org/job/beam_PostCommit_Py_ValCont/ws/src/sdks/python/apache_beam/__init__.py>:84:
UserWarning: You are using Apache Beam with Python 2. New releases of Apache Beam will soon
support Python 3 only.
  'You are using Apache Beam with Python 2. '
No handlers could be found for logger "apache_beam.io.gcp.datastore.v1.datastoreio"
WARNING:root:python-snappy is not installed; some tests will be skipped.
WARNING:root:Tensorflow is not installed, so skipping some tests.
WARNING:apache_beam.runners.interactive.interactive_environment:Interactive Beam requires
Python 3.5.3+.
WARNING:apache_beam.runners.interactive.interactive_environment:Dependencies required for
Interactive Beam PCollection visualization are not available, please use: `pip install apache-beam[interactive]`
to install necessary dependencies to enable all data visualization features.
WARNING:apache_beam.runners.interactive.interactive_environment:You cannot use Interactive
Beam features when you are not in an interactive environment such as a Jupyter notebook or
ipython terminal.
WARNING:root:Make sure that locally built Python SDK docker image has Python 2.7 interpreter.
<https://builds.apache.org/job/beam_PostCommit_Py_ValCont/ws/src/sdks/python/apache_beam/transforms/trigger_test.py>:513:
YAMLLoadWarning: calling yaml.load_all() without Loader=... is deprecated, as the default
Loader is unsafe. Please read https://msg.pyyaml.org/load for full details.
  for spec in yaml.load_all(open(transcript_filename)):
WARNING:apache_beam.options.pipeline_options:--region not set; will default to us-central1.
Future releases of Beam will require the user to set --region explicitly, or else have a default
set via the gcloud tool. https://cloud.google.com/compute/docs/regions-zones
WARNING:apache_beam.options.pipeline_options:--region not set; will default to us-central1.
Future releases of Beam will require the user to set --region explicitly, or else have a default
set via the gcloud tool. https://cloud.google.com/compute/docs/regions-zones
test_wordcount_fnapi_it (apache_beam.examples.wordcount_it_test.WordCountIT) ... ERROR
test_metrics_fnapi_it (apache_beam.runners.dataflow.dataflow_exercise_metrics_pipeline_test.ExerciseMetricsPipelineTest)
... ERROR

======================================================================
ERROR: test suite for <class 'apache_beam.examples.wordcount_it_test.WordCountIT'>
----------------------------------------------------------------------
Traceback (most recent call last):
  File "<https://builds.apache.org/job/beam_PostCommit_Py_ValCont/ws/src/sdks/python/container/venv/python/local/lib/python2.7/site-packages/nose/plugins/multiprocess.py",>
line 812, in run
    test(orig)
  File "<https://builds.apache.org/job/beam_PostCommit_Py_ValCont/ws/src/sdks/python/container/venv/python/local/lib/python2.7/site-packages/nose/suite.py",>
line 177, in __call__
    return self.run(*arg, **kw)
  File "<https://builds.apache.org/job/beam_PostCommit_Py_ValCont/ws/src/sdks/python/container/venv/python/local/lib/python2.7/site-packages/nose/plugins/multiprocess.py",>
line 822, in run
    test.config.plugins.addError(test,err)
  File "<https://builds.apache.org/job/beam_PostCommit_Py_ValCont/ws/src/sdks/python/container/venv/python/local/lib/python2.7/site-packages/nose/plugins/manager.py",>
line 99, in __call__
    return self.call(*arg, **kw)
  File "<https://builds.apache.org/job/beam_PostCommit_Py_ValCont/ws/src/sdks/python/container/venv/python/local/lib/python2.7/site-packages/nose/plugins/manager.py",>
line 167, in simple
    result = meth(*arg, **kw)
  File "<https://builds.apache.org/job/beam_PostCommit_Py_ValCont/ws/src/sdks/python/container/venv/python/local/lib/python2.7/site-packages/nose/plugins/xunit.py",>
line 287, in addError
    tb = format_exception(err, self.encoding)
  File "<https://builds.apache.org/job/beam_PostCommit_Py_ValCont/ws/src/sdks/python/container/venv/python/local/lib/python2.7/site-packages/nose/pyversion.py",>
line 214, in format_exception
    ''.join(traceback.format_exception(*exc_info)),
  File "/usr/lib/python2.7/traceback.py", line 141, in format_exception
    list = list + format_tb(tb, limit)
  File "/usr/lib/python2.7/traceback.py", line 76, in format_tb
    return format_list(extract_tb(tb, limit))
  File "/usr/lib/python2.7/traceback.py", line 101, in extract_tb
    line = linecache.getline(filename, lineno, f.f_globals)
  File "<https://builds.apache.org/job/beam_PostCommit_Py_ValCont/ws/src/sdks/python/container/venv/python/lib/python2.7/linecache.py",>
line 14, in getline
    lines = getlines(filename, module_globals)
  File "<https://builds.apache.org/job/beam_PostCommit_Py_ValCont/ws/src/sdks/python/container/venv/python/lib/python2.7/linecache.py",>
line 41, in getlines
    return updatecache(filename, module_globals)
  File "<https://builds.apache.org/job/beam_PostCommit_Py_ValCont/ws/src/sdks/python/container/venv/python/lib/python2.7/linecache.py",>
line 132, in updatecache
    lines = fp.readlines()
  File "<https://builds.apache.org/job/beam_PostCommit_Py_ValCont/ws/src/sdks/python/container/venv/python/local/lib/python2.7/site-packages/nose/plugins/multiprocess.py",>
line 276, in signalhandler
    raise TimedOutException()
TimedOutException: '<nose.plugins.multiprocess.NoSharedFixtureContextSuite context=WordCountIT>'

======================================================================
ERROR: test_metrics_fnapi_it (apache_beam.runners.dataflow.dataflow_exercise_metrics_pipeline_test.ExerciseMetricsPipelineTest)
----------------------------------------------------------------------
Traceback (most recent call last):
  File "<https://builds.apache.org/job/beam_PostCommit_Py_ValCont/ws/src/sdks/python/container/venv/python/local/lib/python2.7/site-packages/nose/plugins/multiprocess.py",>
line 812, in run
    test(orig)
  File "<https://builds.apache.org/job/beam_PostCommit_Py_ValCont/ws/src/sdks/python/container/venv/python/local/lib/python2.7/site-packages/nose/case.py",>
line 45, in __call__
    return self.run(*arg, **kwarg)
  File "<https://builds.apache.org/job/beam_PostCommit_Py_ValCont/ws/src/sdks/python/container/venv/python/local/lib/python2.7/site-packages/nose/case.py",>
line 133, in run
    self.runTest(result)
  File "<https://builds.apache.org/job/beam_PostCommit_Py_ValCont/ws/src/sdks/python/container/venv/python/local/lib/python2.7/site-packages/nose/case.py",>
line 151, in runTest
    test(result)
  File "/usr/lib/python2.7/unittest/case.py", line 393, in __call__
    return self.run(*args, **kwds)
  File "/usr/lib/python2.7/unittest/case.py", line 329, in run
    testMethod()
  File "<https://builds.apache.org/job/beam_PostCommit_Py_ValCont/ws/src/sdks/python/apache_beam/runners/dataflow/dataflow_exercise_metrics_pipeline_test.py",>
line 58, in test_metrics_fnapi_it
    result = self.run_pipeline(experiment='beam_fn_api')
  File "<https://builds.apache.org/job/beam_PostCommit_Py_ValCont/ws/src/sdks/python/apache_beam/runners/dataflow/dataflow_exercise_metrics_pipeline_test.py",>
line 39, in run_pipeline
    test_pipeline = TestPipeline(is_integration_test=True)
  File "<https://builds.apache.org/job/beam_PostCommit_Py_ValCont/ws/src/sdks/python/apache_beam/testing/test_pipeline.py",>
line 107, in __init__
    super(TestPipeline, self).__init__(runner, options)
  File "<https://builds.apache.org/job/beam_PostCommit_Py_ValCont/ws/src/sdks/python/apache_beam/pipeline.py",>
line 184, in __init__
    errors = PipelineOptionsValidator(self._options, runner).validate()
  File "<https://builds.apache.org/job/beam_PostCommit_Py_ValCont/ws/src/sdks/python/apache_beam/options/pipeline_options_validator.py",>
line 113, in validate
    errors.extend(self.options.view_as(cls).validate(self))
  File "<https://builds.apache.org/job/beam_PostCommit_Py_ValCont/ws/src/sdks/python/apache_beam/options/pipeline_options.py",>
line 591, in validate
    self.view_as(GoogleCloudOptions).region = self._get_default_gcp_region()
  File "<https://builds.apache.org/job/beam_PostCommit_Py_ValCont/ws/src/sdks/python/apache_beam/options/pipeline_options.py",>
line 559, in _get_default_gcp_region
    raw_output = processes.check_output(cmd, stderr=DEVNULL)
  File "<https://builds.apache.org/job/beam_PostCommit_Py_ValCont/ws/src/sdks/python/apache_beam/utils/processes.py",>
line 85, in check_output
    out = subprocess.check_output(*args, **kwargs)
  File "/usr/lib/python2.7/subprocess.py", line 568, in check_output
    output, unused_err = process.communicate()
  File "/usr/lib/python2.7/subprocess.py", line 792, in communicate
    stdout = _eintr_retry_call(self.stdout.read)
  File "/usr/lib/python2.7/subprocess.py", line 476, in _eintr_retry_call
    return func(*args)
  File "<https://builds.apache.org/job/beam_PostCommit_Py_ValCont/ws/src/sdks/python/container/venv/python/local/lib/python2.7/site-packages/nose/plugins/multiprocess.py",>
line 276, in signalhandler
    raise TimedOutException()
TimedOutException: 'test_metrics_fnapi_it (apache_beam.runners.dataflow.dataflow_exercise_metrics_pipeline_test.ExerciseMetricsPipelineTest)'

----------------------------------------------------------------------
XML: nosetests-python2.7_sdk.xml
----------------------------------------------------------------------
XML: <https://builds.apache.org/job/beam_PostCommit_Py_ValCont/ws/src/sdks/python/nosetests.xml>
----------------------------------------------------------------------
Ran 2 tests in 904.117s

FAILED (errors=2)
cleanup_container
Untagged: us.gcr.io/apache-beam-testing/jenkins/python2.7_sdk:20200117-005334
Untagged: us.gcr.io/apache-beam-testing/jenkins/python2.7_sdk@sha256:a2f42dbee6162e2ccc08073486f6386efd3138b20df27fcc27c82b93c690655d
Deleted: sha256:8b22395106d7c97767c7a833c73d29d521e3255280433e174a64d03b27e935e0
Deleted: sha256:54ad6177b9fec643eeda5e70b517c0ac2d96fe0b32f9165b0ee3382c4f7495e7
Deleted: sha256:1ecfdddb248160a2fd1d27384ae107260997897f85398f2a2d6627119ff4af8d
Deleted: sha256:01423c7085123d470d81eafdb766bc54019bef0793edd1ea144004d5247e73a0
Deleted: sha256:b7f819ecc8a3e91a4461e8bfe0c61902ba88b585b6ffceca5448a1f8d221c2b3
Deleted: sha256:3547d4988b8f6723636f77332f080514a0306ec6d39c60b1e26ecc88c9b49f2e
Deleted: sha256:8eecc5717d8eab7e40dc146d43048960a575a587510c538c50fefef9fca0f521
Deleted: sha256:ad75902a10c42753c2da2d802c51d8860449d2463108ad674deb619e78a0c494
Deleted: sha256:e2bf3ed078072c3201271a3fe3e16569448df783bbe6fbc0bf6036939cc16528
Deleted: sha256:667d22701037f0a873de4303c2f14b68b4e87d07616f391a1f2e0dcc175a8fe1
Deleted: sha256:158e9b0fd3284675d2ab511db4e3a779b62a6018340fb70a37b30134e136fd1e
Deleted: sha256:fe59d2d389bde40946b2100ec625683791d06d7c5deef6cbfdf6a07f5b227bb5
Deleted: sha256:ff6c0b6306fb8505ac031f10b81238888953d8038d3b8f7cb51885950e479b3c
Deleted: sha256:b4f770c6d65f2a36b0c60861f2f4f000bb928bf4a4c24e4f7ac3ec6a773c5b00
Deleted: sha256:c013752c7d46ef543df35e3118b0b5a6c84ba998464890c39bd10a7f61fb4943
Deleted: sha256:5ac3ab65172ebbe29fa6ce7ac0623b5f21f0a371cb79492f69428a7f44451a77
Deleted: sha256:99e1ae6e53171dd38925511f05291446a4875b969a113502003170ee4c4dd37f
Deleted: sha256:79558cbc81619165936d38a2f4cef3bb0875da89550f46cf574adfa577e74a81
Deleted: sha256:c114b40b86bb41658f65c4c4979bd0801cfbe211ac5d3ada838a84d533504041
Deleted: sha256:22bde92a97ad10e2612121ea4ae68945763e805c0876e1f5ee8eaf64af6176a8
Digests:
- us.gcr.io/apache-beam-testing/jenkins/python2.7_sdk@sha256:a2f42dbee6162e2ccc08073486f6386efd3138b20df27fcc27c82b93c690655d
  Associated tags:
 - 20200117-005334
Tags:
- us.gcr.io/apache-beam-testing/jenkins/python2.7_sdk:20200117-005334
Deleted [us.gcr.io/apache-beam-testing/jenkins/python2.7_sdk:20200117-005334].
Deleted [us.gcr.io/apache-beam-testing/jenkins/python2.7_sdk@sha256:a2f42dbee6162e2ccc08073486f6386efd3138b20df27fcc27c82b93c690655d].
Removed the container
Build step 'Execute shell' marked build as failure

---------------------------------------------------------------------
To unsubscribe, e-mail: builds-unsubscribe@beam.apache.org
For additional commands, e-mail: builds-help@beam.apache.org


Mime
View raw message