beam-builds mailing list archives

Site index · List index
Message view « Date » · « Thread »
Top « Date » · « Thread »
From Apache Jenkins Server <jenk...@builds.apache.org>
Subject Build failed in Jenkins: beam_PostCommit_Py_ValCont #5116
Date Tue, 24 Dec 2019 12:23:39 GMT
See <https://builds.apache.org/job/beam_PostCommit_Py_ValCont/5116/display/redirect>

Changes:


------------------------------------------
[...truncated 625.29 KB...]
copying apache_beam/typehints/trivial_inference.py -> apache-beam-2.19.0.dev0/apache_beam/typehints
copying apache_beam/typehints/trivial_inference_test.py -> apache-beam-2.19.0.dev0/apache_beam/typehints
copying apache_beam/typehints/trivial_inference_test_py3.py -> apache-beam-2.19.0.dev0/apache_beam/typehints
copying apache_beam/typehints/typecheck.py -> apache-beam-2.19.0.dev0/apache_beam/typehints
copying apache_beam/typehints/typed_pipeline_test.py -> apache-beam-2.19.0.dev0/apache_beam/typehints
copying apache_beam/typehints/typed_pipeline_test_py3.py -> apache-beam-2.19.0.dev0/apache_beam/typehints
copying apache_beam/typehints/typehints.py -> apache-beam-2.19.0.dev0/apache_beam/typehints
copying apache_beam/typehints/typehints_test.py -> apache-beam-2.19.0.dev0/apache_beam/typehints
copying apache_beam/typehints/typehints_test_py3.py -> apache-beam-2.19.0.dev0/apache_beam/typehints
copying apache_beam/utils/__init__.py -> apache-beam-2.19.0.dev0/apache_beam/utils
copying apache_beam/utils/annotations.py -> apache-beam-2.19.0.dev0/apache_beam/utils
copying apache_beam/utils/annotations_test.py -> apache-beam-2.19.0.dev0/apache_beam/utils
copying apache_beam/utils/counters.pxd -> apache-beam-2.19.0.dev0/apache_beam/utils
copying apache_beam/utils/counters.py -> apache-beam-2.19.0.dev0/apache_beam/utils
copying apache_beam/utils/counters_test.py -> apache-beam-2.19.0.dev0/apache_beam/utils
copying apache_beam/utils/interactive_utils.py -> apache-beam-2.19.0.dev0/apache_beam/utils
copying apache_beam/utils/plugin.py -> apache-beam-2.19.0.dev0/apache_beam/utils
copying apache_beam/utils/processes.py -> apache-beam-2.19.0.dev0/apache_beam/utils
copying apache_beam/utils/processes_test.py -> apache-beam-2.19.0.dev0/apache_beam/utils
copying apache_beam/utils/profiler.py -> apache-beam-2.19.0.dev0/apache_beam/utils
copying apache_beam/utils/proto_utils.py -> apache-beam-2.19.0.dev0/apache_beam/utils
copying apache_beam/utils/retry.py -> apache-beam-2.19.0.dev0/apache_beam/utils
copying apache_beam/utils/retry_test.py -> apache-beam-2.19.0.dev0/apache_beam/utils
copying apache_beam/utils/subprocess_server.py -> apache-beam-2.19.0.dev0/apache_beam/utils
copying apache_beam/utils/thread_pool_executor.py -> apache-beam-2.19.0.dev0/apache_beam/utils
copying apache_beam/utils/thread_pool_executor_test.py -> apache-beam-2.19.0.dev0/apache_beam/utils
copying apache_beam/utils/timestamp.py -> apache-beam-2.19.0.dev0/apache_beam/utils
copying apache_beam/utils/timestamp_test.py -> apache-beam-2.19.0.dev0/apache_beam/utils
copying apache_beam/utils/urns.py -> apache-beam-2.19.0.dev0/apache_beam/utils
copying apache_beam/utils/windowed_value.pxd -> apache-beam-2.19.0.dev0/apache_beam/utils
copying apache_beam/utils/windowed_value.py -> apache-beam-2.19.0.dev0/apache_beam/utils
copying apache_beam/utils/windowed_value_test.py -> apache-beam-2.19.0.dev0/apache_beam/utils
Writing apache-beam-2.19.0.dev0/setup.cfg
creating dist
Creating tar archive
removing 'apache-beam-2.19.0.dev0' (and everything under it)
SDK_LOCATION=$(find dist/apache-beam-*.tar.gz)
find dist/apache-beam-*.tar.gz

# Run ValidatesRunner tests on Google Cloud Dataflow service
echo ">>> RUNNING DATAFLOW RUNNER VALIDATESCONTAINER TEST"
>>> RUNNING DATAFLOW RUNNER VALIDATESCONTAINER TEST
python setup.py nosetests \
  --attr ValidatesContainer \
  --nologcapture \
  --processes=1 \
  --process-timeout=900 \
  --with-xunitmp \
  --xunitmp-file=$XUNIT_FILE \
  --ignore-files '.*py3\d?\.py$' \
  --test-pipeline-options=" \
    --runner=TestDataflowRunner \
    --project=$PROJECT \
    --worker_harness_container_image=$CONTAINER:$TAG \
    --staging_location=$GCS_LOCATION/staging-validatesrunner-test \
    --temp_location=$GCS_LOCATION/temp-validatesrunner-test \
    --output=$GCS_LOCATION/output \
    --sdk_location=$SDK_LOCATION \
    --num_workers=1"
setup.py:236: UserWarning: You are using Apache Beam with Python 2. New releases of Apache
Beam will soon support Python 3 only.
  'You are using Apache Beam with Python 2. '
<https://builds.apache.org/job/beam_PostCommit_Py_ValCont/ws/src/sdks/python/container/venv/python/local/lib/python2.7/site-packages/setuptools/dist.py>:476:
UserWarning: Normalizing '2.19.0.dev' to '2.19.0.dev0'
  normalized_version,
running nosetests
running egg_info
<https://builds.apache.org/job/beam_PostCommit_Py_ValCont/ws/src/sdks/python/gen_protos.py>:55:
UserWarning: Installing grpcio-tools is recommended for development.
  warnings.warn('Installing grpcio-tools is recommended for development.')
writing requirements to apache_beam.egg-info/requires.txt
writing apache_beam.egg-info/PKG-INFO
writing top-level names to apache_beam.egg-info/top_level.txt
writing dependency_links to apache_beam.egg-info/dependency_links.txt
writing entry points to apache_beam.egg-info/entry_points.txt
reading manifest file 'apache_beam.egg-info/SOURCES.txt'
reading manifest template 'MANIFEST.in'
warning: no files found matching 'README.md'
warning: no files found matching 'NOTICE'
warning: no files found matching 'LICENSE'
writing manifest file 'apache_beam.egg-info/SOURCES.txt'
<https://builds.apache.org/job/beam_PostCommit_Py_ValCont/ws/src/sdks/python/apache_beam/__init__.py>:84:
UserWarning: You are using Apache Beam with Python 2. New releases of Apache Beam will soon
support Python 3 only.
  'You are using Apache Beam with Python 2. '
No handlers could be found for logger "apache_beam.io.gcp.datastore.v1.datastoreio"
WARNING:root:python-snappy is not installed; some tests will be skipped.
WARNING:root:Tensorflow is not installed, so skipping some tests.
WARNING:apache_beam.runners.interactive.interactive_environment:Interactive Beam requires
Python 3.5.3+.
WARNING:apache_beam.runners.interactive.interactive_environment:Dependencies required for
Interactive Beam PCollection visualization are not available, please use: `pip install apache-beam[interactive]`
to install necessary dependencies to enable all data visualization features.
WARNING:apache_beam.runners.interactive.interactive_environment:You cannot use Interactive
Beam features when you are not in an interactive environment such as a Jupyter notebook or
ipython terminal.
WARNING:root:Make sure that locally built Python SDK docker image has Python 2.7 interpreter.
<https://builds.apache.org/job/beam_PostCommit_Py_ValCont/ws/src/sdks/python/apache_beam/transforms/trigger_test.py>:506:
YAMLLoadWarning: calling yaml.load_all() without Loader=... is deprecated, as the default
Loader is unsafe. Please read https://msg.pyyaml.org/load for full details.
  for spec in yaml.load_all(open(transcript_filename)):
WARNING:apache_beam.options.pipeline_options:--region not set; will default to us-central1.
Future releases of Beam will require the user to set --region explicitly, or else have a default
set via the gcloud tool. https://cloud.google.com/compute/docs/regions-zones
WARNING:apache_beam.options.pipeline_options:--region not set; will default to us-central1.
Future releases of Beam will require the user to set --region explicitly, or else have a default
set via the gcloud tool. https://cloud.google.com/compute/docs/regions-zones
test_wordcount_fnapi_it (apache_beam.examples.wordcount_it_test.WordCountIT) ... ERROR
test_metrics_fnapi_it (apache_beam.runners.dataflow.dataflow_exercise_metrics_pipeline_test.ExerciseMetricsPipelineTest)
... ERROR

======================================================================
ERROR: test_wordcount_fnapi_it (apache_beam.examples.wordcount_it_test.WordCountIT)
----------------------------------------------------------------------
Traceback (most recent call last):
  File "<https://builds.apache.org/job/beam_PostCommit_Py_ValCont/ws/src/sdks/python/container/venv/python/local/lib/python2.7/site-packages/nose/plugins/multiprocess.py",>
line 812, in run
    test(orig)
  File "<https://builds.apache.org/job/beam_PostCommit_Py_ValCont/ws/src/sdks/python/container/venv/python/local/lib/python2.7/site-packages/nose/case.py",>
line 45, in __call__
    return self.run(*arg, **kwarg)
  File "<https://builds.apache.org/job/beam_PostCommit_Py_ValCont/ws/src/sdks/python/container/venv/python/local/lib/python2.7/site-packages/nose/case.py",>
line 133, in run
    self.runTest(result)
  File "<https://builds.apache.org/job/beam_PostCommit_Py_ValCont/ws/src/sdks/python/container/venv/python/local/lib/python2.7/site-packages/nose/case.py",>
line 151, in runTest
    test(result)
  File "/usr/lib/python2.7/unittest/case.py", line 393, in __call__
    return self.run(*args, **kwds)
  File "/usr/lib/python2.7/unittest/case.py", line 329, in run
    testMethod()
  File "<https://builds.apache.org/job/beam_PostCommit_Py_ValCont/ws/src/sdks/python/apache_beam/examples/wordcount_it_test.py",>
line 52, in test_wordcount_fnapi_it
    self._run_wordcount_it(wordcount.run, experiment='beam_fn_api')
  File "<https://builds.apache.org/job/beam_PostCommit_Py_ValCont/ws/src/sdks/python/apache_beam/examples/wordcount_it_test.py",>
line 85, in _run_wordcount_it
    save_main_session=False)
  File "<https://builds.apache.org/job/beam_PostCommit_Py_ValCont/ws/src/sdks/python/apache_beam/examples/wordcount.py",>
line 117, in run
    result = p.run()
  File "<https://builds.apache.org/job/beam_PostCommit_Py_ValCont/ws/src/sdks/python/apache_beam/pipeline.py",>
line 460, in run
    self._options).run(False)
  File "<https://builds.apache.org/job/beam_PostCommit_Py_ValCont/ws/src/sdks/python/apache_beam/pipeline.py",>
line 473, in run
    return self.runner.run_pipeline(self, self._options)
  File "<https://builds.apache.org/job/beam_PostCommit_Py_ValCont/ws/src/sdks/python/apache_beam/runners/dataflow/test_dataflow_runner.py",>
line 74, in run_pipeline
    self.wait_until_in_state(PipelineState.CANCELLED)
  File "<https://builds.apache.org/job/beam_PostCommit_Py_ValCont/ws/src/sdks/python/apache_beam/runners/dataflow/test_dataflow_runner.py",>
line 94, in wait_until_in_state
    job_state = self.result.state
  File "<https://builds.apache.org/job/beam_PostCommit_Py_ValCont/ws/src/sdks/python/apache_beam/runners/dataflow/dataflow_runner.py",>
line 1409, in state
    self._update_job()
  File "<https://builds.apache.org/job/beam_PostCommit_Py_ValCont/ws/src/sdks/python/apache_beam/runners/dataflow/dataflow_runner.py",>
line 1365, in _update_job
    self._job = self._runner.dataflow_client.get_job(self.job_id())
  File "<https://builds.apache.org/job/beam_PostCommit_Py_ValCont/ws/src/sdks/python/apache_beam/utils/retry.py",>
line 224, in wrapper
    return fun(*args, **kwargs)
  File "<https://builds.apache.org/job/beam_PostCommit_Py_ValCont/ws/src/sdks/python/apache_beam/runners/dataflow/internal/apiclient.py",>
line 677, in get_job
    response = self._client.projects_locations_jobs.Get(request)
  File "<https://builds.apache.org/job/beam_PostCommit_Py_ValCont/ws/src/sdks/python/apache_beam/runners/dataflow/internal/clients/dataflow/dataflow_v1b3_client.py",>
line 661, in Get
    config, request, global_params=global_params)
  File "<https://builds.apache.org/job/beam_PostCommit_Py_ValCont/ws/src/sdks/python/container/venv/python/local/lib/python2.7/site-packages/apitools/base/py/base_api.py",>
line 729, in _RunMethod
    http, http_request, **opts)
  File "<https://builds.apache.org/job/beam_PostCommit_Py_ValCont/ws/src/sdks/python/container/venv/python/local/lib/python2.7/site-packages/apitools/base/py/http_wrapper.py",>
line 346, in MakeRequest
    check_response_func=check_response_func)
  File "<https://builds.apache.org/job/beam_PostCommit_Py_ValCont/ws/src/sdks/python/container/venv/python/local/lib/python2.7/site-packages/apitools/base/py/http_wrapper.py",>
line 396, in _MakeRequestNoRetry
    redirections=redirections, connection_type=connection_type)
  File "<https://builds.apache.org/job/beam_PostCommit_Py_ValCont/ws/src/sdks/python/container/venv/python/local/lib/python2.7/site-packages/oauth2client/transport.py",>
line 169, in new_request
    redirections, connection_type)
  File "<https://builds.apache.org/job/beam_PostCommit_Py_ValCont/ws/src/sdks/python/container/venv/python/local/lib/python2.7/site-packages/oauth2client/transport.py",>
line 169, in new_request
    redirections, connection_type)
  File "<https://builds.apache.org/job/beam_PostCommit_Py_ValCont/ws/src/sdks/python/container/venv/python/local/lib/python2.7/site-packages/httplib2/__init__.py",>
line 2133, in request
    cachekey,
  File "<https://builds.apache.org/job/beam_PostCommit_Py_ValCont/ws/src/sdks/python/container/venv/python/local/lib/python2.7/site-packages/httplib2/__init__.py",>
line 1796, in _request
    conn, request_uri, method, body, headers
  File "<https://builds.apache.org/job/beam_PostCommit_Py_ValCont/ws/src/sdks/python/container/venv/python/local/lib/python2.7/site-packages/httplib2/__init__.py",>
line 1737, in _conn_request
    response = conn.getresponse()
  File "/usr/lib/python2.7/httplib.py", line 1152, in getresponse
    response.begin()
  File "/usr/lib/python2.7/httplib.py", line 463, in begin
    version, status, reason = self._read_status()
  File "/usr/lib/python2.7/httplib.py", line 419, in _read_status
    line = self.fp.readline(_MAXLINE + 1)
  File "/usr/lib/python2.7/socket.py", line 480, in readline
    data = self._sock.recv(self._rbufsize)
  File "/usr/lib/python2.7/ssl.py", line 756, in recv
    return self.read(buflen)
  File "/usr/lib/python2.7/ssl.py", line 643, in read
    v = self._sslobj.read(len)
  File "<https://builds.apache.org/job/beam_PostCommit_Py_ValCont/ws/src/sdks/python/container/venv/python/local/lib/python2.7/site-packages/nose/plugins/multiprocess.py",>
line 276, in signalhandler
    raise TimedOutException()
TimedOutException: 'test_wordcount_fnapi_it (apache_beam.examples.wordcount_it_test.WordCountIT)'

======================================================================
ERROR: test_metrics_fnapi_it (apache_beam.runners.dataflow.dataflow_exercise_metrics_pipeline_test.ExerciseMetricsPipelineTest)
----------------------------------------------------------------------
Traceback (most recent call last):
  File "<https://builds.apache.org/job/beam_PostCommit_Py_ValCont/ws/src/sdks/python/container/venv/python/local/lib/python2.7/site-packages/nose/plugins/multiprocess.py",>
line 812, in run
    test(orig)
  File "<https://builds.apache.org/job/beam_PostCommit_Py_ValCont/ws/src/sdks/python/container/venv/python/local/lib/python2.7/site-packages/nose/case.py",>
line 45, in __call__
    return self.run(*arg, **kwarg)
  File "<https://builds.apache.org/job/beam_PostCommit_Py_ValCont/ws/src/sdks/python/container/venv/python/local/lib/python2.7/site-packages/nose/case.py",>
line 133, in run
    self.runTest(result)
  File "<https://builds.apache.org/job/beam_PostCommit_Py_ValCont/ws/src/sdks/python/container/venv/python/local/lib/python2.7/site-packages/nose/case.py",>
line 151, in runTest
    test(result)
  File "/usr/lib/python2.7/unittest/case.py", line 393, in __call__
    return self.run(*args, **kwds)
  File "/usr/lib/python2.7/unittest/case.py", line 329, in run
    testMethod()
  File "<https://builds.apache.org/job/beam_PostCommit_Py_ValCont/ws/src/sdks/python/apache_beam/runners/dataflow/dataflow_exercise_metrics_pipeline_test.py",>
line 56, in test_metrics_fnapi_it
    result = self.run_pipeline(experiment='beam_fn_api')
  File "<https://builds.apache.org/job/beam_PostCommit_Py_ValCont/ws/src/sdks/python/apache_beam/runners/dataflow/dataflow_exercise_metrics_pipeline_test.py",>
line 37, in run_pipeline
    test_pipeline = TestPipeline(is_integration_test=True)
  File "<https://builds.apache.org/job/beam_PostCommit_Py_ValCont/ws/src/sdks/python/apache_beam/testing/test_pipeline.py",>
line 107, in __init__
    super(TestPipeline, self).__init__(runner, options)
  File "<https://builds.apache.org/job/beam_PostCommit_Py_ValCont/ws/src/sdks/python/apache_beam/pipeline.py",>
line 183, in __init__
    errors = PipelineOptionsValidator(self._options, runner).validate()
  File "<https://builds.apache.org/job/beam_PostCommit_Py_ValCont/ws/src/sdks/python/apache_beam/options/pipeline_options_validator.py",>
line 111, in validate
    errors.extend(self.options.view_as(cls).validate(self))
  File "<https://builds.apache.org/job/beam_PostCommit_Py_ValCont/ws/src/sdks/python/apache_beam/options/pipeline_options.py",>
line 584, in validate
    self.view_as(GoogleCloudOptions).region = self._get_default_gcp_region()
  File "<https://builds.apache.org/job/beam_PostCommit_Py_ValCont/ws/src/sdks/python/apache_beam/options/pipeline_options.py",>
line 552, in _get_default_gcp_region
    raw_output = processes.check_output(cmd, stderr=DEVNULL)
  File "<https://builds.apache.org/job/beam_PostCommit_Py_ValCont/ws/src/sdks/python/apache_beam/utils/processes.py",>
line 83, in check_output
    out = subprocess.check_output(*args, **kwargs)
  File "/usr/lib/python2.7/subprocess.py", line 568, in check_output
    output, unused_err = process.communicate()
  File "/usr/lib/python2.7/subprocess.py", line 792, in communicate
    stdout = _eintr_retry_call(self.stdout.read)
  File "/usr/lib/python2.7/subprocess.py", line 476, in _eintr_retry_call
    return func(*args)
  File "<https://builds.apache.org/job/beam_PostCommit_Py_ValCont/ws/src/sdks/python/container/venv/python/local/lib/python2.7/site-packages/nose/plugins/multiprocess.py",>
line 276, in signalhandler
    raise TimedOutException()
TimedOutException: 'test_metrics_fnapi_it (apache_beam.runners.dataflow.dataflow_exercise_metrics_pipeline_test.ExerciseMetricsPipelineTest)'

----------------------------------------------------------------------
XML: nosetests-python2.7_sdk.xml
----------------------------------------------------------------------
XML: <https://builds.apache.org/job/beam_PostCommit_Py_ValCont/ws/src/sdks/python/nosetests.xml>
----------------------------------------------------------------------
Ran 2 tests in 903.750s

FAILED (errors=2)
cleanup_container
Untagged: us.gcr.io/apache-beam-testing/jenkins/python2.7_sdk:20191224-120108
Untagged: us.gcr.io/apache-beam-testing/jenkins/python2.7_sdk@sha256:aa7b35bd0b0e6b7bdd2f53251c65aaa9f39747a5c5cb50af4acf36d68ade09e0
Deleted: sha256:aa077d5dc26c96c3fb2f3c52a15f05a949574567b4a33b4caa7a2c7a78909fdd
Deleted: sha256:1538392b46eefe09805f90cd83d28301f8c8fa56faba8d1705dea3d80bb2fee7
Deleted: sha256:3fba94e914a712dbe11d7742076b20565a371849d6f3c990058afa9eb219aeb0
Deleted: sha256:c56f33e64942f83872447f441cf980b07894d48cc887a24c258fb72ccd363b70
Deleted: sha256:f81e2f281c5608dc7c5c8d98bbf7478b983aba31b1e34d992cffd80fb2c9403e
Deleted: sha256:89835c533125a0f2e6c09b7bffaf156461d8f9e8a7e23ed75120376e79dbc9f8
Deleted: sha256:2a105c78524f2a623a6906434714706cba5987312ef4e2384bc282c1243d2958
Deleted: sha256:215a2d4234bfe19a16ff54d4c8159b88be8b245f9711a64ea3ef542c6541fdb9
Deleted: sha256:dcdd70ba06c03423a5128e108cd53ecf96822e155e218e985588a4bee3541710
Deleted: sha256:14c991f50abc11919947ff430029ebfe2dc19955275a6cac7503e0577b49a016
Deleted: sha256:96ba9e3f59944a3d50b6fcb172749834abdbab9ba6734ed45ab70bfacf9b70c9
Deleted: sha256:06b29a64551fa9b3b2c25d75e1bdc5872d4adcb033b5c4aaae3898ef04f2726c
Deleted: sha256:39641c1947a37e6296c8e64e031985e3ad6e4e03d5185ca2669859322b2a4db3
Deleted: sha256:cebb54acbefcb670009f20d568a0d085256766af4c1b7942036f7e7b2a299e30
Deleted: sha256:97dabc02d90c8be255c5594872f99331b5fe86bb83ebbcf4962b2c6b0bd07a23
Deleted: sha256:ed5a81c121328a68db225d9af279a36fff66ce31000537ef3b8e707851793e7f
Deleted: sha256:d37506c69154ecad714d95f89ffc2a062652530a82ceb038ee9a8f690a2c0320
Deleted: sha256:1c7be7f699e52cf707bebe802d906609aeec6c72da5cd08d1670a24305ed6304
Deleted: sha256:cde07740fddd5f15a57aa60e26d472b2b506629b62d481463d865e959d601006
Deleted: sha256:1b38b499629de137cf30865eec5ddd718b6d336f5d306915214ba2ef114b962b
Digests:
- us.gcr.io/apache-beam-testing/jenkins/python2.7_sdk@sha256:aa7b35bd0b0e6b7bdd2f53251c65aaa9f39747a5c5cb50af4acf36d68ade09e0
  Associated tags:
 - 20191224-120108
Tags:
- us.gcr.io/apache-beam-testing/jenkins/python2.7_sdk:20191224-120108
Deleted [us.gcr.io/apache-beam-testing/jenkins/python2.7_sdk:20191224-120108].
Deleted [us.gcr.io/apache-beam-testing/jenkins/python2.7_sdk@sha256:aa7b35bd0b0e6b7bdd2f53251c65aaa9f39747a5c5cb50af4acf36d68ade09e0].
Removed the container
Build step 'Execute shell' marked build as failure

---------------------------------------------------------------------
To unsubscribe, e-mail: builds-unsubscribe@beam.apache.org
For additional commands, e-mail: builds-help@beam.apache.org


Mime
View raw message