beam-builds mailing list archives

Site index · List index
Message view « Date » · « Thread »
Top « Date » · « Thread »
From Apache Jenkins Server <jenk...@builds.apache.org>
Subject Build failed in Jenkins: beam_PostCommit_Java11_Examples_Dataflow #2296
Date Mon, 09 Dec 2019 12:06:29 GMT
See <https://builds.apache.org/job/beam_PostCommit_Java11_Examples_Dataflow/2296/display/redirect>

Changes:


------------------------------------------
Started by timer
Running as SYSTEM
[EnvInject] - Loading node environment variables.
Building remotely on apache-beam-jenkins-13 (beam) in workspace <https://builds.apache.org/job/beam_PostCommit_Java11_Examples_Dataflow/ws/>
No credentials specified
Wiping out workspace first.
Cloning the remote Git repository
Cloning repository https://github.com/apache/beam.git
 > git init <https://builds.apache.org/job/beam_PostCommit_Java11_Examples_Dataflow/ws/src>
# timeout=10
Fetching upstream changes from https://github.com/apache/beam.git
 > git --version # timeout=10
 > git fetch --tags --progress https://github.com/apache/beam.git +refs/heads/*:refs/remotes/origin/*
 > git config remote.origin.url https://github.com/apache/beam.git # timeout=10
 > git config --add remote.origin.fetch +refs/heads/*:refs/remotes/origin/* # timeout=10
 > git config remote.origin.url https://github.com/apache/beam.git # timeout=10
Fetching upstream changes from https://github.com/apache/beam.git
 > git fetch --tags --progress https://github.com/apache/beam.git +refs/heads/*:refs/remotes/origin/*
+refs/pull/${ghprbPullId}/*:refs/remotes/origin/pr/${ghprbPullId}/*
 > git rev-parse origin/master^{commit} # timeout=10
Checking out Revision 8066d78f0fd2237b718859d4a776511203880df0 (origin/master)
 > git config core.sparsecheckout # timeout=10
 > git checkout -f 8066d78f0fd2237b718859d4a776511203880df0
Commit message: "Merge pull request #10308 from ibzib/zip-artifacts"
 > git rev-list --no-walk 8066d78f0fd2237b718859d4a776511203880df0 # timeout=10
No emails were triggered.
[EnvInject] - Executing scripts and injecting environment variables after the SCM step.
[EnvInject] - Injecting as environment variables the properties content 
SPARK_LOCAL_IP=127.0.0.1

[EnvInject] - Variables injected successfully.
[Gradle] - Launching build.
[src] $ <https://builds.apache.org/job/beam_PostCommit_Java11_Examples_Dataflow/ws/src/gradlew>
--continue --max-workers=120 -Dorg.gradle.jvmargs=-Xms2g -Dorg.gradle.jvmargs=-Xmx4g :runners:google-cloud-dataflow-java:examples:java11PostCommit
Starting a Gradle Daemon (subsequent builds will be faster)
> Task :buildSrc:compileJava NO-SOURCE
> Task :buildSrc:compileGroovy FROM-CACHE
> Task :buildSrc:pluginDescriptors
> Task :buildSrc:processResources
> Task :buildSrc:classes
> Task :buildSrc:jar
> Task :buildSrc:assemble
> Task :buildSrc:spotlessGroovy
> Task :buildSrc:spotlessGroovyCheck
> Task :buildSrc:spotlessGroovyGradle
> Task :buildSrc:spotlessGroovyGradleCheck
> Task :buildSrc:spotlessCheck
> Task :buildSrc:pluginUnderTestMetadata
> Task :buildSrc:compileTestJava NO-SOURCE
> Task :buildSrc:compileTestGroovy NO-SOURCE
> Task :buildSrc:processTestResources NO-SOURCE
> Task :buildSrc:testClasses UP-TO-DATE
> Task :buildSrc:test NO-SOURCE
> Task :buildSrc:validateTaskProperties FROM-CACHE
> Task :buildSrc:check
> Task :buildSrc:build
Configuration on demand is an incubating feature.

> Configure project :sdks:java:container
Found go 1.12 in /usr/bin/go, use it.

> Task :runners:google-cloud-dataflow-java:worker:legacy-worker:processResources NO-SOURCE
> Task :runners:direct-java:processResources NO-SOURCE
> Task :runners:core-java:processResources NO-SOURCE
> Task :sdks:java:fn-execution:processResources NO-SOURCE
> Task :sdks:java:harness:processResources NO-SOURCE
> Task :vendor:sdks-java-extensions-protobuf:processResources NO-SOURCE
> Task :runners:core-construction-java:processResources NO-SOURCE
> Task :sdks:java:core:generateAvroProtocol NO-SOURCE
> Task :sdks:java:extensions:google-cloud-platform-core:processResources NO-SOURCE
> Task :runners:java-fn-execution:processResources NO-SOURCE
> Task :sdks:java:io:google-cloud-platform:processResources NO-SOURCE
> Task :sdks:java:core:generateAvroJava NO-SOURCE
> Task :runners:local-java:processResources NO-SOURCE
> Task :examples:java:processResources NO-SOURCE
> Task :runners:google-cloud-dataflow-java:examples:compileJava NO-SOURCE
> Task :runners:google-cloud-dataflow-java:examples:processResources NO-SOURCE
> Task :runners:google-cloud-dataflow-java:examples:classes UP-TO-DATE
> Task :runners:google-cloud-dataflow-java:examples:compileTestJava NO-SOURCE
> Task :runners:google-cloud-dataflow-java:examples:processTestResources NO-SOURCE
> Task :runners:google-cloud-dataflow-java:examples:testClasses UP-TO-DATE
> Task :examples:java:processTestResources
> Task :sdks:java:extensions:protobuf:extractProto
> Task :model:job-management:extractProto
> Task :model:fn-execution:extractProto
> Task :sdks:java:extensions:protobuf:processResources NO-SOURCE
> Task :sdks:java:core:generateGrammarSource FROM-CACHE
> Task :runners:google-cloud-dataflow-java:processResources
> Task :model:job-management:processResources
> Task :sdks:java:core:processResources
> Task :model:fn-execution:processResources
> Task :runners:google-cloud-dataflow-java:worker:windmill:extractIncludeProto
> Task :model:pipeline:extractIncludeProto
> Task :runners:google-cloud-dataflow-java:worker:windmill:extractProto
> Task :model:pipeline:extractProto
> Task :runners:google-cloud-dataflow-java:worker:windmill:generateProto
> Task :runners:google-cloud-dataflow-java:worker:windmill:compileJava FROM-CACHE
> Task :runners:google-cloud-dataflow-java:worker:windmill:processResources
> Task :runners:google-cloud-dataflow-java:worker:windmill:classes
> Task :model:pipeline:generateProto
> Task :model:pipeline:compileJava FROM-CACHE
> Task :model:pipeline:processResources
> Task :model:pipeline:classes
> Task :model:pipeline:jar
> Task :model:job-management:extractIncludeProto
> Task :model:fn-execution:extractIncludeProto
> Task :model:job-management:generateProto
> Task :model:fn-execution:generateProto
> Task :model:job-management:compileJava FROM-CACHE
> Task :model:job-management:classes
> Task :model:fn-execution:compileJava FROM-CACHE
> Task :model:fn-execution:classes
> Task :runners:google-cloud-dataflow-java:worker:windmill:shadowJar
> Task :model:pipeline:shadowJar
> Task :model:job-management:shadowJar
> Task :model:fn-execution:shadowJar
> Task :sdks:java:core:compileJava FROM-CACHE
> Task :sdks:java:core:classes
> Task :sdks:java:core:shadowJar
> Task :sdks:java:extensions:protobuf:extractIncludeProto
> Task :sdks:java:extensions:protobuf:generateProto NO-SOURCE
> Task :vendor:sdks-java-extensions-protobuf:compileJava FROM-CACHE
> Task :vendor:sdks-java-extensions-protobuf:classes UP-TO-DATE
> Task :runners:local-java:compileJava FROM-CACHE
> Task :runners:local-java:classes UP-TO-DATE
> Task :runners:local-java:jar
> Task :sdks:java:extensions:google-cloud-platform-core:compileJava FROM-CACHE
> Task :sdks:java:extensions:google-cloud-platform-core:classes UP-TO-DATE
> Task :runners:core-construction-java:compileJava FROM-CACHE
> Task :runners:core-construction-java:classes UP-TO-DATE
> Task :vendor:sdks-java-extensions-protobuf:shadowJar
> Task :sdks:java:extensions:google-cloud-platform-core:jar
> Task :sdks:java:fn-execution:compileJava FROM-CACHE
> Task :sdks:java:fn-execution:classes UP-TO-DATE
> Task :sdks:java:fn-execution:jar
> Task :runners:core-construction-java:jar
> Task :sdks:java:extensions:protobuf:compileJava FROM-CACHE
> Task :sdks:java:extensions:protobuf:classes UP-TO-DATE
> Task :sdks:java:extensions:protobuf:jar
> Task :runners:core-java:compileJava FROM-CACHE
> Task :runners:core-java:classes UP-TO-DATE
> Task :runners:core-java:jar
> Task :sdks:java:harness:compileJava FROM-CACHE
> Task :sdks:java:harness:classes UP-TO-DATE
> Task :sdks:java:io:google-cloud-platform:compileJava FROM-CACHE
> Task :sdks:java:io:google-cloud-platform:classes UP-TO-DATE
> Task :sdks:java:harness:jar
> Task :sdks:java:io:google-cloud-platform:jar
> Task :examples:java:compileJava FROM-CACHE
> Task :examples:java:classes UP-TO-DATE
> Task :runners:google-cloud-dataflow-java:compileJava FROM-CACHE
> Task :runners:google-cloud-dataflow-java:classes
> Task :examples:java:jar
> Task :runners:google-cloud-dataflow-java:jar
> Task :examples:java:compileTestJava FROM-CACHE
> Task :examples:java:testClasses
> Task :examples:java:testJar
> Task :sdks:java:harness:shadowJar
> Task :runners:java-fn-execution:compileJava FROM-CACHE
> Task :runners:java-fn-execution:classes UP-TO-DATE
> Task :runners:java-fn-execution:jar
> Task :runners:direct-java:compileJava FROM-CACHE
> Task :runners:direct-java:classes UP-TO-DATE
> Task :runners:google-cloud-dataflow-java:worker:legacy-worker:compileJava FROM-CACHE
> Task :runners:google-cloud-dataflow-java:worker:legacy-worker:classes UP-TO-DATE
> Task :runners:direct-java:shadowJar
> Task :runners:google-cloud-dataflow-java:worker:legacy-worker:shadowJar
> Task :runners:google-cloud-dataflow-java:examples:postCommitLegacyWorkerJava11

org.apache.beam.examples.WindowedWordCountIT > testWindowedWordCountInBatchStaticSharding
FAILED
    java.lang.RuntimeException at WindowedWordCountIT.java:188
        Caused by: com.google.api.client.googleapis.json.GoogleJsonResponseException at WindowedWordCountIT.java:188

org.apache.beam.examples.WindowedWordCountIT > testWindowedWordCountInBatchDynamicSharding
FAILED
    java.lang.RuntimeException at WindowedWordCountIT.java:188
        Caused by: com.google.api.client.googleapis.json.GoogleJsonResponseException at WindowedWordCountIT.java:188

4 tests completed, 2 failed

> Task :runners:google-cloud-dataflow-java:examples:postCommitLegacyWorkerJava11 FAILED

FAILURE: Build failed with an exception.

* What went wrong:
Execution failed for task ':runners:google-cloud-dataflow-java:examples:postCommitLegacyWorkerJava11'.
> There were failing tests. See the report at: file://<https://builds.apache.org/job/beam_PostCommit_Java11_Examples_Dataflow/ws/src/runners/google-cloud-dataflow-java/examples/build/reports/tests/postCommitLegacyWorkerJava11/index.html>

* Try:
Run with --stacktrace option to get the stack trace. Run with --info or --debug option to
get more log output. Run with --scan to get full insights.

* Get more help at https://help.gradle.org

Deprecated Gradle features were used in this build, making it incompatible with Gradle 6.0.
Use '--warning-mode all' to show the individual deprecation warnings.
See https://docs.gradle.org/5.2.1/userguide/command_line_interface.html#sec:command_line_warnings

BUILD FAILED in 6m 9s
65 actionable tasks: 44 executed, 21 from cache

Publishing build scan...
https://scans.gradle.com/s/w7pl5qewutbcq

Build step 'Invoke Gradle script' changed build result to FAILURE
Build step 'Invoke Gradle script' marked build as failure

---------------------------------------------------------------------
To unsubscribe, e-mail: builds-unsubscribe@beam.apache.org
For additional commands, e-mail: builds-help@beam.apache.org


Mime
View raw message